{
  "category_id": "string",
  "date": "string",
  "id": "string",
  "modified": "string",
  "name": "string",
  "parent_id": 8,
  "permissions": {},
  "records_count": "string",
  "zone_expire": "string",
  "zone_host": "string",
  "zone_mail": "string",
  "zone_minimum": "string",
  "zone_refresh": "string",
  "zone_retry": "string",
  "zone_serial": "string",
  "zone_ttl": "string",
  "zone_type": "string"
}