[
  {
    "HOSTNAME": "string",
    "IP": "string",
    "MAX_TIMESTAMP": 7,
    "MIN_TIMESTAMP": 6,
    "flows_allowed": 7,
    "flows_dropped": 6,
    "fromZone": "string",
    "nePk": "string",
    "policy_drop_bytes": 7,
    "policy_drop_pkts": 2,
    "routing_drop_bytes": 3,
    "routing_drop_pkts": 9,
    "rx_bytes": 4,
    "rx_pkts": 9,
    "toZone": "string",
    "tx_bytes": 4,
    "tx_pkts": 3
  }
]