{
  "<indexNumber>": {
    "appliances": [
      {
        "nePk": "string"
      },
      {
        "nePk": "string"
      },
      {
        "nePk": "string"
      },
      {
        "nePk": "string"
      },
      {
        "nePk": "string"
      },
      {
        "nePk": "string"
      },
      {
        "nePk": "string"
      },
      {
        "nePk": "string"
      }
    ],
    "mask": 5,
    "subnet": "string",
    "vlanStart": 6
  }
}