{
  "<Traffic Type>": {
    "<Traffic Class>": {
      "<nePk/IP>": {
        "HOSTNAME": "string",
        "IP": "string",
        "MAX_COMP_L2W": 3,
        "MAX_COMP_L2WMAX": 7,
        "MAX_COMP_NOOHEAD_L2W": 9,
        "MAX_COMP_NOOHEAD_L2WMAX": 6,
        "MAX_COMP_NOOHEAD_W2L": 10,
        "MAX_COMP_NOOHEAD_W2LMAX": 10,
        "MAX_COMP_W2L": 3,
        "MAX_COMP_W2LMAX": 5,
        "MAX_LRX_BYTES_MAX": 10,
        "MAX_LRX_PKTS_MAX": 3,
        "MAX_LTX_BYTES_MAX": 1,
        "MAX_LTX_PKTS_MAX": 1,
        "MAX_TIMESTAMP": 10,
        "MAX_WRX_BYTES_MAX": 4,
        "MAX_WRX_PKTS_MAX": 1,
        "MAX_WTX_BYTES_MAX": 1,
        "MAX_WTX_PKTS_MAX": 10,
        "MIN_TIMESTAMP": 9,
        "SUM_LRX_BYTES": 8,
        "SUM_LRX_PKTS": 8,
        "SUM_LTX_BYTES": 7,
        "SUM_LTX_PKTS": 3,
        "SUM_WRX_BYTES": 5,
        "SUM_WRX_PKTS": 9,
        "SUM_WTX_BYTES": 9,
        "SUM_WTX_PKTS": 7,
        "TRAFFIC_CLASS": 5,
        "TRAFFIC_TYPE": 7,
        "nePk": "string"
      }
    }
  }
}