{
  "bondingPolicy": 9,
  "boostTraffic": false,
  "brownoutThresholds": {
    "jitter": 6,
    "latency": 1,
    "loss": 2
  },
  "hubInternetPolicies": {
    "<nePk>": {
      "internetPolicy": {
        "localBreakout": {
          "backup": [
            "string",
            "string",
            "string",
            "string",
            "string"
          ],
          "primary": [
            "string",
            "string",
            "string",
            "string",
            "string",
            "string",
            "string"
          ]
        },
        "policyList": [
          "string",
          "string",
          "string",
          "string",
          "string",
          "string",
          "string",
          "string",
          "string"
        ]
      }
    }
  },
  "id": "string",
  "internetPolicy": {
    "localBreakout": {
      "backup": [
        "string",
        "string",
        "string",
        "string",
        "string",
        "string"
      ],
      "primary": [
        "string",
        "string",
        "string",
        "string",
        "string",
        "string"
      ]
    },
    "policyList": [
      "string",
      "string",
      "string",
      "string",
      "string",
      "string",
      "string"
    ]
  },
  "lanDscp": "string",
  "match": {
    "acl": "string",
    "interfaceLabel": "string",
    "overlayAcl": "string"
  },
  "name": "string",
  "overlayFallbackOption": 10,
  "topology": {
    "externalHubs": [
      "string",
      "string",
      "string",
      "string",
      "string",
      "string",
      "string",
      "string",
      "string",
      "string"
    ],
    "hubs": [
      "string",
      "string",
      "string",
      "string",
      "string",
      "string"
    ],
    "topologyType": 10,
    "useRegions": false
  },
  "trafficClass": "string",
  "tunnelUsagePolicy": "string",
  "useBackupOnBrownout": false,
  "wanDscp": "string",
  "wanPorts": {
    "backup": [
      "string",
      "string",
      "string",
      "string",
      "string",
      "string",
      "string",
      "string",
      "string"
    ],
    "crossConnect": [
      "string",
      "string"
    ],
    "primary": [
      "string",
      "string",
      "string",
      "string",
      "string",
      "string"
    ]
  }
}