[
  {
    "IP": "string",
    "applianceId": 10,
    "bypass": true,
    "discoveredFrom": 3,
    "dynamicUuid": "string",
    "groupId": "string",
    "hardwareRevision": "string",
    "hasUnsavedChanges": true,
    "hostName": "string",
    "id": "string",
    "ip": "string",
    "latitude": 6,
    "longitude": 1,
    "mode": "string",
    "model": "string",
    "nePk": "string",
    "networkRole": "string",
    "password": "string",
    "portalObjectId": "string",
    "reachabilityChannel": 5,
    "rebootRequired": true,
    "serial": "string",
    "site": "string",
    "sitePriority": 6,
    "softwareVersion": "string",
    "startupTime": 3,
    "state": 10,
    "systemBandwidth": 1,
    "userName": "string",
    "uuid": "string",
    "webProtocol": "string",
    "webProtocolType": 5
  },
  {
    "IP": "string",
    "applianceId": 7,
    "bypass": false,
    "discoveredFrom": 4,
    "dynamicUuid": "string",
    "groupId": "string",
    "hardwareRevision": "string",
    "hasUnsavedChanges": false,
    "hostName": "string",
    "id": "string",
    "ip": "string",
    "latitude": 9,
    "longitude": 4,
    "mode": "string",
    "model": "string",
    "nePk": "string",
    "networkRole": "string",
    "password": "string",
    "portalObjectId": "string",
    "reachabilityChannel": 4,
    "rebootRequired": true,
    "serial": "string",
    "site": "string",
    "sitePriority": 4,
    "softwareVersion": "string",
    "startupTime": 2,
    "state": 9,
    "systemBandwidth": 6,
    "userName": "string",
    "uuid": "string",
    "webProtocol": "string",
    "webProtocolType": 8
  },
  {
    "IP": "string",
    "applianceId": 9,
    "bypass": true,
    "discoveredFrom": 7,
    "dynamicUuid": "string",
    "groupId": "string",
    "hardwareRevision": "string",
    "hasUnsavedChanges": false,
    "hostName": "string",
    "id": "string",
    "ip": "string",
    "latitude": 5,
    "longitude": 1,
    "mode": "string",
    "model": "string",
    "nePk": "string",
    "networkRole": "string",
    "password": "string",
    "portalObjectId": "string",
    "reachabilityChannel": 1,
    "rebootRequired": true,
    "serial": "string",
    "site": "string",
    "sitePriority": 7,
    "softwareVersion": "string",
    "startupTime": 9,
    "state": 7,
    "systemBandwidth": 4,
    "userName": "string",
    "uuid": "string",
    "webProtocol": "string",
    "webProtocolType": 6
  }
]