[
  {
    "applianceId": "string",
    "hostname": "string",
    "licenseExpirationDate": 10,
    "licenseStartDate": 9,
    "licenseType": "string",
    "model": "string",
    "saasEnabled": false,
    "serialNum": "string"
  },
  {
    "applianceId": "string",
    "hostname": "string",
    "licenseExpirationDate": 9,
    "licenseStartDate": 6,
    "licenseType": "string",
    "model": "string",
    "saasEnabled": false,
    "serialNum": "string"
  },
  {
    "applianceId": "string",
    "hostname": "string",
    "licenseExpirationDate": 3,
    "licenseStartDate": 6,
    "licenseType": "string",
    "model": "string",
    "saasEnabled": true,
    "serialNum": "string"
  },
  {
    "applianceId": "string",
    "hostname": "string",
    "licenseExpirationDate": 6,
    "licenseStartDate": 8,
    "licenseType": "string",
    "model": "string",
    "saasEnabled": false,
    "serialNum": "string"
  }
]