{
  "$id": "schema.json",
  "type": "object",
  "schema": "http://json-schema.org/draft-07/schema#",
  "translate": true,
  "dynamicfields": true,
  "properties": {
    "ph_request_type": {
      "type": "string",
      "description": "type of request (internal to adapter)",
      "default": "tunnelExceptionDelete",
      "enum": [
        "tunnelExceptionDelete",
        "tunnelExceptionGet",
        "tunnelExceptionPost",
        "tunnelExceptionPut",
        "tunnelExceptionSingleDelete",
        "tunnelExceptionSingleUpdate"
      ],
      "external_name": "ph_request_type"
    },
    "requestBody": {
      "description": "Tunnel exception entry",
      "parse": false,
      "encode": false,
      "encrypt": {
        "type": "AES",
        "key": ""
      },
      "external_name": "Request Body"
    }
  },
  "definitions": {}
}