{
  "license": {
    "boost": {
      "bandwidth": 9,
      "enable": false
    },
    "mini": {
      "enable": false
    },
    "plus": {
      "enable": true
    },
    "tier": {
      "bandwidth": 7,
      "display": "string"
    }
  }
}