[
  {
    "backgroundImage": "string",
    "id": "string",
    "name": "string",
    "parentId": "string",
    "subType": 3
  },
  {
    "backgroundImage": "string",
    "id": "string",
    "name": "string",
    "parentId": "string",
    "subType": 3
  },
  {
    "backgroundImage": "string",
    "id": "string",
    "name": "string",
    "parentId": "string",
    "subType": 9
  }
]