{
  "autoReclassifyValues": 5,
  "enable": false,
  "enableAutoSaveOnVXOA": true,
  "enableTemplateApply": true,
  "ipsecPresharedKey": "string",
  "overlayPaused": true,
  "pollingInterval": 4,
  "resetAllFlows": true,
  "settings": {
    "<Wan Label Id>": {
      "admin": "string",
      "authenticationAlgorithm": "string",
      "autoMaxBandwidthEnabled": false,
      "autoMtu": false,
      "dhgroup": "string",
      "dpdDelay": 3,
      "dpdRetry": 6,
      "dscp": "string",
      "encryptionAlgorithm": "string",
      "exchangeMode": "string",
      "fastfailWaitBase": 7,
      "fastfailWaitRtt": 7,
      "fecMaxRatio": 3,
      "fecMinRatio": 3,
      "idStr": "string",
      "idType": "string",
      "ikeAuthenticationAlgorithm": "string",
      "ikeEncryptionAlgorithm": "string",
      "ikeLifetime": 9,
      "ipsecAntiReplayWindow": "string",
      "jitter": 7,
      "latency": 1,
      "lifebytes": 4,
      "lifetime": 6,
      "lossVal": 1,
      "mode": "string",
      "mtu": 2,
      "pfs": true,
      "pfsgroup": "string",
      "reorderWait": 7,
      "retryCount": 4,
      "selectedFastfail": 10,
      "selectedFec": "string",
      "udpDestinationPort": 7,
      "udpFlows": 8
    }
  },
  "tunnelMode": "ipsec"
}