{
  "<Traffic Type>": {
    "<Flow Type>": {
      "<nePk/IP>": {
        "FLOW_TYPE": 4,
        "HOSTNAME": "string",
        "IP": "string",
        "MAX_COMP_L2W": 9,
        "MAX_COMP_L2WMAX": 5,
        "MAX_COMP_NOOHEAD_L2W": 2,
        "MAX_COMP_NOOHEAD_L2WMAX": 6,
        "MAX_COMP_NOOHEAD_W2L": 7,
        "MAX_COMP_NOOHEAD_W2LMAX": 5,
        "MAX_COMP_W2L": 5,
        "MAX_COMP_W2LMAX": 5,
        "MAX_CREATED_MAX": 5,
        "MAX_DELETED_MAX": 2,
        "MAX_FLOW_EXT_PEAK": 8,
        "MAX_FLOW_MAX": 7,
        "MAX_FLOW_PEAK": 4,
        "MAX_LRX_BYTES_MAX": 6,
        "MAX_LRX_PKTS_MAX": 6,
        "MAX_LTX_BYTES_MAX": 7,
        "MAX_LTX_PKTS_MAX": 9,
        "MAX_TIMESTAMP": 4,
        "MAX_WRX_BYTES_MAX": 9,
        "MAX_WRX_PKTS_MAX": 1,
        "MAX_WTX_BYTES_MAX": 5,
        "MAX_WTX_PKTS_MAX": 6,
        "MIN_TIMESTAMP": 1,
        "SUM_CREATED": 5,
        "SUM_DELETED": 7,
        "SUM_EXT": 9,
        "SUM_LRX_BYTES": 10,
        "SUM_LRX_PKTS": 1,
        "SUM_LTX_BYTES": 3,
        "SUM_LTX_PKTS": 7,
        "SUM_WRX_BYTES": 9,
        "SUM_WRX_PKTS": 2,
        "SUM_WTX_BYTES": 9,
        "SUM_WTX_PKTS": 10,
        "TRAFFIC_TYPE": 1,
        "nePk": "string"
      }
    }
  }
}