{
  "<Traffic Type>": {
    "<DSCP>": {
      "<nePk/IP>": {
        "DSCP": 3,
        "HOSTNAME": "string",
        "IP": "string",
        "MAX_COMP_L2W": 4,
        "MAX_COMP_L2WMAX": 8,
        "MAX_COMP_NOOHEAD_L2W": 7,
        "MAX_COMP_NOOHEAD_L2WMAX": 8,
        "MAX_COMP_NOOHEAD_W2L": 6,
        "MAX_COMP_NOOHEAD_W2LMAX": 8,
        "MAX_COMP_W2L": 7,
        "MAX_COMP_W2LMAX": 6,
        "MAX_LRX_BYTES_MAX": 3,
        "MAX_LRX_PKTS_MAX": 10,
        "MAX_LTX_BYTES_MAX": 3,
        "MAX_LTX_PKTS_MAX": 1,
        "MAX_TIMESTAMP": 3,
        "MAX_WRX_BYTES_MAX": 5,
        "MAX_WRX_PKTS_MAX": 9,
        "MAX_WTX_BYTES_MAX": 7,
        "MAX_WTX_PKTS_MAX": 3,
        "MIN_TIMESTAMP": 8,
        "SUM_LRX_BYTES": 2,
        "SUM_LRX_PKTS": 5,
        "SUM_LTX_BYTES": 7,
        "SUM_LTX_PKTS": 1,
        "SUM_WRX_BYTES": 1,
        "SUM_WRX_PKTS": 1,
        "SUM_WTX_BYTES": 5,
        "SUM_WTX_PKTS": 8,
        "TRAFFIC_TYPE": 3,
        "nePk": "string"
      }
    }
  }
}