{
  "column_def": [
    "string",
    "string",
    "string",
    "string",
    "string",
    "string"
  ],
  "data": {
    "<nePk/IP>": [
      {
        "BW_PCT_UTIL_AVG": 8,
        "BW_PCT_UTIL_MAX": 6,
        "BW_PCT_UTIL_MAX_TS": 4,
        "COMP_L2W": 2,
        "COMP_L2WMAX": 5,
        "COMP_L2WMAX_TS": 1,
        "COMP_NOOHEAD_L2W": 6,
        "COMP_NOOHEAD_L2WMAX": 10,
        "COMP_NOOHEAD_L2WMAX_TS": 10,
        "COMP_NOOHEAD_W2L": 1,
        "COMP_NOOHEAD_W2LMAX": 2,
        "COMP_NOOHEAD_W2LMAX_TS": 4,
        "COMP_W2L": 8,
        "COMP_W2LMAX": 5,
        "COMP_W2LMAX_TS": 10,
        "CREATED": 7,
        "CREATED_MAX": 1,
        "CREATED_MAX_TS": 7,
        "DELETED": 9,
        "DELETED_MAX": 8,
        "DELETED_MAX_TS": 6,
        "LATENCY_AVG": 1,
        "LATENCY_MAX": 6,
        "LATENCY_MAX_TS": 1,
        "LATENCY_MIN": 7,
        "LATENCY_MIN_FROM_PEAK": 1,
        "LATENCY_MIN_TS": 3,
        "LRX_BYTES": 10,
        "LRX_BYTES_MAX": 6,
        "LRX_BYTES_MAX_TS": 9,
        "LRX_PKTS": 1,
        "LRX_PKTS_MAX": 2,
        "LRX_PKTS_MAX_TS": 3,
        "LTX_BYTES": 2,
        "LTX_BYTES_MAX": 1,
        "LTX_BYTES_MAX_TS": 8,
        "LTX_PKTS": 2,
        "LTX_PKTS_MAX": 3,
        "LTX_PKTS_MAX_TS": 2,
        "NON_TCP_FLOWS": 4,
        "NON_TCP_FLOWS_MAX": 4,
        "NON_TCP_FLOWS_MAX_TS": 6,
        "OHEAD_WRX_BYTES": 4,
        "OHEAD_WRX_BYTES_MAX": 7,
        "OHEAD_WRX_BYTES_MAX_TS": 2,
        "OHEAD_WRX_HDR_BYTES": 10,
        "OHEAD_WRX_HDR_BYTES_MAX": 6,
        "OHEAD_WRX_HDR_BYTES_MAX_TS": 4,
        "OHEAD_WRX_PKTS": 5,
        "OHEAD_WRX_PKTS_MAX": 7,
        "OHEAD_WRX_PKTS_MAX_TS": 8,
        "OHEAD_WTX_BYTES": 8,
        "OHEAD_WTX_BYTES_MAX": 3,
        "OHEAD_WTX_BYTES_MAX_TS": 8,
        "OHEAD_WTX_HDR_BYTES": 7,
        "OHEAD_WTX_HDR_BYTES_MAX": 9,
        "OHEAD_WTX_HDR_BYTES_MAX_TS": 7,
        "OHEAD_WTX_PKTS": 4,
        "OHEAD_WTX_PKTS_MAX": 5,
        "OHEAD_WTX_PKTS_MAX_TS": 6,
        "POST_LOSS": 3,
        "POST_LOSS_MAX": 1,
        "POST_LOSS_MAX_TS": 1,
        "POST_PCT_LOSS": 2,
        "POST_PCT_LOSS_MAX": 5,
        "POST_PCT_LOSS_MAX_TS": 4,
        "POST_PCT_POC": 3,
        "POST_PCT_POCMAX": 2,
        "POST_PCT_POCMAX_TS": 10,
        "POST_POC": 2,
        "POST_POCMAX": 8,
        "POST_POCMAX_TS": 9,
        "PRE_LOSS": 5,
        "PRE_LOSS_MAX": 8,
        "PRE_LOSS_MAX_TS": 9,
        "PRE_PCT_LOSS": 2,
        "PRE_PCT_LOSS_MAX": 3,
        "PRE_PCT_LOSS_MAX_TS": 4,
        "PRE_PCT_POC": 10,
        "PRE_PCT_POCMAX": 8,
        "PRE_PCT_POCMAX_TS": 2,
        "PRE_POC": 3,
        "PRE_POCMAX": 7,
        "PRE_POCMAX_TS": 4,
        "TCP_ACC_FLOWS": 7,
        "TCP_ACC_FLOWS_MAX": 4,
        "TCP_ACC_FLOWS_MAX_TS": 8,
        "TCP_FLOWS": 1,
        "TCP_FLOWS_MAX": 8,
        "TCP_FLOWS_MAX_TS": 9,
        "TIMESTAMP": 5,
        "WRX_BYTES": 4,
        "WRX_BYTES_MAX": 8,
        "WRX_BYTES_MAX_TS": 9,
        "WRX_PKTS": 8,
        "WRX_PKTS_MAX": 9,
        "WRX_PKTS_MAX_TS": 1,
        "WTX_BYTES": 3,
        "WTX_BYTES_MAX": 4,
        "WTX_BYTES_MAX_TS": 6,
        "WTX_PKTS": 1,
        "WTX_PKTS_MAX": 9,
        "WTX_PKTS_MAX_TS": 10
      },
      {
        "BW_PCT_UTIL_AVG": 4,
        "BW_PCT_UTIL_MAX": 1,
        "BW_PCT_UTIL_MAX_TS": 2,
        "COMP_L2W": 4,
        "COMP_L2WMAX": 8,
        "COMP_L2WMAX_TS": 7,
        "COMP_NOOHEAD_L2W": 2,
        "COMP_NOOHEAD_L2WMAX": 5,
        "COMP_NOOHEAD_L2WMAX_TS": 3,
        "COMP_NOOHEAD_W2L": 4,
        "COMP_NOOHEAD_W2LMAX": 9,
        "COMP_NOOHEAD_W2LMAX_TS": 1,
        "COMP_W2L": 6,
        "COMP_W2LMAX": 7,
        "COMP_W2LMAX_TS": 3,
        "CREATED": 9,
        "CREATED_MAX": 6,
        "CREATED_MAX_TS": 2,
        "DELETED": 3,
        "DELETED_MAX": 2,
        "DELETED_MAX_TS": 1,
        "LATENCY_AVG": 1,
        "LATENCY_MAX": 1,
        "LATENCY_MAX_TS": 6,
        "LATENCY_MIN": 7,
        "LATENCY_MIN_FROM_PEAK": 4,
        "LATENCY_MIN_TS": 5,
        "LRX_BYTES": 10,
        "LRX_BYTES_MAX": 6,
        "LRX_BYTES_MAX_TS": 5,
        "LRX_PKTS": 6,
        "LRX_PKTS_MAX": 8,
        "LRX_PKTS_MAX_TS": 1,
        "LTX_BYTES": 2,
        "LTX_BYTES_MAX": 7,
        "LTX_BYTES_MAX_TS": 3,
        "LTX_PKTS": 4,
        "LTX_PKTS_MAX": 10,
        "LTX_PKTS_MAX_TS": 7,
        "NON_TCP_FLOWS": 7,
        "NON_TCP_FLOWS_MAX": 8,
        "NON_TCP_FLOWS_MAX_TS": 2,
        "OHEAD_WRX_BYTES": 5,
        "OHEAD_WRX_BYTES_MAX": 6,
        "OHEAD_WRX_BYTES_MAX_TS": 10,
        "OHEAD_WRX_HDR_BYTES": 7,
        "OHEAD_WRX_HDR_BYTES_MAX": 8,
        "OHEAD_WRX_HDR_BYTES_MAX_TS": 2,
        "OHEAD_WRX_PKTS": 9,
        "OHEAD_WRX_PKTS_MAX": 4,
        "OHEAD_WRX_PKTS_MAX_TS": 4,
        "OHEAD_WTX_BYTES": 5,
        "OHEAD_WTX_BYTES_MAX": 1,
        "OHEAD_WTX_BYTES_MAX_TS": 6,
        "OHEAD_WTX_HDR_BYTES": 3,
        "OHEAD_WTX_HDR_BYTES_MAX": 5,
        "OHEAD_WTX_HDR_BYTES_MAX_TS": 9,
        "OHEAD_WTX_PKTS": 1,
        "OHEAD_WTX_PKTS_MAX": 5,
        "OHEAD_WTX_PKTS_MAX_TS": 7,
        "POST_LOSS": 10,
        "POST_LOSS_MAX": 3,
        "POST_LOSS_MAX_TS": 5,
        "POST_PCT_LOSS": 4,
        "POST_PCT_LOSS_MAX": 10,
        "POST_PCT_LOSS_MAX_TS": 7,
        "POST_PCT_POC": 6,
        "POST_PCT_POCMAX": 7,
        "POST_PCT_POCMAX_TS": 8,
        "POST_POC": 4,
        "POST_POCMAX": 7,
        "POST_POCMAX_TS": 6,
        "PRE_LOSS": 1,
        "PRE_LOSS_MAX": 3,
        "PRE_LOSS_MAX_TS": 4,
        "PRE_PCT_LOSS": 9,
        "PRE_PCT_LOSS_MAX": 1,
        "PRE_PCT_LOSS_MAX_TS": 3,
        "PRE_PCT_POC": 8,
        "PRE_PCT_POCMAX": 8,
        "PRE_PCT_POCMAX_TS": 1,
        "PRE_POC": 3,
        "PRE_POCMAX": 6,
        "PRE_POCMAX_TS": 6,
        "TCP_ACC_FLOWS": 1,
        "TCP_ACC_FLOWS_MAX": 7,
        "TCP_ACC_FLOWS_MAX_TS": 2,
        "TCP_FLOWS": 8,
        "TCP_FLOWS_MAX": 2,
        "TCP_FLOWS_MAX_TS": 5,
        "TIMESTAMP": 8,
        "WRX_BYTES": 5,
        "WRX_BYTES_MAX": 2,
        "WRX_BYTES_MAX_TS": 7,
        "WRX_PKTS": 3,
        "WRX_PKTS_MAX": 1,
        "WRX_PKTS_MAX_TS": 7,
        "WTX_BYTES": 1,
        "WTX_BYTES_MAX": 5,
        "WTX_BYTES_MAX_TS": 10,
        "WTX_PKTS": 1,
        "WTX_PKTS_MAX": 6,
        "WTX_PKTS_MAX_TS": 4
      },
      {
        "BW_PCT_UTIL_AVG": 1,
        "BW_PCT_UTIL_MAX": 8,
        "BW_PCT_UTIL_MAX_TS": 3,
        "COMP_L2W": 2,
        "COMP_L2WMAX": 8,
        "COMP_L2WMAX_TS": 6,
        "COMP_NOOHEAD_L2W": 10,
        "COMP_NOOHEAD_L2WMAX": 3,
        "COMP_NOOHEAD_L2WMAX_TS": 9,
        "COMP_NOOHEAD_W2L": 8,
        "COMP_NOOHEAD_W2LMAX": 7,
        "COMP_NOOHEAD_W2LMAX_TS": 3,
        "COMP_W2L": 6,
        "COMP_W2LMAX": 2,
        "COMP_W2LMAX_TS": 2,
        "CREATED": 5,
        "CREATED_MAX": 9,
        "CREATED_MAX_TS": 10,
        "DELETED": 8,
        "DELETED_MAX": 8,
        "DELETED_MAX_TS": 4,
        "LATENCY_AVG": 6,
        "LATENCY_MAX": 8,
        "LATENCY_MAX_TS": 2,
        "LATENCY_MIN": 8,
        "LATENCY_MIN_FROM_PEAK": 3,
        "LATENCY_MIN_TS": 9,
        "LRX_BYTES": 9,
        "LRX_BYTES_MAX": 8,
        "LRX_BYTES_MAX_TS": 2,
        "LRX_PKTS": 3,
        "LRX_PKTS_MAX": 2,
        "LRX_PKTS_MAX_TS": 6,
        "LTX_BYTES": 7,
        "LTX_BYTES_MAX": 9,
        "LTX_BYTES_MAX_TS": 4,
        "LTX_PKTS": 4,
        "LTX_PKTS_MAX": 7,
        "LTX_PKTS_MAX_TS": 10,
        "NON_TCP_FLOWS": 8,
        "NON_TCP_FLOWS_MAX": 3,
        "NON_TCP_FLOWS_MAX_TS": 6,
        "OHEAD_WRX_BYTES": 3,
        "OHEAD_WRX_BYTES_MAX": 2,
        "OHEAD_WRX_BYTES_MAX_TS": 3,
        "OHEAD_WRX_HDR_BYTES": 10,
        "OHEAD_WRX_HDR_BYTES_MAX": 5,
        "OHEAD_WRX_HDR_BYTES_MAX_TS": 8,
        "OHEAD_WRX_PKTS": 7,
        "OHEAD_WRX_PKTS_MAX": 2,
        "OHEAD_WRX_PKTS_MAX_TS": 4,
        "OHEAD_WTX_BYTES": 9,
        "OHEAD_WTX_BYTES_MAX": 1,
        "OHEAD_WTX_BYTES_MAX_TS": 4,
        "OHEAD_WTX_HDR_BYTES": 8,
        "OHEAD_WTX_HDR_BYTES_MAX": 8,
        "OHEAD_WTX_HDR_BYTES_MAX_TS": 3,
        "OHEAD_WTX_PKTS": 8,
        "OHEAD_WTX_PKTS_MAX": 5,
        "OHEAD_WTX_PKTS_MAX_TS": 4,
        "POST_LOSS": 9,
        "POST_LOSS_MAX": 9,
        "POST_LOSS_MAX_TS": 6,
        "POST_PCT_LOSS": 4,
        "POST_PCT_LOSS_MAX": 5,
        "POST_PCT_LOSS_MAX_TS": 9,
        "POST_PCT_POC": 7,
        "POST_PCT_POCMAX": 2,
        "POST_PCT_POCMAX_TS": 9,
        "POST_POC": 7,
        "POST_POCMAX": 4,
        "POST_POCMAX_TS": 9,
        "PRE_LOSS": 4,
        "PRE_LOSS_MAX": 2,
        "PRE_LOSS_MAX_TS": 4,
        "PRE_PCT_LOSS": 6,
        "PRE_PCT_LOSS_MAX": 10,
        "PRE_PCT_LOSS_MAX_TS": 9,
        "PRE_PCT_POC": 6,
        "PRE_PCT_POCMAX": 2,
        "PRE_PCT_POCMAX_TS": 8,
        "PRE_POC": 3,
        "PRE_POCMAX": 4,
        "PRE_POCMAX_TS": 4,
        "TCP_ACC_FLOWS": 9,
        "TCP_ACC_FLOWS_MAX": 10,
        "TCP_ACC_FLOWS_MAX_TS": 4,
        "TCP_FLOWS": 5,
        "TCP_FLOWS_MAX": 10,
        "TCP_FLOWS_MAX_TS": 1,
        "TIMESTAMP": 7,
        "WRX_BYTES": 5,
        "WRX_BYTES_MAX": 2,
        "WRX_BYTES_MAX_TS": 7,
        "WRX_PKTS": 7,
        "WRX_PKTS_MAX": 8,
        "WRX_PKTS_MAX_TS": 4,
        "WTX_BYTES": 9,
        "WTX_BYTES_MAX": 4,
        "WTX_BYTES_MAX_TS": 4,
        "WTX_PKTS": 3,
        "WTX_PKTS_MAX": 7,
        "WTX_PKTS_MAX_TS": 4
      },
      {
        "BW_PCT_UTIL_AVG": 1,
        "BW_PCT_UTIL_MAX": 4,
        "BW_PCT_UTIL_MAX_TS": 9,
        "COMP_L2W": 2,
        "COMP_L2WMAX": 3,
        "COMP_L2WMAX_TS": 10,
        "COMP_NOOHEAD_L2W": 6,
        "COMP_NOOHEAD_L2WMAX": 10,
        "COMP_NOOHEAD_L2WMAX_TS": 3,
        "COMP_NOOHEAD_W2L": 8,
        "COMP_NOOHEAD_W2LMAX": 5,
        "COMP_NOOHEAD_W2LMAX_TS": 7,
        "COMP_W2L": 4,
        "COMP_W2LMAX": 6,
        "COMP_W2LMAX_TS": 1,
        "CREATED": 8,
        "CREATED_MAX": 5,
        "CREATED_MAX_TS": 7,
        "DELETED": 5,
        "DELETED_MAX": 5,
        "DELETED_MAX_TS": 9,
        "LATENCY_AVG": 5,
        "LATENCY_MAX": 9,
        "LATENCY_MAX_TS": 2,
        "LATENCY_MIN": 8,
        "LATENCY_MIN_FROM_PEAK": 2,
        "LATENCY_MIN_TS": 1,
        "LRX_BYTES": 1,
        "LRX_BYTES_MAX": 10,
        "LRX_BYTES_MAX_TS": 2,
        "LRX_PKTS": 3,
        "LRX_PKTS_MAX": 3,
        "LRX_PKTS_MAX_TS": 8,
        "LTX_BYTES": 2,
        "LTX_BYTES_MAX": 6,
        "LTX_BYTES_MAX_TS": 7,
        "LTX_PKTS": 3,
        "LTX_PKTS_MAX": 10,
        "LTX_PKTS_MAX_TS": 10,
        "NON_TCP_FLOWS": 9,
        "NON_TCP_FLOWS_MAX": 5,
        "NON_TCP_FLOWS_MAX_TS": 7,
        "OHEAD_WRX_BYTES": 6,
        "OHEAD_WRX_BYTES_MAX": 8,
        "OHEAD_WRX_BYTES_MAX_TS": 6,
        "OHEAD_WRX_HDR_BYTES": 2,
        "OHEAD_WRX_HDR_BYTES_MAX": 8,
        "OHEAD_WRX_HDR_BYTES_MAX_TS": 4,
        "OHEAD_WRX_PKTS": 2,
        "OHEAD_WRX_PKTS_MAX": 2,
        "OHEAD_WRX_PKTS_MAX_TS": 5,
        "OHEAD_WTX_BYTES": 4,
        "OHEAD_WTX_BYTES_MAX": 2,
        "OHEAD_WTX_BYTES_MAX_TS": 10,
        "OHEAD_WTX_HDR_BYTES": 4,
        "OHEAD_WTX_HDR_BYTES_MAX": 3,
        "OHEAD_WTX_HDR_BYTES_MAX_TS": 9,
        "OHEAD_WTX_PKTS": 6,
        "OHEAD_WTX_PKTS_MAX": 9,
        "OHEAD_WTX_PKTS_MAX_TS": 6,
        "POST_LOSS": 7,
        "POST_LOSS_MAX": 4,
        "POST_LOSS_MAX_TS": 9,
        "POST_PCT_LOSS": 5,
        "POST_PCT_LOSS_MAX": 6,
        "POST_PCT_LOSS_MAX_TS": 7,
        "POST_PCT_POC": 9,
        "POST_PCT_POCMAX": 8,
        "POST_PCT_POCMAX_TS": 4,
        "POST_POC": 5,
        "POST_POCMAX": 8,
        "POST_POCMAX_TS": 2,
        "PRE_LOSS": 4,
        "PRE_LOSS_MAX": 1,
        "PRE_LOSS_MAX_TS": 4,
        "PRE_PCT_LOSS": 2,
        "PRE_PCT_LOSS_MAX": 9,
        "PRE_PCT_LOSS_MAX_TS": 7,
        "PRE_PCT_POC": 6,
        "PRE_PCT_POCMAX": 6,
        "PRE_PCT_POCMAX_TS": 10,
        "PRE_POC": 3,
        "PRE_POCMAX": 6,
        "PRE_POCMAX_TS": 9,
        "TCP_ACC_FLOWS": 1,
        "TCP_ACC_FLOWS_MAX": 2,
        "TCP_ACC_FLOWS_MAX_TS": 7,
        "TCP_FLOWS": 10,
        "TCP_FLOWS_MAX": 7,
        "TCP_FLOWS_MAX_TS": 10,
        "TIMESTAMP": 7,
        "WRX_BYTES": 5,
        "WRX_BYTES_MAX": 5,
        "WRX_BYTES_MAX_TS": 7,
        "WRX_PKTS": 4,
        "WRX_PKTS_MAX": 4,
        "WRX_PKTS_MAX_TS": 10,
        "WTX_BYTES": 8,
        "WTX_BYTES_MAX": 3,
        "WTX_BYTES_MAX_TS": 1,
        "WTX_PKTS": 3,
        "WTX_PKTS_MAX": 4,
        "WTX_PKTS_MAX_TS": 7
      },
      {
        "BW_PCT_UTIL_AVG": 1,
        "BW_PCT_UTIL_MAX": 8,
        "BW_PCT_UTIL_MAX_TS": 6,
        "COMP_L2W": 6,
        "COMP_L2WMAX": 5,
        "COMP_L2WMAX_TS": 2,
        "COMP_NOOHEAD_L2W": 9,
        "COMP_NOOHEAD_L2WMAX": 2,
        "COMP_NOOHEAD_L2WMAX_TS": 7,
        "COMP_NOOHEAD_W2L": 5,
        "COMP_NOOHEAD_W2LMAX": 1,
        "COMP_NOOHEAD_W2LMAX_TS": 2,
        "COMP_W2L": 8,
        "COMP_W2LMAX": 7,
        "COMP_W2LMAX_TS": 5,
        "CREATED": 1,
        "CREATED_MAX": 5,
        "CREATED_MAX_TS": 4,
        "DELETED": 9,
        "DELETED_MAX": 6,
        "DELETED_MAX_TS": 4,
        "LATENCY_AVG": 6,
        "LATENCY_MAX": 4,
        "LATENCY_MAX_TS": 6,
        "LATENCY_MIN": 3,
        "LATENCY_MIN_FROM_PEAK": 4,
        "LATENCY_MIN_TS": 5,
        "LRX_BYTES": 4,
        "LRX_BYTES_MAX": 4,
        "LRX_BYTES_MAX_TS": 1,
        "LRX_PKTS": 7,
        "LRX_PKTS_MAX": 6,
        "LRX_PKTS_MAX_TS": 4,
        "LTX_BYTES": 4,
        "LTX_BYTES_MAX": 1,
        "LTX_BYTES_MAX_TS": 2,
        "LTX_PKTS": 9,
        "LTX_PKTS_MAX": 3,
        "LTX_PKTS_MAX_TS": 7,
        "NON_TCP_FLOWS": 4,
        "NON_TCP_FLOWS_MAX": 4,
        "NON_TCP_FLOWS_MAX_TS": 6,
        "OHEAD_WRX_BYTES": 8,
        "OHEAD_WRX_BYTES_MAX": 3,
        "OHEAD_WRX_BYTES_MAX_TS": 8,
        "OHEAD_WRX_HDR_BYTES": 9,
        "OHEAD_WRX_HDR_BYTES_MAX": 10,
        "OHEAD_WRX_HDR_BYTES_MAX_TS": 3,
        "OHEAD_WRX_PKTS": 4,
        "OHEAD_WRX_PKTS_MAX": 7,
        "OHEAD_WRX_PKTS_MAX_TS": 10,
        "OHEAD_WTX_BYTES": 3,
        "OHEAD_WTX_BYTES_MAX": 10,
        "OHEAD_WTX_BYTES_MAX_TS": 7,
        "OHEAD_WTX_HDR_BYTES": 6,
        "OHEAD_WTX_HDR_BYTES_MAX": 10,
        "OHEAD_WTX_HDR_BYTES_MAX_TS": 1,
        "OHEAD_WTX_PKTS": 2,
        "OHEAD_WTX_PKTS_MAX": 8,
        "OHEAD_WTX_PKTS_MAX_TS": 1,
        "POST_LOSS": 9,
        "POST_LOSS_MAX": 9,
        "POST_LOSS_MAX_TS": 1,
        "POST_PCT_LOSS": 10,
        "POST_PCT_LOSS_MAX": 1,
        "POST_PCT_LOSS_MAX_TS": 3,
        "POST_PCT_POC": 6,
        "POST_PCT_POCMAX": 7,
        "POST_PCT_POCMAX_TS": 6,
        "POST_POC": 6,
        "POST_POCMAX": 10,
        "POST_POCMAX_TS": 7,
        "PRE_LOSS": 2,
        "PRE_LOSS_MAX": 9,
        "PRE_LOSS_MAX_TS": 2,
        "PRE_PCT_LOSS": 3,
        "PRE_PCT_LOSS_MAX": 7,
        "PRE_PCT_LOSS_MAX_TS": 9,
        "PRE_PCT_POC": 8,
        "PRE_PCT_POCMAX": 7,
        "PRE_PCT_POCMAX_TS": 3,
        "PRE_POC": 7,
        "PRE_POCMAX": 1,
        "PRE_POCMAX_TS": 10,
        "TCP_ACC_FLOWS": 6,
        "TCP_ACC_FLOWS_MAX": 3,
        "TCP_ACC_FLOWS_MAX_TS": 2,
        "TCP_FLOWS": 2,
        "TCP_FLOWS_MAX": 2,
        "TCP_FLOWS_MAX_TS": 5,
        "TIMESTAMP": 8,
        "WRX_BYTES": 2,
        "WRX_BYTES_MAX": 1,
        "WRX_BYTES_MAX_TS": 4,
        "WRX_PKTS": 2,
        "WRX_PKTS_MAX": 8,
        "WRX_PKTS_MAX_TS": 4,
        "WTX_BYTES": 4,
        "WTX_BYTES_MAX": 7,
        "WTX_BYTES_MAX_TS": 4,
        "WTX_PKTS": 4,
        "WTX_PKTS_MAX": 6,
        "WTX_PKTS_MAX_TS": 4
      }
    ]
  }
}