{
  "<tunnel name>": {
    "auto_mtu": 5,
    "config_bin": "string",
    "cur_max_bw": "string",
    "cur_min_bw": "string",
    "cur_mtu": "string",
    "cur_set_max_bw": "string",
    "details": "string",
    "encap": "string",
    "encap_brief": "string",
    "ipsec_debug": "string",
    "ipsec_health": "string",
    "ipsec_sas": "string",
    "ipsec_stats": "string",
    "num_ipsec_sas": "string",
    "oper": "string",
    "pkt": {
      "cur_fec_enable": "string",
      "cur_fec_reset_intvl": "string"
    },
    "qos_stats": "string",
    "quiescence": true,
    "refunk": false,
    "rem_sys_bw": "string",
    "remote_id": 3,
    "self": "string",
    "state_bin": "string",
    "uptime": 3
  }
}