{
  "actions": [
    {
      "name": "getNeighbor",
      "protocol": "REST",
      "method": "GET",
      "entitypath": "{base_path}/{version}/bgp/config/neighbor/{pathv1}?{query}",
      "requestSchema": "schema.json",
      "responseSchema": "schema.json",
      "timeout": 0,
      "sendEmpty": false,
      "sendGetBody": false,
      "requestDatatype": "JSON",
      "responseDatatype": "JSON",
      "headers": {},
      "responseObjects": [
        {
          "type": "default",
          "key": "",
          "mockFile": "mockdatafiles/getNeighbor-default.json"
        }
      ]
    },
    {
      "name": "getBGPSystemConfig",
      "protocol": "REST",
      "method": "GET",
      "entitypath": "{base_path}/{version}/bgp/config/system/{pathv1}?{query}",
      "requestSchema": "schema.json",
      "responseSchema": "schema.json",
      "timeout": 0,
      "sendEmpty": false,
      "sendGetBody": false,
      "requestDatatype": "JSON",
      "responseDatatype": "JSON",
      "headers": {},
      "responseObjects": [
        {
          "type": "default",
          "key": "",
          "mockFile": "mockdatafiles/getBGPSystemConfig-default.json"
        }
      ]
    },
    {
      "name": "bGPState",
      "protocol": "REST",
      "method": "GET",
      "entitypath": "{base_path}/{version}/bgp/state/{pathv1}?{query}",
      "requestSchema": "schema.json",
      "responseSchema": "schema.json",
      "timeout": 0,
      "sendEmpty": false,
      "sendGetBody": false,
      "requestDatatype": "JSON",
      "responseDatatype": "JSON",
      "headers": {},
      "responseObjects": [
        {
          "type": "default",
          "key": "",
          "mockFile": "mockdatafiles/bGPState-default.json"
        }
      ]
    }
  ]
}