{
  "moduleInfo": {
    "last change": "string",
    "last peer index": "string",
    "last time": "string",
    "last tx msg count": "string",
    "last tx rec count": "string",
    "last tx trans": "string",
    "local change": "string",
    "my system id": "string",
    "rx invalid msg": "string",
    "rx unknown msg": "string",
    "time since change": "string"
  },
  "peers": [
    {
      "index": "string",
      "peerIP": "string",
      "peerid": 10,
      "rxrecs": 2,
      "rxsecs": 6,
      "rxtabs": 7,
      "rxtrans": 2,
      "txsecs": 10,
      "txtrans": 5
    },
    {
      "index": "string",
      "peerIP": "string",
      "peerid": 6,
      "rxrecs": 6,
      "rxsecs": 6,
      "rxtabs": 10,
      "rxtrans": 6,
      "txsecs": 7,
      "txtrans": 3
    },
    {
      "index": "string",
      "peerIP": "string",
      "peerid": 5,
      "rxrecs": 9,
      "rxsecs": 4,
      "rxtabs": 7,
      "rxtrans": 1,
      "txsecs": 10,
      "txtrans": 8
    },
    {
      "index": "string",
      "peerIP": "string",
      "peerid": 3,
      "rxrecs": 10,
      "rxsecs": 9,
      "rxtabs": 2,
      "rxtrans": 9,
      "txsecs": 9,
      "txtrans": 3
    },
    {
      "index": "string",
      "peerIP": "string",
      "peerid": 10,
      "rxrecs": 6,
      "rxsecs": 7,
      "rxtabs": 3,
      "rxtrans": 3,
      "txsecs": 8,
      "txtrans": 2
    },
    {
      "index": "string",
      "peerIP": "string",
      "peerid": 8,
      "rxrecs": 5,
      "rxsecs": 10,
      "rxtabs": 2,
      "rxtrans": 7,
      "txsecs": 1,
      "txtrans": 10
    },
    {
      "index": "string",
      "peerIP": "string",
      "peerid": 6,
      "rxrecs": 3,
      "rxsecs": 9,
      "rxtabs": 6,
      "rxtrans": 1,
      "txsecs": 4,
      "txtrans": 7
    },
    {
      "index": "string",
      "peerIP": "string",
      "peerid": 9,
      "rxrecs": 5,
      "rxsecs": 5,
      "rxtabs": 6,
      "rxtrans": 7,
      "txsecs": 2,
      "txtrans": 9
    },
    {
      "index": "string",
      "peerIP": "string",
      "peerid": 8,
      "rxrecs": 9,
      "rxsecs": 10,
      "rxtabs": 6,
      "rxtrans": 1,
      "txsecs": 9,
      "txtrans": 6
    },
    {
      "index": "string",
      "peerIP": "string",
      "peerid": 7,
      "rxrecs": 8,
      "rxsecs": 10,
      "rxtabs": 3,
      "rxtrans": 9,
      "txsecs": 6,
      "txtrans": 9
    }
  ],
  "subnets": {
    "count": 4,
    "entries": [
      {},
      {},
      {},
      {}
    ],
    "max": 4
  }
}