[
  {
    "country": "string",
    "country_code": "string",
    "description": "string",
    "ip_end": 6,
    "ip_start": 7,
    "name": "string",
    "org": "string",
    "priority": 4,
    "saas_id": 1,
    "search": "string",
    "service_id": 4
  },
  {
    "country": "string",
    "country_code": "string",
    "description": "string",
    "ip_end": 1,
    "ip_start": 10,
    "name": "string",
    "org": "string",
    "priority": 9,
    "saas_id": 6,
    "search": "string",
    "service_id": 10
  },
  {
    "country": "string",
    "country_code": "string",
    "description": "string",
    "ip_end": 1,
    "ip_start": 6,
    "name": "string",
    "org": "string",
    "priority": 8,
    "saas_id": 1,
    "search": "string",
    "service_id": 7
  },
  {
    "country": "string",
    "country_code": "string",
    "description": "string",
    "ip_end": 3,
    "ip_start": 5,
    "name": "string",
    "org": "string",
    "priority": 5,
    "saas_id": 4,
    "search": "string",
    "service_id": 5
  }
]