{
  "<overlayId>": {
    "<regionId>": {
      "bondingPolicy": 1,
      "boostTraffic": false,
      "brownoutThresholds": {
        "jitter": 4,
        "latency": 4,
        "loss": 7
      },
      "hubInternetPolicies": {
        "<nePk>": {
          "internetPolicy": {
            "localBreakout": {
              "backup": [
                "string",
                "string",
                "string",
                "string",
                "string",
                "string",
                "string"
              ],
              "primary": [
                "string",
                "string",
                "string",
                "string",
                "string",
                "string"
              ]
            },
            "policyList": [
              "string",
              "string",
              "string",
              "string",
              "string",
              "string",
              "string",
              "string"
            ]
          }
        }
      },
      "id": "string",
      "internetPolicy": {
        "localBreakout": {
          "backup": [
            "string",
            "string",
            "string",
            "string",
            "string"
          ],
          "primary": [
            "string",
            "string",
            "string",
            "string",
            "string",
            "string",
            "string",
            "string",
            "string",
            "string"
          ]
        },
        "policyList": [
          "string"
        ]
      },
      "lanDscp": "string",
      "match": {
        "acl": "string",
        "interfaceLabel": "string",
        "overlayAcl": "string"
      },
      "name": "string",
      "overlayFallbackOption": 3,
      "topology": {
        "externalHubs": [
          "string",
          "string"
        ],
        "hubs": [
          "string",
          "string",
          "string",
          "string",
          "string",
          "string",
          "string"
        ],
        "topologyType": 2,
        "useRegions": true
      },
      "trafficClass": "string",
      "tunnelUsagePolicy": "string",
      "useBackupOnBrownout": false,
      "wanDscp": "string",
      "wanPorts": {
        "backup": [
          "string",
          "string",
          "string",
          "string",
          "string",
          "string"
        ],
        "crossConnect": [
          "string",
          "string",
          "string"
        ],
        "primary": [
          "string",
          "string",
          "string",
          "string",
          "string",
          "string",
          "string",
          "string",
          "string"
        ]
      }
    }
  }
}