{
  "alarmType": 10,
  "description": "string",
  "name": "string",
  "recommendedAction": "string",
  "serviceAffecting": false,
  "severity": "string",
  "source": "string",
  "sourceType": 5,
  "systemType": 5,
  "typeId": 9
}