[
  {
    "HOSTNAME": "string",
    "INTERFACE": "string",
    "IP": "string",
    "MAX_FWDROPS_RX_BYTES_MAX": 9,
    "MAX_FWDROPS_RX_PKTS_MAX": 6,
    "MAX_FWDROPS_TX_BYTES_MAX": 9,
    "MAX_FWDROPS_TX_PKTS_MAX": 3,
    "MAX_OHEAD_RX_BYTES_MAX": 3,
    "MAX_OHEAD_RX_PKTS_MAX": 4,
    "MAX_OHEAD_TX_BYTES_MAX": 3,
    "MAX_OHEAD_TX_PKTS_MAX": 2,
    "MAX_RX_BYTES_MAX": 6,
    "MAX_RX_PKTS_MAX": 3,
    "MAX_TIMESTAMP": 5,
    "MAX_TX_BYTES_MAX": 5,
    "MAX_TX_PKTS_MAX": 10,
    "MIN_TIMESTAMP": 6,
    "SUM_FWDROPS_RX_BYTES": 9,
    "SUM_FWDROPS_RX_PKTS": 1,
    "SUM_FWDROPS_TX_BYTES": 8,
    "SUM_FWDROPS_TX_PKTS": 4,
    "SUM_OHEAD_RX_BYTES": 9,
    "SUM_OHEAD_RX_PKTS": 3,
    "SUM_OHEAD_TX_BYTES": 10,
    "SUM_OHEAD_TX_PKTS": 2,
    "SUM_RX_BYTES": 2,
    "SUM_RX_PKTS": 2,
    "SUM_TX_BYTES": 1,
    "SUM_TX_PKTS": 4,
    "TRAFFIC_TYPE": 8,
    "nePk": "string"
  },
  {
    "HOSTNAME": "string",
    "INTERFACE": "string",
    "IP": "string",
    "MAX_FWDROPS_RX_BYTES_MAX": 6,
    "MAX_FWDROPS_RX_PKTS_MAX": 10,
    "MAX_FWDROPS_TX_BYTES_MAX": 10,
    "MAX_FWDROPS_TX_PKTS_MAX": 4,
    "MAX_OHEAD_RX_BYTES_MAX": 3,
    "MAX_OHEAD_RX_PKTS_MAX": 3,
    "MAX_OHEAD_TX_BYTES_MAX": 7,
    "MAX_OHEAD_TX_PKTS_MAX": 2,
    "MAX_RX_BYTES_MAX": 4,
    "MAX_RX_PKTS_MAX": 1,
    "MAX_TIMESTAMP": 9,
    "MAX_TX_BYTES_MAX": 6,
    "MAX_TX_PKTS_MAX": 3,
    "MIN_TIMESTAMP": 1,
    "SUM_FWDROPS_RX_BYTES": 6,
    "SUM_FWDROPS_RX_PKTS": 8,
    "SUM_FWDROPS_TX_BYTES": 3,
    "SUM_FWDROPS_TX_PKTS": 10,
    "SUM_OHEAD_RX_BYTES": 5,
    "SUM_OHEAD_RX_PKTS": 4,
    "SUM_OHEAD_TX_BYTES": 10,
    "SUM_OHEAD_TX_PKTS": 7,
    "SUM_RX_BYTES": 3,
    "SUM_RX_PKTS": 1,
    "SUM_TX_BYTES": 8,
    "SUM_TX_PKTS": 5,
    "TRAFFIC_TYPE": 9,
    "nePk": "string"
  }
]