{
  "<ip>": {
    "city": "string",
    "country": "string",
    "countryCode": "string",
    "ip": 10,
    "isp": "string",
    "latitude": 4,
    "longitude": 4,
    "org": "string",
    "postalCode": 10,
    "rangeIpEnd": 10,
    "rangeIpStart": 7
  }
}