{
  "data": {
    "<dropId>": [
      [
        null,
        null,
        null,
        null,
        null,
        null,
        null
      ],
      [
        null
      ],
      [
        null,
        null,
        null
      ],
      [
        null,
        null,
        null,
        null,
        null,
        null
      ],
      [
        null,
        null,
        null,
        null,
        null,
        null,
        null,
        null,
        null
      ],
      [
        null,
        null,
        null,
        null,
        null,
        null
      ],
      [
        null,
        null,
        null,
        null,
        null
      ]
    ]
  }
}