[
  {
    "fwdrops_rx_bytes": 8,
    "fwdrops_rx_bytes_max": 10,
    "fwdrops_rx_bytes_max_ts": 3,
    "fwdrops_rx_pkts": 2,
    "fwdrops_rx_pkts_max": 7,
    "fwdrops_rx_pkts_max_ts": 9,
    "fwdrops_tx_bytes": 3,
    "fwdrops_tx_bytes_max": 7,
    "fwdrops_tx_bytes_max_ts": 3,
    "fwdrops_tx_pkts": 7,
    "fwdrops_tx_pkts_max": 3,
    "fwdrops_tx_pkts_max_ts": 8,
    "interfaceName": "string",
    "max_bw_rx": 4,
    "max_bw_tx": 5,
    "ohead_rx_bytes": 9,
    "ohead_rx_bytes_max": 2,
    "ohead_rx_bytes_max_ts": 5,
    "ohead_rx_pkts": 7,
    "ohead_rx_pkts_max": 5,
    "ohead_rx_pkts_max_ts": 4,
    "ohead_tx_bytes": 1,
    "ohead_tx_bytes_max": 5,
    "ohead_tx_bytes_max_ts": 4,
    "ohead_tx_pkts": 4,
    "ohead_tx_pkts_max": 6,
    "ohead_tx_pkts_max_ts": 8,
    "rx_bytes": 8,
    "rx_bytes_max": 6,
    "rx_bytes_max_ts": 9,
    "rx_pkts": 5,
    "rx_pkts_max": 10,
    "rx_pkts_max_ts": 10,
    "timestamp": 5,
    "trafficType": 5,
    "tx_bytes": 6,
    "tx_bytes_max": 7,
    "tx_bytes_max_ts": 8,
    "tx_pkts": 5,
    "tx_pkts_max": 1,
    "tx_pkts_max_ts": 1
  },
  {
    "fwdrops_rx_bytes": 3,
    "fwdrops_rx_bytes_max": 1,
    "fwdrops_rx_bytes_max_ts": 4,
    "fwdrops_rx_pkts": 5,
    "fwdrops_rx_pkts_max": 8,
    "fwdrops_rx_pkts_max_ts": 8,
    "fwdrops_tx_bytes": 5,
    "fwdrops_tx_bytes_max": 4,
    "fwdrops_tx_bytes_max_ts": 5,
    "fwdrops_tx_pkts": 8,
    "fwdrops_tx_pkts_max": 4,
    "fwdrops_tx_pkts_max_ts": 3,
    "interfaceName": "string",
    "max_bw_rx": 9,
    "max_bw_tx": 5,
    "ohead_rx_bytes": 3,
    "ohead_rx_bytes_max": 7,
    "ohead_rx_bytes_max_ts": 9,
    "ohead_rx_pkts": 1,
    "ohead_rx_pkts_max": 5,
    "ohead_rx_pkts_max_ts": 2,
    "ohead_tx_bytes": 8,
    "ohead_tx_bytes_max": 4,
    "ohead_tx_bytes_max_ts": 7,
    "ohead_tx_pkts": 1,
    "ohead_tx_pkts_max": 2,
    "ohead_tx_pkts_max_ts": 10,
    "rx_bytes": 10,
    "rx_bytes_max": 5,
    "rx_bytes_max_ts": 1,
    "rx_pkts": 6,
    "rx_pkts_max": 1,
    "rx_pkts_max_ts": 8,
    "timestamp": 9,
    "trafficType": 6,
    "tx_bytes": 3,
    "tx_bytes_max": 5,
    "tx_bytes_max_ts": 10,
    "tx_pkts": 3,
    "tx_pkts_max": 6,
    "tx_pkts_max_ts": 8
  },
  {
    "fwdrops_rx_bytes": 4,
    "fwdrops_rx_bytes_max": 4,
    "fwdrops_rx_bytes_max_ts": 7,
    "fwdrops_rx_pkts": 9,
    "fwdrops_rx_pkts_max": 2,
    "fwdrops_rx_pkts_max_ts": 2,
    "fwdrops_tx_bytes": 5,
    "fwdrops_tx_bytes_max": 5,
    "fwdrops_tx_bytes_max_ts": 5,
    "fwdrops_tx_pkts": 6,
    "fwdrops_tx_pkts_max": 5,
    "fwdrops_tx_pkts_max_ts": 3,
    "interfaceName": "string",
    "max_bw_rx": 9,
    "max_bw_tx": 10,
    "ohead_rx_bytes": 5,
    "ohead_rx_bytes_max": 10,
    "ohead_rx_bytes_max_ts": 9,
    "ohead_rx_pkts": 6,
    "ohead_rx_pkts_max": 6,
    "ohead_rx_pkts_max_ts": 2,
    "ohead_tx_bytes": 1,
    "ohead_tx_bytes_max": 3,
    "ohead_tx_bytes_max_ts": 3,
    "ohead_tx_pkts": 4,
    "ohead_tx_pkts_max": 5,
    "ohead_tx_pkts_max_ts": 9,
    "rx_bytes": 7,
    "rx_bytes_max": 4,
    "rx_bytes_max_ts": 4,
    "rx_pkts": 10,
    "rx_pkts_max": 6,
    "rx_pkts_max_ts": 4,
    "timestamp": 1,
    "trafficType": 7,
    "tx_bytes": 8,
    "tx_bytes_max": 4,
    "tx_bytes_max_ts": 3,
    "tx_pkts": 3,
    "tx_pkts_max": 1,
    "tx_pkts_max_ts": 10
  },
  {
    "fwdrops_rx_bytes": 2,
    "fwdrops_rx_bytes_max": 8,
    "fwdrops_rx_bytes_max_ts": 8,
    "fwdrops_rx_pkts": 2,
    "fwdrops_rx_pkts_max": 7,
    "fwdrops_rx_pkts_max_ts": 1,
    "fwdrops_tx_bytes": 6,
    "fwdrops_tx_bytes_max": 1,
    "fwdrops_tx_bytes_max_ts": 9,
    "fwdrops_tx_pkts": 6,
    "fwdrops_tx_pkts_max": 7,
    "fwdrops_tx_pkts_max_ts": 3,
    "interfaceName": "string",
    "max_bw_rx": 5,
    "max_bw_tx": 9,
    "ohead_rx_bytes": 9,
    "ohead_rx_bytes_max": 4,
    "ohead_rx_bytes_max_ts": 4,
    "ohead_rx_pkts": 8,
    "ohead_rx_pkts_max": 1,
    "ohead_rx_pkts_max_ts": 2,
    "ohead_tx_bytes": 10,
    "ohead_tx_bytes_max": 7,
    "ohead_tx_bytes_max_ts": 3,
    "ohead_tx_pkts": 1,
    "ohead_tx_pkts_max": 6,
    "ohead_tx_pkts_max_ts": 10,
    "rx_bytes": 8,
    "rx_bytes_max": 3,
    "rx_bytes_max_ts": 9,
    "rx_pkts": 8,
    "rx_pkts_max": 8,
    "rx_pkts_max_ts": 9,
    "timestamp": 5,
    "trafficType": 4,
    "tx_bytes": 10,
    "tx_bytes_max": 5,
    "tx_bytes_max_ts": 6,
    "tx_pkts": 10,
    "tx_pkts_max": 1,
    "tx_pkts_max_ts": 4
  }
]