{
  "appliance-id": [
    {
      "blank": true,
      "configChange": true,
      "reboot": true,
      "status": "MAJOR",
      "time": 6
    },
    {
      "blank": false,
      "configChange": false,
      "reboot": true,
      "status": "MAJOR",
      "time": 8
    },
    {
      "blank": false,
      "configChange": false,
      "reboot": false,
      "status": "MAJOR",
      "time": 6
    },
    {
      "blank": false,
      "configChange": false,
      "reboot": true,
      "status": "MAJOR",
      "time": 2
    },
    {
      "blank": true,
      "configChange": true,
      "reboot": false,
      "status": "HEALTHY",
      "time": 10
    },
    {
      "blank": true,
      "configChange": true,
      "reboot": false,
      "status": "MINOR",
      "time": 8
    }
  ]
}