[
  {
    "ALIAS": "string",
    "HOSTNAME": "string",
    "IP": "string",
    "TUNNEL": "string",
    "destNePk": "string",
    "destTunnelAlias": "string",
    "destTunnelId": "string",
    "isPassThrough": false,
    "min_mos": 5,
    "min_mos_ts": 1,
    "mos": 8,
    "nePk": "string"
  }
]