{
  "$id": "schema.json",
  "type": "object",
  "schema": "http://json-schema.org/draft-07/schema#",
  "translate": true,
  "dynamicfields": true,
  "properties": {
    "ph_request_type": {
      "type": "string",
      "description": "type of request (internal to adapter)",
      "default": "tcpdumpRun",
      "enum": [
        "tcpdumpRun",
        "tcpdumpStatus",
        "getTcpdumpTcpdumpStatus"
      ],
      "external_name": "ph_request_type"
    },
    "postRunConfig": {
      "description": "The run data",
      "parse": false,
      "encode": false,
      "encrypt": {
        "type": "AES",
        "key": ""
      },
      "external_name": "PostRunConfig"
    }
  },
  "definitions": {}
}