{
  "1.NE": {
    "exampleTunnelId1": {
      "adminStatus": "string",
      "alias": "string",
      "children": [
        null,
        null,
        null,
        null,
        null,
        null,
        null,
        null,
        null,
        null
      ],
      "destNePk": "string",
      "destTunnelAlias": "string",
      "destTunnelId": "string",
      "gmsMarked": "string",
      "id": "string",
      "operStatus": "string",
      "overlayId": 6,
      "srcNePk": "string",
      "tag": "string"
    },
    "exampleTunnelId2": {
      "adminStatus": "string",
      "alias": "string",
      "children": [
        null,
        null,
        null,
        null,
        null,
        null
      ],
      "destNePk": "string",
      "destTunnelAlias": "string",
      "destTunnelId": "string",
      "gmsMarked": "string",
      "id": "string",
      "operStatus": "string",
      "overlayId": 3,
      "srcNePk": "string",
      "tag": "string"
    }
  },
  "2.NE": {
    "exampleTunnelId1": {
      "adminStatus": "string",
      "alias": "string",
      "children": [
        null,
        null,
        null,
        null,
        null,
        null,
        null,
        null,
        null
      ],
      "destNePk": "string",
      "destTunnelAlias": "string",
      "destTunnelId": "string",
      "gmsMarked": "string",
      "id": "string",
      "operStatus": "string",
      "overlayId": 6,
      "srcNePk": "string",
      "tag": "string"
    },
    "exampleTunnelId2": {
      "adminStatus": "string",
      "alias": "string",
      "children": [
        null,
        null,
        null,
        null,
        null,
        null
      ],
      "destNePk": "string",
      "destTunnelAlias": "string",
      "destTunnelId": "string",
      "gmsMarked": "string",
      "id": "string",
      "operStatus": "string",
      "overlayId": 8,
      "srcNePk": "string",
      "tag": "string"
    }
  }
}