{
  "actions": [
    {
      "name": "gmsConfig",
      "protocol": "REST",
      "method": "GET",
      "entitypath": "{base_path}/{version}/gmsConfig?{query}",
      "requestSchema": "schema.json",
      "responseSchema": "schema.json",
      "timeout": 0,
      "sendEmpty": false,
      "sendGetBody": false,
      "requestDatatype": "JSON",
      "responseDatatype": "JSON",
      "headers": {},
      "responseObjects": [
        {
          "type": "default",
          "key": "",
          "mockFile": "mockdatafiles/gmsConfig-default.json"
        }
      ]
    },
    {
      "name": "postGmsConfig",
      "protocol": "REST",
      "method": "POST",
      "entitypath": "{base_path}/{version}/gmsConfig?{query}",
      "requestSchema": "schema.json",
      "responseSchema": "schema.json",
      "timeout": 0,
      "sendEmpty": false,
      "sendGetBody": false,
      "requestDatatype": "JSON",
      "responseDatatype": "JSON",
      "headers": {},
      "responseObjects": [
        {
          "type": "default",
          "key": "",
          "mockFile": ""
        }
      ]
    },
    {
      "name": "deleteGmsConfigBase",
      "protocol": "REST",
      "method": "DELETE",
      "entitypath": "{base_path}/{version}/gmsConfig/{pathv1}?{query}",
      "requestSchema": "schema.json",
      "responseSchema": "schema.json",
      "timeout": 0,
      "sendEmpty": false,
      "sendGetBody": false,
      "requestDatatype": "JSON",
      "responseDatatype": "JSON",
      "headers": {},
      "responseObjects": [
        {
          "type": "default",
          "key": "",
          "mockFile": ""
        }
      ]
    },
    {
      "name": "getGmsConfigBase",
      "protocol": "REST",
      "method": "GET",
      "entitypath": "{base_path}/{version}/gmsConfig/{pathv1}?{query}",
      "requestSchema": "schema.json",
      "responseSchema": "schema.json",
      "timeout": 0,
      "sendEmpty": false,
      "sendGetBody": false,
      "requestDatatype": "JSON",
      "responseDatatype": "JSON",
      "headers": {},
      "responseObjects": [
        {
          "type": "default",
          "key": "",
          "mockFile": "mockdatafiles/getGmsConfigBase-default.json"
        }
      ]
    },
    {
      "name": "putGmsConfigBase",
      "protocol": "REST",
      "method": "PUT",
      "entitypath": "{base_path}/{version}/gmsConfig/{pathv1}?{query}",
      "requestSchema": "schema.json",
      "responseSchema": "schema.json",
      "timeout": 0,
      "sendEmpty": false,
      "sendGetBody": false,
      "requestDatatype": "JSON",
      "responseDatatype": "JSON",
      "headers": {},
      "responseObjects": [
        {
          "type": "default",
          "key": "",
          "mockFile": ""
        }
      ]
    }
  ]
}