[
  {
    "active": false,
    "build_time": "string",
    "build_version": "string",
    "fallback_boot": true,
    "next_boot": false,
    "partition": 4
  },
  {
    "active": false,
    "build_time": "string",
    "build_version": "string",
    "fallback_boot": false,
    "next_boot": true,
    "partition": 5
  },
  {
    "active": true,
    "build_time": "string",
    "build_version": "string",
    "fallback_boot": false,
    "next_boot": false,
    "partition": 4
  },
  {
    "active": true,
    "build_time": "string",
    "build_version": "string",
    "fallback_boot": false,
    "next_boot": false,
    "partition": 4
  }
]