{
  "authOrder": 1,
  "authOrderStr": "string",
  "netReadPrivilege": 1,
  "netReadWritePrivilege": 10,
  "primaryHost": "string",
  "primaryPort": "string",
  "primaryRadiusKey": "string",
  "protocol": 4,
  "protocolStr": "string",
  "radiusType": "string",
  "secondaryHost": "string",
  "secondaryPort": "string",
  "secondaryRadiusKey": "string",
  "type": "string"
}