{
  "app": {
    "evict_enable": false,
    "max_items": 10
  },
  "dns": {
    "evict_enable": true,
    "max_items": 5
  },
  "flows_csv_enable": true,
  "ip": {
    "evict_enable": true,
    "max_items": 1
  },
  "minuteRetention": 9,
  "port": {
    "evict_enable": true,
    "max_items": 6
  },
  "verticalRetention": 3
}