{
  "<appName&Type>": [
    {
      "neID": "string",
      "neIP": "string"
    },
    {
      "neID": "string",
      "neIP": "string"
    },
    {
      "neID": "string",
      "neIP": "string"
    },
    {
      "neID": "string",
      "neIP": "string"
    },
    {
      "neID": "string",
      "neIP": "string"
    },
    {
      "neID": "string",
      "neIP": "string"
    },
    {
      "neID": "string",
      "neIP": "string"
    },
    {
      "neID": "string",
      "neIP": "string"
    }
  ]
}