{
  "autoApply": true,
  "comment": "string",
  "completionStatus": true,
  "configData": "string",
  "createdtime": 9,
  "discoveredId": "string",
  "endtime": 10,
  "guid": "string",
  "id": 7,
  "modifiedtime": 10,
  "name": "string",
  "nepk": "string",
  "result": [
    {
      "completionStatus": true,
      "data": "string",
      "name": "string",
      "nePk": "string",
      "result": "string",
      "taskStatus": 5
    }
  ],
  "serialNum": "string",
  "starttime": 2,
  "tag": "string",
  "taskStatus": 2
}