{
  "<ip>": {
    "city": "string",
    "country": "string",
    "countryCode": "string",
    "ip": 7,
    "isp": "string",
    "latitude": 3,
    "longitude": 4,
    "org": "string",
    "postalCode": 10,
    "rangeIpEnd": 6,
    "rangeIpStart": 8
  }
}