[
  {
    "BEHAVIORAL_CATEGORY": "string",
    "HOSTNAME": "string",
    "MAX_TIMESTAMP": 9,
    "MIN_TIMESTAMP": 5,
    "SUM_FLOWS_COUNT": 6,
    "SUM_FLOWS_CREATED": 8,
    "SUM_FLOWS_DELETED": 7,
    "SUM_LRX_BYTES": 5,
    "SUM_LRX_PKTS": 3,
    "SUM_LTX_BYTES": 2,
    "SUM_LTX_PKTS": 4,
    "SUM_WRX_BYTES": 1,
    "SUM_WRX_PKTS": 8,
    "SUM_WTX_BYTES": 1,
    "SUM_WTX_PKTS": 4,
    "nePk": "string"
  },
  {
    "BEHAVIORAL_CATEGORY": "string",
    "HOSTNAME": "string",
    "MAX_TIMESTAMP": 5,
    "MIN_TIMESTAMP": 5,
    "SUM_FLOWS_COUNT": 4,
    "SUM_FLOWS_CREATED": 7,
    "SUM_FLOWS_DELETED": 5,
    "SUM_LRX_BYTES": 10,
    "SUM_LRX_PKTS": 2,
    "SUM_LTX_BYTES": 3,
    "SUM_LTX_PKTS": 7,
    "SUM_WRX_BYTES": 5,
    "SUM_WRX_PKTS": 8,
    "SUM_WTX_BYTES": 8,
    "SUM_WTX_PKTS": 2,
    "nePk": "string"
  }
]