[
  {
    "applianceInfo": {
      "group": "string",
      "hostname": "string",
      "ip": "string",
      "isLicenseRequired": "string",
      "model": "string",
      "portalLicenseType": "string",
      "reachabilityStatus": 6,
      "serial": "string",
      "site": "string",
      "softwareVersion": "string"
    },
    "approved": true,
    "approvedTime": 7,
    "denied": false,
    "deniedTime": 4,
    "discoveredFrom": 1,
    "discoveredTime": 2,
    "dynamicUuid": "string",
    "id": 10,
    "portalObjectId": "string",
    "userId": "string",
    "uuid": "string"
  },
  {
    "applianceInfo": {
      "group": "string",
      "hostname": "string",
      "ip": "string",
      "isLicenseRequired": "string",
      "model": "string",
      "portalLicenseType": "string",
      "reachabilityStatus": 2,
      "serial": "string",
      "site": "string",
      "softwareVersion": "string"
    },
    "approved": false,
    "approvedTime": 6,
    "denied": false,
    "deniedTime": 6,
    "discoveredFrom": 10,
    "discoveredTime": 8,
    "dynamicUuid": "string",
    "id": 8,
    "portalObjectId": "string",
    "userId": "string",
    "uuid": "string"
  },
  {
    "applianceInfo": {
      "group": "string",
      "hostname": "string",
      "ip": "string",
      "isLicenseRequired": "string",
      "model": "string",
      "portalLicenseType": "string",
      "reachabilityStatus": 8,
      "serial": "string",
      "site": "string",
      "softwareVersion": "string"
    },
    "approved": false,
    "approvedTime": 2,
    "denied": true,
    "deniedTime": 10,
    "discoveredFrom": 3,
    "discoveredTime": 2,
    "dynamicUuid": "string",
    "id": 6,
    "portalObjectId": "string",
    "userId": "string",
    "uuid": "string"
  },
  {
    "applianceInfo": {
      "group": "string",
      "hostname": "string",
      "ip": "string",
      "isLicenseRequired": "string",
      "model": "string",
      "portalLicenseType": "string",
      "reachabilityStatus": 1,
      "serial": "string",
      "site": "string",
      "softwareVersion": "string"
    },
    "approved": false,
    "approvedTime": 5,
    "denied": true,
    "deniedTime": 2,
    "discoveredFrom": 2,
    "discoveredTime": 9,
    "dynamicUuid": "string",
    "id": 3,
    "portalObjectId": "string",
    "userId": "string",
    "uuid": "string"
  }
]