[
  {
    "displayName": "string",
    "expire": 10,
    "name": "string"
  },
  {
    "displayName": "string",
    "expire": 8,
    "name": "string"
  },
  {
    "displayName": "string",
    "expire": 10,
    "name": "string"
  }
]