[
  {
    "HOSTNAME": "string",
    "IP": "string",
    "MAX_TIMESTAMP": 4,
    "MIN_TIMESTAMP": 3,
    "flows_allowed": 5,
    "flows_dropped": 1,
    "fromZone": "string",
    "nePk": "string",
    "policy_drop_bytes": 2,
    "policy_drop_pkts": 6,
    "routing_drop_bytes": 6,
    "routing_drop_pkts": 7,
    "rx_bytes": 5,
    "rx_pkts": 1,
    "toZone": "string",
    "tx_bytes": 6,
    "tx_pkts": 8
  },
  {
    "HOSTNAME": "string",
    "IP": "string",
    "MAX_TIMESTAMP": 7,
    "MIN_TIMESTAMP": 8,
    "flows_allowed": 7,
    "flows_dropped": 5,
    "fromZone": "string",
    "nePk": "string",
    "policy_drop_bytes": 4,
    "policy_drop_pkts": 9,
    "routing_drop_bytes": 5,
    "routing_drop_pkts": 2,
    "rx_bytes": 5,
    "rx_pkts": 5,
    "toZone": "string",
    "tx_bytes": 9,
    "tx_pkts": 7
  },
  {
    "HOSTNAME": "string",
    "IP": "string",
    "MAX_TIMESTAMP": 5,
    "MIN_TIMESTAMP": 5,
    "flows_allowed": 5,
    "flows_dropped": 10,
    "fromZone": "string",
    "nePk": "string",
    "policy_drop_bytes": 10,
    "policy_drop_pkts": 1,
    "routing_drop_bytes": 2,
    "routing_drop_pkts": 7,
    "rx_bytes": 1,
    "rx_pkts": 1,
    "toZone": "string",
    "tx_bytes": 7,
    "tx_pkts": 8
  },
  {
    "HOSTNAME": "string",
    "IP": "string",
    "MAX_TIMESTAMP": 9,
    "MIN_TIMESTAMP": 6,
    "flows_allowed": 5,
    "flows_dropped": 6,
    "fromZone": "string",
    "nePk": "string",
    "policy_drop_bytes": 3,
    "policy_drop_pkts": 10,
    "routing_drop_bytes": 9,
    "routing_drop_pkts": 4,
    "rx_bytes": 7,
    "rx_pkts": 7,
    "toZone": "string",
    "tx_bytes": 2,
    "tx_pkts": 3
  }
]