{
  "adminStatus": "string",
  "alias": "string",
  "destIpAddress": "string",
  "destNePk": "string",
  "fecRatio": 10,
  "fecStatus": "string",
  "gmsMarked": false,
  "id": "string",
  "max_bw": 2,
  "max_bw_auto": true,
  "mode": "string",
  "natMode": "string",
  "operStatus": "string",
  "peerName": "string",
  "sourceIpAddress": "string",
  "srcNePk": "string"
}