{
  "$id": "schema.json",
  "type": "object",
  "schema": "http://json-schema.org/draft-07/schema#",
  "translate": true,
  "dynamicfields": true,
  "properties": {
    "ph_request_type": {
      "type": "string",
      "description": "type of request (internal to adapter)",
      "default": "sMTP",
      "enum": [
        "sMTP",
        "getGmsSMTP",
        "sMTPPost",
        "delUnverifiedEmails",
        "sendVerificationEmail",
        "sMTPTestMail",
        "listUnverifiedEmails",
        "verifyEmailAddress"
      ],
      "external_name": "ph_request_type"
    },
    "sMTPDetails": {
      "description": "Json object for setting values of SMPT user name, password, email server address etc...",
      "parse": false,
      "encode": false,
      "encrypt": {
        "type": "AES",
        "key": ""
      },
      "external_name": "SMTPDetails"
    }
  },
  "definitions": {}
}