{
  "column_def": [
    "string",
    "string",
    "string",
    "string",
    "string",
    "string",
    "string",
    "string",
    "string",
    "string"
  ],
  "data": {
    "<nePk/IP>": [
      {
        "ERC_MAX_RX": 7,
        "ERC_MAX_RX_TS": 3,
        "ERC_MAX_TX": 3,
        "ERC_MAX_TX_TS": 4,
        "ERC_MIN_RX": 2,
        "ERC_MIN_RX_TS": 5,
        "ERC_MIN_TX": 2,
        "ERC_MIN_TX_TS": 4,
        "TIMESTAMP": 9,
        "TUNNEL": 9
      },
      {
        "ERC_MAX_RX": 4,
        "ERC_MAX_RX_TS": 3,
        "ERC_MAX_TX": 1,
        "ERC_MAX_TX_TS": 10,
        "ERC_MIN_RX": 3,
        "ERC_MIN_RX_TS": 7,
        "ERC_MIN_TX": 7,
        "ERC_MIN_TX_TS": 1,
        "TIMESTAMP": 10,
        "TUNNEL": 10
      },
      {
        "ERC_MAX_RX": 4,
        "ERC_MAX_RX_TS": 9,
        "ERC_MAX_TX": 7,
        "ERC_MAX_TX_TS": 5,
        "ERC_MIN_RX": 10,
        "ERC_MIN_RX_TS": 6,
        "ERC_MIN_TX": 1,
        "ERC_MIN_TX_TS": 6,
        "TIMESTAMP": 4,
        "TUNNEL": 10
      },
      {
        "ERC_MAX_RX": 6,
        "ERC_MAX_RX_TS": 3,
        "ERC_MAX_TX": 7,
        "ERC_MAX_TX_TS": 5,
        "ERC_MIN_RX": 10,
        "ERC_MIN_RX_TS": 4,
        "ERC_MIN_TX": 8,
        "ERC_MIN_TX_TS": 8,
        "TIMESTAMP": 9,
        "TUNNEL": 8
      },
      {
        "ERC_MAX_RX": 4,
        "ERC_MAX_RX_TS": 7,
        "ERC_MAX_TX": 7,
        "ERC_MAX_TX_TS": 3,
        "ERC_MIN_RX": 7,
        "ERC_MIN_RX_TS": 7,
        "ERC_MIN_TX": 8,
        "ERC_MIN_TX_TS": 1,
        "TIMESTAMP": 8,
        "TUNNEL": 9
      }
    ]
  }
}