[
  {
    "appType": "string",
    "applicationName": "string"
  },
  {
    "appType": "string",
    "applicationName": "string"
  },
  {
    "appType": "string",
    "applicationName": "string"
  }
]