[
  {
    "configData": {},
    "resourceBase": "string",
    "resourceKey": "string",
    "version": 7
  },
  {
    "configData": {},
    "resourceBase": "string",
    "resourceKey": "string",
    "version": 6
  },
  {
    "configData": {},
    "resourceBase": "string",
    "resourceKey": "string",
    "version": 5
  },
  {
    "configData": {},
    "resourceBase": "string",
    "resourceKey": "string",
    "version": 5
  }
]