{
  "<applianceAccessGroupName1>": {
    "applianceGroups": [
      "string",
      "string",
      "string",
      "string",
      "string"
    ],
    "applianceRegions": [
      "string",
      "string",
      "string",
      "string"
    ]
  },
  "<applianceAccessGroupName2>": {
    "applianceGroups": [
      "string",
      "string",
      "string",
      "string",
      "string"
    ],
    "applianceRegions": [
      "string",
      "string",
      "string",
      "string",
      "string",
      "string",
      "string"
    ]
  }
}