{
  "maps": {
    "prio": {
      "<priorityNumber>": {
        "comment": "string",
        "dir": "string",
        "gms_marked": true,
        "match": {
          "dst_subnet": "string",
          "intf": "string",
          "src_subnet": "string"
        },
        "set": {
          "trans_dst": "string",
          "trans_src": "string"
        }
      }
    }
  },
  "natPools": {
    "<NATPool Id>": {
      "comment": "string",
      "dir": "string",
      "name": "string",
      "pat": 1,
      "subnet": "string"
    }
  }
}