[
  {
    "processstate": {
      "cifsproxyd": {
        "VmPeak": 9,
        "VmRSS": 2,
        "VmSize": 10
      },
      "jsond": {
        "VmPeak": 4,
        "VmRSS": 4,
        "VmSize": 8
      },
      "mgmtd": {
        "VmPeak": 8,
        "VmRSS": 2,
        "VmSize": 4
      },
      "netflowd": {
        "VmPeak": 10,
        "VmRSS": 5,
        "VmSize": 3
      },
      "node": {
        "VmPeak": 1,
        "VmRSS": 8,
        "VmSize": 5
      },
      "pm": {
        "VmPeak": 8,
        "VmRSS": 3,
        "VmSize": 6
      },
      "snmpd": {
        "VmPeak": 10,
        "VmRSS": 4,
        "VmSize": 8
      },
      "sslpd": {
        "VmPeak": 10,
        "VmRSS": 4,
        "VmSize": 3
      },
      "statsd2": {
        "VmPeak": 7,
        "VmRSS": 4,
        "VmSize": 6
      },
      "sysd": {
        "VmPeak": 9,
        "VmRSS": 9,
        "VmSize": 2
      },
      "tunneld": {
        "VmPeak": 10,
        "VmRSS": 3,
        "VmSize": 7
      }
    },
    "timestamp": 8
  },
  {
    "processstate": {
      "cifsproxyd": {
        "VmPeak": 5,
        "VmRSS": 6,
        "VmSize": 10
      },
      "jsond": {
        "VmPeak": 2,
        "VmRSS": 4,
        "VmSize": 3
      },
      "mgmtd": {
        "VmPeak": 10,
        "VmRSS": 5,
        "VmSize": 9
      },
      "netflowd": {
        "VmPeak": 5,
        "VmRSS": 3,
        "VmSize": 5
      },
      "node": {
        "VmPeak": 1,
        "VmRSS": 3,
        "VmSize": 3
      },
      "pm": {
        "VmPeak": 2,
        "VmRSS": 4,
        "VmSize": 5
      },
      "snmpd": {
        "VmPeak": 10,
        "VmRSS": 1,
        "VmSize": 3
      },
      "sslpd": {
        "VmPeak": 9,
        "VmRSS": 2,
        "VmSize": 8
      },
      "statsd2": {
        "VmPeak": 10,
        "VmRSS": 10,
        "VmSize": 9
      },
      "sysd": {
        "VmPeak": 7,
        "VmRSS": 8,
        "VmSize": 1
      },
      "tunneld": {
        "VmPeak": 8,
        "VmRSS": 6,
        "VmSize": 9
      }
    },
    "timestamp": 10
  },
  {
    "processstate": {
      "cifsproxyd": {
        "VmPeak": 9,
        "VmRSS": 3,
        "VmSize": 6
      },
      "jsond": {
        "VmPeak": 5,
        "VmRSS": 8,
        "VmSize": 9
      },
      "mgmtd": {
        "VmPeak": 5,
        "VmRSS": 3,
        "VmSize": 8
      },
      "netflowd": {
        "VmPeak": 7,
        "VmRSS": 2,
        "VmSize": 2
      },
      "node": {
        "VmPeak": 8,
        "VmRSS": 7,
        "VmSize": 4
      },
      "pm": {
        "VmPeak": 4,
        "VmRSS": 6,
        "VmSize": 4
      },
      "snmpd": {
        "VmPeak": 8,
        "VmRSS": 3,
        "VmSize": 2
      },
      "sslpd": {
        "VmPeak": 9,
        "VmRSS": 9,
        "VmSize": 5
      },
      "statsd2": {
        "VmPeak": 1,
        "VmRSS": 2,
        "VmSize": 7
      },
      "sysd": {
        "VmPeak": 10,
        "VmRSS": 1,
        "VmSize": 7
      },
      "tunneld": {
        "VmPeak": 7,
        "VmRSS": 2,
        "VmSize": 8
      }
    },
    "timestamp": 3
  },
  {
    "processstate": {
      "cifsproxyd": {
        "VmPeak": 10,
        "VmRSS": 7,
        "VmSize": 7
      },
      "jsond": {
        "VmPeak": 9,
        "VmRSS": 10,
        "VmSize": 6
      },
      "mgmtd": {
        "VmPeak": 7,
        "VmRSS": 7,
        "VmSize": 5
      },
      "netflowd": {
        "VmPeak": 9,
        "VmRSS": 4,
        "VmSize": 8
      },
      "node": {
        "VmPeak": 4,
        "VmRSS": 8,
        "VmSize": 4
      },
      "pm": {
        "VmPeak": 2,
        "VmRSS": 8,
        "VmSize": 6
      },
      "snmpd": {
        "VmPeak": 10,
        "VmRSS": 7,
        "VmSize": 9
      },
      "sslpd": {
        "VmPeak": 9,
        "VmRSS": 10,
        "VmSize": 5
      },
      "statsd2": {
        "VmPeak": 9,
        "VmRSS": 3,
        "VmSize": 2
      },
      "sysd": {
        "VmPeak": 5,
        "VmRSS": 9,
        "VmSize": 3
      },
      "tunneld": {
        "VmPeak": 1,
        "VmRSS": 4,
        "VmSize": 6
      }
    },
    "timestamp": 6
  }
]