{
  "contact": {
    "email": "string",
    "name": "string",
    "phoneNumber": "string"
  },
  "location": {
    "address": "string",
    "address2": "string",
    "city": "string",
    "country": "string",
    "state": "string",
    "zipCode": "string"
  },
  "overlaySettings": {
    "ipsecUdpPort": "string",
    "isUserDefinedIPSecUDPPort": false
  }
}