{
  "IP": "string",
  "applianceId": 8,
  "bypass": true,
  "discoveredFrom": 2,
  "dynamicUuid": "string",
  "groupId": "string",
  "hardwareRevision": "string",
  "hasUnsavedChanges": true,
  "hostName": "string",
  "id": "string",
  "ip": "string",
  "latitude": 8,
  "longitude": 2,
  "mode": "string",
  "model": "string",
  "nePk": "string",
  "networkRole": "string",
  "password": "string",
  "portalObjectId": "string",
  "reachabilityChannel": 5,
  "rebootRequired": true,
  "serial": "string",
  "site": "string",
  "sitePriority": 9,
  "softwareVersion": "string",
  "startupTime": 3,
  "state": 5,
  "systemBandwidth": 1,
  "userName": "string",
  "uuid": "string",
  "webProtocol": "string",
  "webProtocolType": 5
}