[
  {
    "isReadOnlyPartition": true,
    "partitionEndTime": "string",
    "partitionName": "string",
    "partitionSize": 9,
    "partitionStartTime": "string",
    "readOnlyPartition": true,
    "rows": 3,
    "tableName": "string"
  }
]