{
  "accountKey": "string",
  "accountName": "string",
  "emails": [
    "string",
    "string",
    "string"
  ],
  "enabled": true,
  "group": "string",
  "pendingPoll": false,
  "registered": true,
  "site": "string"
}