{
  "actions": [
    {
      "name": "loopbackGet",
      "protocol": "REST",
      "method": "GET",
      "entitypath": "{base_path}/{version}/virtualif/loopback/{pathv1}?{query}",
      "requestSchema": "schema.json",
      "responseSchema": "schema.json",
      "timeout": 0,
      "sendEmpty": false,
      "sendGetBody": false,
      "requestDatatype": "JSON",
      "responseDatatype": "JSON",
      "headers": {},
      "responseObjects": [
        {
          "type": "default",
          "key": "",
          "mockFile": "mockdatafiles/loopbackGet-default.json"
        }
      ]
    },
    {
      "name": "vtiGet",
      "protocol": "REST",
      "method": "GET",
      "entitypath": "{base_path}/{version}/virtualif/vti/{pathv1}?{query}",
      "requestSchema": "schema.json",
      "responseSchema": "schema.json",
      "timeout": 0,
      "sendEmpty": false,
      "sendGetBody": false,
      "requestDatatype": "JSON",
      "responseDatatype": "JSON",
      "headers": {},
      "responseObjects": [
        {
          "type": "default",
          "key": "",
          "mockFile": "mockdatafiles/vtiGet-default.json"
        }
      ]
    }
  ]
}