[
  {
    "enabled": false,
    "name": "string"
  },
  {
    "enabled": false,
    "name": "string"
  },
  {
    "enabled": true,
    "name": "string"
  },
  {
    "enabled": false,
    "name": "string"
  }
]