{
  "actions": [
    {
      "name": "configDelete",
      "protocol": "REST",
      "method": "POST",
      "entitypath": "{base_path}/{version}/config/delete?{query}",
      "requestSchema": "schema.json",
      "responseSchema": "schema.json",
      "timeout": 0,
      "sendEmpty": false,
      "requestDatatype": "JSON",
      "responseDatatype": "JSON",
      "headers": {},
      "responseObjects": [
        {
          "type": "default",
          "key": "",
          "mockFile": ""
        }
      ]
    },
    {
      "name": "configGet",
      "protocol": "REST",
      "method": "GET",
      "entitypath": "{base_path}/{version}/config/get?{query}",
      "requestSchema": "schema.json",
      "responseSchema": "schema.json",
      "timeout": 0,
      "sendEmpty": false,
      "sendGetBody": false,
      "requestDatatype": "JSON",
      "responseDatatype": "JSON",
      "headers": {},
      "responseObjects": [
        {
          "type": "default",
          "key": "",
          "mockFile": "mockdatafiles/configGet-default.json"
        }
      ]
    },
    {
      "name": "configGetCategories",
      "protocol": "REST",
      "method": "GET",
      "entitypath": "{base_path}/{version}/config/getCategories?{query}",
      "requestSchema": "schema.json",
      "responseSchema": "schema.json",
      "timeout": 0,
      "sendEmpty": false,
      "sendGetBody": false,
      "requestDatatype": "JSON",
      "responseDatatype": "JSON",
      "headers": {},
      "responseObjects": [
        {
          "type": "default",
          "key": "",
          "mockFile": "mockdatafiles/configGetCategories-default.json"
        }
      ]
    },
    {
      "name": "configList",
      "protocol": "REST",
      "method": "GET",
      "entitypath": "{base_path}/{version}/config/list?{query}",
      "requestSchema": "schema.json",
      "responseSchema": "schema.json",
      "timeout": 0,
      "sendEmpty": false,
      "sendGetBody": false,
      "requestDatatype": "JSON",
      "responseDatatype": "JSON",
      "headers": {},
      "responseObjects": [
        {
          "type": "default",
          "key": "",
          "mockFile": "mockdatafiles/configList-default.json"
        }
      ]
    },
    {
      "name": "storageConfigList",
      "protocol": "REST",
      "method": "GET",
      "entitypath": "{base_path}/{version}/config/listStoragePlugins?{query}",
      "requestSchema": "schema.json",
      "responseSchema": "schema.json",
      "timeout": 0,
      "sendEmpty": false,
      "sendGetBody": false,
      "requestDatatype": "JSON",
      "responseDatatype": "JSON",
      "headers": {},
      "responseObjects": [
        {
          "type": "default",
          "key": "",
          "mockFile": "mockdatafiles/storageConfigList-default.json"
        }
      ]
    },
    {
      "name": "configMetaList",
      "protocol": "REST",
      "method": "GET",
      "entitypath": "{base_path}/{version}/config/metaList?{query}",
      "requestSchema": "schema.json",
      "responseSchema": "schema.json",
      "timeout": 0,
      "sendEmpty": false,
      "sendGetBody": false,
      "requestDatatype": "JSON",
      "responseDatatype": "JSON",
      "headers": {},
      "responseObjects": [
        {
          "type": "default",
          "key": "",
          "mockFile": "mockdatafiles/configMetaList-default.json"
        }
      ]
    },
    {
      "name": "refresh",
      "protocol": "REST",
      "method": "POST",
      "entitypath": "{base_path}/{version}/config/refresh?{query}",
      "requestSchema": "schema.json",
      "responseSchema": "schema.json",
      "timeout": 0,
      "sendEmpty": false,
      "requestDatatype": "JSON",
      "responseDatatype": "JSON",
      "headers": {},
      "responseObjects": [
        {
          "type": "default",
          "key": "",
          "mockFile": "mockdatafiles/refresh-default.json"
        }
      ]
    },
    {
      "name": "restart",
      "protocol": "REST",
      "method": "POST",
      "entitypath": "{base_path}/{version}/config/restart?{query}",
      "requestSchema": "schema.json",
      "responseSchema": "schema.json",
      "timeout": 0,
      "sendEmpty": false,
      "requestDatatype": "JSON",
      "responseDatatype": "JSON",
      "headers": {},
      "responseObjects": [
        {
          "type": "default",
          "key": "",
          "mockFile": "mockdatafiles/restart-default.json"
        }
      ]
    },
    {
      "name": "configSave",
      "protocol": "REST",
      "method": "POST",
      "entitypath": "{base_path}/{version}/config/save?{query}",
      "requestSchema": "schema.json",
      "responseSchema": "schema.json",
      "timeout": 0,
      "sendEmpty": false,
      "requestDatatype": "JSON",
      "responseDatatype": "JSON",
      "headers": {},
      "responseObjects": [
        {
          "type": "default",
          "key": "",
          "mockFile": "mockdatafiles/configSave-default.json"
        }
      ]
    },
    {
      "name": "storageConfigSave",
      "protocol": "REST",
      "method": "POST",
      "entitypath": "{base_path}/{version}/config/saveStoragePlugins?{query}",
      "requestSchema": "schema.json",
      "responseSchema": "schema.json",
      "timeout": 0,
      "sendEmpty": false,
      "requestDatatype": "JSON",
      "responseDatatype": "JSON",
      "headers": {},
      "responseObjects": [
        {
          "type": "default",
          "key": "",
          "mockFile": "mockdatafiles/storageConfigSave-default.json"
        }
      ]
    }
  ]
}