[
  {
    "name": "string",
    "id": "string",
    "token": "string",
    "creator": "string",
    "user": "string",
    "roles": [
      "string"
    ],
    "expiration": "string",
    "expired": true
  },
  {
    "name": "string",
    "id": "string",
    "token": "string",
    "creator": "string",
    "user": "string",
    "roles": [
      "string"
    ],
    "expiration": "string",
    "expired": true
  },
  {
    "name": "string",
    "id": "string",
    "token": "string",
    "creator": "string",
    "user": "string",
    "roles": [
      "string",
      "string"
    ],
    "expiration": "string",
    "expired": true
  }
]