{
  "actions": [
    {
      "name": "apiSystemAcls",
      "protocol": "REST",
      "method": "GET",
      "entitypath": "{base_path}/{version}/system/acl/{pathv1}?{query}",
      "requestSchema": "schema.json",
      "responseSchema": "schema.json",
      "timeout": 0,
      "sendEmpty": false,
      "sendGetBody": false,
      "requestDatatype": "JSON",
      "responseDatatype": "JSON",
      "headers": {},
      "responseObjects": [
        {
          "type": "default",
          "key": "",
          "mockFile": "mockdatafiles/apiSystemAcls-default.json"
        }
      ]
    },
    {
      "name": "apiSystemAclsPUTDocs",
      "protocol": "REST",
      "method": "PUT",
      "entitypath": "{base_path}/{version}/system/acl/{pathv1}?{query}",
      "requestSchema": "schema.json",
      "responseSchema": "schema.json",
      "timeout": 0,
      "sendEmpty": false,
      "requestDatatype": "JSON",
      "responseDatatype": "JSON",
      "headers": {},
      "responseObjects": [
        {
          "type": "default",
          "key": "",
          "mockFile": "mockdatafiles/apiSystemAclsPUTDocs-default.json"
        }
      ]
    },
    {
      "name": "apiSystemAclsPOSTDocs",
      "protocol": "REST",
      "method": "POST",
      "entitypath": "{base_path}/{version}/system/acl/{pathv1}?{query}",
      "requestSchema": "schema.json",
      "responseSchema": "schema.json",
      "timeout": 0,
      "sendEmpty": false,
      "requestDatatype": "JSON",
      "responseDatatype": "JSON",
      "headers": {},
      "responseObjects": [
        {
          "type": "default",
          "key": "",
          "mockFile": ""
        }
      ]
    },
    {
      "name": "apiSystemAclsDELETEDocs",
      "protocol": "REST",
      "method": "DELETE",
      "entitypath": "{base_path}/{version}/system/acl/{pathv1}?{query}",
      "requestSchema": "schema.json",
      "responseSchema": "schema.json",
      "timeout": 0,
      "sendEmpty": false,
      "requestDatatype": "JSON",
      "responseDatatype": "JSON",
      "headers": {},
      "responseObjects": [
        {
          "type": "default",
          "key": "",
          "mockFile": ""
        }
      ]
    }
  ]
}