[
  {
    "id": "string",
    "time": "string",
    "event": {},
    "batchKey": "string",
    "error": "string",
    "routingResults": [
      {
        "event": {
          "meta": {
            "id": "string"
          },
          "event": {}
        },
        "ruleRoutingResults": [
          {
            "ruleEvaluation": {
              "satisfied": true,
              "rule": {
                "name": "string",
                "description": "string",
                "debug": false,
                "enabled": true,
                "policy": "all",
                "jobId": "string",
                "jobArgString": "string",
                "jobOptions": [
                  {
                    "name": "string",
                    "value": "string"
                  },
                  {
                    "name": "string",
                    "value": "string"
                  },
                  {
                    "name": "string",
                    "value": "string"
                  },
                  {
                    "name": "string",
                    "value": "string"
                  },
                  {
                    "name": "string",
                    "value": "string"
                  },
                  {
                    "name": "string",
                    "value": "string"
                  }
                ],
                "nodeFilter": "string",
                "user": "string",
                "conditions": [
                  {
                    "path": "string",
                    "value": "string",
                    "condition": "dateTimeBefore"
                  },
                  {
                    "path": "string",
                    "value": "string",
                    "condition": "exists"
                  },
                  {
                    "path": "string",
                    "value": "string",
                    "condition": "dateTimeAfter"
                  },
                  {
                    "path": "string",
                    "value": "string",
                    "condition": "dateTimeBefore"
                  },
                  {
                    "path": "string",
                    "value": "string",
                    "condition": "exists"
                  },
                  {
                    "path": "string",
                    "value": "string",
                    "condition": "contains"
                  },
                  {
                    "path": "string",
                    "value": "string",
                    "condition": "dateTimeAfter"
                  }
                ]
              },
              "conditionEvaluations": [
                {
                  "satisfied": false,
                  "value": {},
                  "condition": {
                    "path": "string",
                    "value": "string",
                    "condition": "dateTimeAfter"
                  },
                  "error": {}
                },
                {
                  "satisfied": true,
                  "value": {},
                  "condition": {
                    "path": "string",
                    "value": "string",
                    "condition": "isA"
                  },
                  "error": {}
                },
                {
                  "satisfied": false,
                  "value": {},
                  "condition": {
                    "path": "string",
                    "value": "string",
                    "condition": "isA"
                  },
                  "error": {}
                },
                {
                  "satisfied": true,
                  "value": {},
                  "condition": {
                    "path": "string",
                    "value": "string",
                    "condition": "dateTimeAfter"
                  },
                  "error": {}
                },
                {
                  "satisfied": false,
                  "value": {},
                  "condition": {
                    "path": "string",
                    "value": "string",
                    "condition": "dateTimeBefore"
                  },
                  "error": {}
                },
                {
                  "satisfied": true,
                  "value": {},
                  "condition": {
                    "path": "string",
                    "value": "string",
                    "condition": "equals"
                  },
                  "error": {}
                },
                {
                  "satisfied": true,
                  "value": {},
                  "condition": {
                    "path": "string",
                    "value": "string",
                    "condition": "isA"
                  },
                  "error": {}
                },
                {
                  "satisfied": false,
                  "value": {},
                  "condition": {
                    "path": "string",
                    "value": "string",
                    "condition": "dateTimeAfter"
                  },
                  "error": {}
                },
                {
                  "satisfied": true,
                  "value": {},
                  "condition": {
                    "path": "string",
                    "value": "string",
                    "condition": "isA"
                  },
                  "error": {}
                },
                {
                  "satisfied": false,
                  "value": {},
                  "condition": {
                    "path": "string",
                    "value": "string",
                    "condition": "equals"
                  },
                  "error": {}
                }
              ]
            },
            "jobRunStatus": "NOT_STARTED",
            "jobId": "string",
            "executionId": "string",
            "errorMsg": "string",
            "renderedOptions": {}
          },
          {
            "ruleEvaluation": {
              "satisfied": false,
              "rule": {
                "name": "string",
                "description": "string",
                "debug": true,
                "enabled": false,
                "policy": "all",
                "jobId": "string",
                "jobArgString": "string",
                "jobOptions": [
                  {
                    "name": "string",
                    "value": "string"
                  },
                  {
                    "name": "string",
                    "value": "string"
                  },
                  {
                    "name": "string",
                    "value": "string"
                  },
                  {
                    "name": "string",
                    "value": "string"
                  },
                  {
                    "name": "string",
                    "value": "string"
                  },
                  {
                    "name": "string",
                    "value": "string"
                  },
                  {
                    "name": "string",
                    "value": "string"
                  },
                  {
                    "name": "string",
                    "value": "string"
                  }
                ],
                "nodeFilter": "string",
                "user": "string",
                "conditions": [
                  {
                    "path": "string",
                    "value": "string",
                    "condition": "dateTimeAfter"
                  },
                  {
                    "path": "string",
                    "value": "string",
                    "condition": "equals"
                  },
                  {
                    "path": "string",
                    "value": "string",
                    "condition": "dateTimeBefore"
                  },
                  {
                    "path": "string",
                    "value": "string",
                    "condition": "dateTimeAfter"
                  },
                  {
                    "path": "string",
                    "value": "string",
                    "condition": "equals"
                  },
                  {
                    "path": "string",
                    "value": "string",
                    "condition": "contains"
                  },
                  {
                    "path": "string",
                    "value": "string",
                    "condition": "isA"
                  },
                  {
                    "path": "string",
                    "value": "string",
                    "condition": "equals"
                  },
                  {
                    "path": "string",
                    "value": "string",
                    "condition": "dateTimeBefore"
                  }
                ]
              },
              "conditionEvaluations": [
                {
                  "satisfied": false,
                  "value": {},
                  "condition": {
                    "path": "string",
                    "value": "string",
                    "condition": "dateTimeBefore"
                  },
                  "error": {}
                },
                {
                  "satisfied": true,
                  "value": {},
                  "condition": {
                    "path": "string",
                    "value": "string",
                    "condition": "contains"
                  },
                  "error": {}
                }
              ]
            },
            "jobRunStatus": "NOT_FOUND",
            "jobId": "string",
            "executionId": "string",
            "errorMsg": "string",
            "renderedOptions": {}
          },
          {
            "ruleEvaluation": {
              "satisfied": false,
              "rule": {
                "name": "string",
                "description": "string",
                "debug": false,
                "enabled": true,
                "policy": "any",
                "jobId": "string",
                "jobArgString": "string",
                "jobOptions": [
                  {
                    "name": "string",
                    "value": "string"
                  },
                  {
                    "name": "string",
                    "value": "string"
                  },
                  {
                    "name": "string",
                    "value": "string"
                  },
                  {
                    "name": "string",
                    "value": "string"
                  },
                  {
                    "name": "string",
                    "value": "string"
                  },
                  {
                    "name": "string",
                    "value": "string"
                  },
                  {
                    "name": "string",
                    "value": "string"
                  },
                  {
                    "name": "string",
                    "value": "string"
                  },
                  {
                    "name": "string",
                    "value": "string"
                  },
                  {
                    "name": "string",
                    "value": "string"
                  }
                ],
                "nodeFilter": "string",
                "user": "string",
                "conditions": [
                  {
                    "path": "string",
                    "value": "string",
                    "condition": "dateTimeBefore"
                  },
                  {
                    "path": "string",
                    "value": "string",
                    "condition": "contains"
                  }
                ]
              },
              "conditionEvaluations": [
                {
                  "satisfied": true,
                  "value": {},
                  "condition": {
                    "path": "string",
                    "value": "string",
                    "condition": "contains"
                  },
                  "error": {}
                },
                {
                  "satisfied": true,
                  "value": {},
                  "condition": {
                    "path": "string",
                    "value": "string",
                    "condition": "isA"
                  },
                  "error": {}
                },
                {
                  "satisfied": false,
                  "value": {},
                  "condition": {
                    "path": "string",
                    "value": "string",
                    "condition": "isA"
                  },
                  "error": {}
                },
                {
                  "satisfied": false,
                  "value": {},
                  "condition": {
                    "path": "string",
                    "value": "string",
                    "condition": "isA"
                  },
                  "error": {}
                },
                {
                  "satisfied": false,
                  "value": {},
                  "condition": {
                    "path": "string",
                    "value": "string",
                    "condition": "equals"
                  },
                  "error": {}
                },
                {
                  "satisfied": true,
                  "value": {},
                  "condition": {
                    "path": "string",
                    "value": "string",
                    "condition": "isA"
                  },
                  "error": {}
                }
              ]
            },
            "jobRunStatus": "NOT_STARTED",
            "jobId": "string",
            "executionId": "string",
            "errorMsg": "string",
            "renderedOptions": {}
          },
          {
            "ruleEvaluation": {
              "satisfied": true,
              "rule": {
                "name": "string",
                "description": "string",
                "debug": true,
                "enabled": false,
                "policy": "all",
                "jobId": "string",
                "jobArgString": "string",
                "jobOptions": [
                  {
                    "name": "string",
                    "value": "string"
                  },
                  {
                    "name": "string",
                    "value": "string"
                  }
                ],
                "nodeFilter": "string",
                "user": "string",
                "conditions": [
                  {
                    "path": "string",
                    "value": "string",
                    "condition": "equals"
                  },
                  {
                    "path": "string",
                    "value": "string",
                    "condition": "dateTimeAfter"
                  },
                  {
                    "path": "string",
                    "value": "string",
                    "condition": "dateTimeBefore"
                  },
                  {
                    "path": "string",
                    "value": "string",
                    "condition": "dateTimeAfter"
                  },
                  {
                    "path": "string",
                    "value": "string",
                    "condition": "dateTimeAfter"
                  },
                  {
                    "path": "string",
                    "value": "string",
                    "condition": "contains"
                  },
                  {
                    "path": "string",
                    "value": "string",
                    "condition": "dateTimeBefore"
                  },
                  {
                    "path": "string",
                    "value": "string",
                    "condition": "isA"
                  },
                  {
                    "path": "string",
                    "value": "string",
                    "condition": "dateTimeAfter"
                  },
                  {
                    "path": "string",
                    "value": "string",
                    "condition": "equals"
                  }
                ]
              },
              "conditionEvaluations": [
                {
                  "satisfied": false,
                  "value": {},
                  "condition": {
                    "path": "string",
                    "value": "string",
                    "condition": "contains"
                  },
                  "error": {}
                },
                {
                  "satisfied": false,
                  "value": {},
                  "condition": {
                    "path": "string",
                    "value": "string",
                    "condition": "isA"
                  },
                  "error": {}
                },
                {
                  "satisfied": true,
                  "value": {},
                  "condition": {
                    "path": "string",
                    "value": "string",
                    "condition": "exists"
                  },
                  "error": {}
                },
                {
                  "satisfied": false,
                  "value": {},
                  "condition": {
                    "path": "string",
                    "value": "string",
                    "condition": "contains"
                  },
                  "error": {}
                },
                {
                  "satisfied": true,
                  "value": {},
                  "condition": {
                    "path": "string",
                    "value": "string",
                    "condition": "dateTimeAfter"
                  },
                  "error": {}
                },
                {
                  "satisfied": true,
                  "value": {},
                  "condition": {
                    "path": "string",
                    "value": "string",
                    "condition": "contains"
                  },
                  "error": {}
                }
              ]
            },
            "jobRunStatus": "UNKNOWN_ERROR",
            "jobId": "string",
            "executionId": "string",
            "errorMsg": "string",
            "renderedOptions": {}
          },
          {
            "ruleEvaluation": {
              "satisfied": true,
              "rule": {
                "name": "string",
                "description": "string",
                "debug": true,
                "enabled": true,
                "policy": "all",
                "jobId": "string",
                "jobArgString": "string",
                "jobOptions": [
                  {
                    "name": "string",
                    "value": "string"
                  }
                ],
                "nodeFilter": "string",
                "user": "string",
                "conditions": [
                  {
                    "path": "string",
                    "value": "string",
                    "condition": "contains"
                  }
                ]
              },
              "conditionEvaluations": [
                {
                  "satisfied": true,
                  "value": {},
                  "condition": {
                    "path": "string",
                    "value": "string",
                    "condition": "isA"
                  },
                  "error": {}
                },
                {
                  "satisfied": true,
                  "value": {},
                  "condition": {
                    "path": "string",
                    "value": "string",
                    "condition": "contains"
                  },
                  "error": {}
                },
                {
                  "satisfied": false,
                  "value": {},
                  "condition": {
                    "path": "string",
                    "value": "string",
                    "condition": "exists"
                  },
                  "error": {}
                },
                {
                  "satisfied": false,
                  "value": {},
                  "condition": {
                    "path": "string",
                    "value": "string",
                    "condition": "isA"
                  },
                  "error": {}
                },
                {
                  "satisfied": true,
                  "value": {},
                  "condition": {
                    "path": "string",
                    "value": "string",
                    "condition": "dateTimeBefore"
                  },
                  "error": {}
                },
                {
                  "satisfied": true,
                  "value": {},
                  "condition": {
                    "path": "string",
                    "value": "string",
                    "condition": "equals"
                  },
                  "error": {}
                },
                {
                  "satisfied": true,
                  "value": {},
                  "condition": {
                    "path": "string",
                    "value": "string",
                    "condition": "dateTimeBefore"
                  },
                  "error": {}
                },
                {
                  "satisfied": false,
                  "value": {},
                  "condition": {
                    "path": "string",
                    "value": "string",
                    "condition": "isA"
                  },
                  "error": {}
                },
                {
                  "satisfied": false,
                  "value": {},
                  "condition": {
                    "path": "string",
                    "value": "string",
                    "condition": "equals"
                  },
                  "error": {}
                }
              ]
            },
            "jobRunStatus": "NOT_FOUND",
            "jobId": "string",
            "executionId": "string",
            "errorMsg": "string",
            "renderedOptions": {}
          },
          {
            "ruleEvaluation": {
              "satisfied": true,
              "rule": {
                "name": "string",
                "description": "string",
                "debug": true,
                "enabled": true,
                "policy": "any",
                "jobId": "string",
                "jobArgString": "string",
                "jobOptions": [
                  {
                    "name": "string",
                    "value": "string"
                  },
                  {
                    "name": "string",
                    "value": "string"
                  },
                  {
                    "name": "string",
                    "value": "string"
                  },
                  {
                    "name": "string",
                    "value": "string"
                  },
                  {
                    "name": "string",
                    "value": "string"
                  },
                  {
                    "name": "string",
                    "value": "string"
                  },
                  {
                    "name": "string",
                    "value": "string"
                  },
                  {
                    "name": "string",
                    "value": "string"
                  },
                  {
                    "name": "string",
                    "value": "string"
                  },
                  {
                    "name": "string",
                    "value": "string"
                  }
                ],
                "nodeFilter": "string",
                "user": "string",
                "conditions": [
                  {
                    "path": "string",
                    "value": "string",
                    "condition": "equals"
                  },
                  {
                    "path": "string",
                    "value": "string",
                    "condition": "contains"
                  },
                  {
                    "path": "string",
                    "value": "string",
                    "condition": "isA"
                  },
                  {
                    "path": "string",
                    "value": "string",
                    "condition": "exists"
                  },
                  {
                    "path": "string",
                    "value": "string",
                    "condition": "dateTimeAfter"
                  },
                  {
                    "path": "string",
                    "value": "string",
                    "condition": "contains"
                  },
                  {
                    "path": "string",
                    "value": "string",
                    "condition": "dateTimeAfter"
                  },
                  {
                    "path": "string",
                    "value": "string",
                    "condition": "contains"
                  }
                ]
              },
              "conditionEvaluations": [
                {
                  "satisfied": false,
                  "value": {},
                  "condition": {
                    "path": "string",
                    "value": "string",
                    "condition": "equals"
                  },
                  "error": {}
                },
                {
                  "satisfied": true,
                  "value": {},
                  "condition": {
                    "path": "string",
                    "value": "string",
                    "condition": "equals"
                  },
                  "error": {}
                },
                {
                  "satisfied": false,
                  "value": {},
                  "condition": {
                    "path": "string",
                    "value": "string",
                    "condition": "dateTimeAfter"
                  },
                  "error": {}
                },
                {
                  "satisfied": true,
                  "value": {},
                  "condition": {
                    "path": "string",
                    "value": "string",
                    "condition": "dateTimeAfter"
                  },
                  "error": {}
                }
              ]
            },
            "jobRunStatus": "UNKNOWN_ERROR",
            "jobId": "string",
            "executionId": "string",
            "errorMsg": "string",
            "renderedOptions": {}
          }
        ]
      },
      {
        "event": {
          "meta": {
            "id": "string"
          },
          "event": {}
        },
        "ruleRoutingResults": [
          {
            "ruleEvaluation": {
              "satisfied": false,
              "rule": {
                "name": "string",
                "description": "string",
                "debug": false,
                "enabled": false,
                "policy": "any",
                "jobId": "string",
                "jobArgString": "string",
                "jobOptions": [
                  {
                    "name": "string",
                    "value": "string"
                  },
                  {
                    "name": "string",
                    "value": "string"
                  },
                  {
                    "name": "string",
                    "value": "string"
                  },
                  {
                    "name": "string",
                    "value": "string"
                  },
                  {
                    "name": "string",
                    "value": "string"
                  },
                  {
                    "name": "string",
                    "value": "string"
                  },
                  {
                    "name": "string",
                    "value": "string"
                  },
                  {
                    "name": "string",
                    "value": "string"
                  }
                ],
                "nodeFilter": "string",
                "user": "string",
                "conditions": [
                  {
                    "path": "string",
                    "value": "string",
                    "condition": "dateTimeBefore"
                  },
                  {
                    "path": "string",
                    "value": "string",
                    "condition": "exists"
                  },
                  {
                    "path": "string",
                    "value": "string",
                    "condition": "isA"
                  },
                  {
                    "path": "string",
                    "value": "string",
                    "condition": "contains"
                  },
                  {
                    "path": "string",
                    "value": "string",
                    "condition": "contains"
                  },
                  {
                    "path": "string",
                    "value": "string",
                    "condition": "equals"
                  },
                  {
                    "path": "string",
                    "value": "string",
                    "condition": "equals"
                  },
                  {
                    "path": "string",
                    "value": "string",
                    "condition": "dateTimeBefore"
                  },
                  {
                    "path": "string",
                    "value": "string",
                    "condition": "exists"
                  },
                  {
                    "path": "string",
                    "value": "string",
                    "condition": "exists"
                  }
                ]
              },
              "conditionEvaluations": [
                {
                  "satisfied": true,
                  "value": {},
                  "condition": {
                    "path": "string",
                    "value": "string",
                    "condition": "isA"
                  },
                  "error": {}
                },
                {
                  "satisfied": true,
                  "value": {},
                  "condition": {
                    "path": "string",
                    "value": "string",
                    "condition": "equals"
                  },
                  "error": {}
                },
                {
                  "satisfied": false,
                  "value": {},
                  "condition": {
                    "path": "string",
                    "value": "string",
                    "condition": "exists"
                  },
                  "error": {}
                },
                {
                  "satisfied": true,
                  "value": {},
                  "condition": {
                    "path": "string",
                    "value": "string",
                    "condition": "isA"
                  },
                  "error": {}
                }
              ]
            },
            "jobRunStatus": "NOT_FOUND",
            "jobId": "string",
            "executionId": "string",
            "errorMsg": "string",
            "renderedOptions": {}
          },
          {
            "ruleEvaluation": {
              "satisfied": false,
              "rule": {
                "name": "string",
                "description": "string",
                "debug": true,
                "enabled": true,
                "policy": "all",
                "jobId": "string",
                "jobArgString": "string",
                "jobOptions": [
                  {
                    "name": "string",
                    "value": "string"
                  },
                  {
                    "name": "string",
                    "value": "string"
                  },
                  {
                    "name": "string",
                    "value": "string"
                  }
                ],
                "nodeFilter": "string",
                "user": "string",
                "conditions": [
                  {
                    "path": "string",
                    "value": "string",
                    "condition": "contains"
                  },
                  {
                    "path": "string",
                    "value": "string",
                    "condition": "contains"
                  }
                ]
              },
              "conditionEvaluations": [
                {
                  "satisfied": false,
                  "value": {},
                  "condition": {
                    "path": "string",
                    "value": "string",
                    "condition": "exists"
                  },
                  "error": {}
                }
              ]
            },
            "jobRunStatus": "NOT_FOUND",
            "jobId": "string",
            "executionId": "string",
            "errorMsg": "string",
            "renderedOptions": {}
          },
          {
            "ruleEvaluation": {
              "satisfied": true,
              "rule": {
                "name": "string",
                "description": "string",
                "debug": false,
                "enabled": true,
                "policy": "any",
                "jobId": "string",
                "jobArgString": "string",
                "jobOptions": [
                  {
                    "name": "string",
                    "value": "string"
                  },
                  {
                    "name": "string",
                    "value": "string"
                  },
                  {
                    "name": "string",
                    "value": "string"
                  },
                  {
                    "name": "string",
                    "value": "string"
                  },
                  {
                    "name": "string",
                    "value": "string"
                  }
                ],
                "nodeFilter": "string",
                "user": "string",
                "conditions": [
                  {
                    "path": "string",
                    "value": "string",
                    "condition": "dateTimeAfter"
                  },
                  {
                    "path": "string",
                    "value": "string",
                    "condition": "contains"
                  },
                  {
                    "path": "string",
                    "value": "string",
                    "condition": "dateTimeBefore"
                  },
                  {
                    "path": "string",
                    "value": "string",
                    "condition": "contains"
                  },
                  {
                    "path": "string",
                    "value": "string",
                    "condition": "dateTimeAfter"
                  },
                  {
                    "path": "string",
                    "value": "string",
                    "condition": "dateTimeAfter"
                  },
                  {
                    "path": "string",
                    "value": "string",
                    "condition": "exists"
                  },
                  {
                    "path": "string",
                    "value": "string",
                    "condition": "equals"
                  },
                  {
                    "path": "string",
                    "value": "string",
                    "condition": "isA"
                  }
                ]
              },
              "conditionEvaluations": [
                {
                  "satisfied": true,
                  "value": {},
                  "condition": {
                    "path": "string",
                    "value": "string",
                    "condition": "dateTimeBefore"
                  },
                  "error": {}
                },
                {
                  "satisfied": false,
                  "value": {},
                  "condition": {
                    "path": "string",
                    "value": "string",
                    "condition": "exists"
                  },
                  "error": {}
                },
                {
                  "satisfied": true,
                  "value": {},
                  "condition": {
                    "path": "string",
                    "value": "string",
                    "condition": "dateTimeBefore"
                  },
                  "error": {}
                },
                {
                  "satisfied": true,
                  "value": {},
                  "condition": {
                    "path": "string",
                    "value": "string",
                    "condition": "exists"
                  },
                  "error": {}
                },
                {
                  "satisfied": false,
                  "value": {},
                  "condition": {
                    "path": "string",
                    "value": "string",
                    "condition": "exists"
                  },
                  "error": {}
                }
              ]
            },
            "jobRunStatus": "UNKNOWN_ERROR",
            "jobId": "string",
            "executionId": "string",
            "errorMsg": "string",
            "renderedOptions": {}
          },
          {
            "ruleEvaluation": {
              "satisfied": true,
              "rule": {
                "name": "string",
                "description": "string",
                "debug": true,
                "enabled": true,
                "policy": "all",
                "jobId": "string",
                "jobArgString": "string",
                "jobOptions": [
                  {
                    "name": "string",
                    "value": "string"
                  },
                  {
                    "name": "string",
                    "value": "string"
                  },
                  {
                    "name": "string",
                    "value": "string"
                  },
                  {
                    "name": "string",
                    "value": "string"
                  }
                ],
                "nodeFilter": "string",
                "user": "string",
                "conditions": [
                  {
                    "path": "string",
                    "value": "string",
                    "condition": "dateTimeAfter"
                  },
                  {
                    "path": "string",
                    "value": "string",
                    "condition": "contains"
                  },
                  {
                    "path": "string",
                    "value": "string",
                    "condition": "dateTimeBefore"
                  },
                  {
                    "path": "string",
                    "value": "string",
                    "condition": "dateTimeBefore"
                  },
                  {
                    "path": "string",
                    "value": "string",
                    "condition": "exists"
                  },
                  {
                    "path": "string",
                    "value": "string",
                    "condition": "equals"
                  },
                  {
                    "path": "string",
                    "value": "string",
                    "condition": "contains"
                  }
                ]
              },
              "conditionEvaluations": [
                {
                  "satisfied": false,
                  "value": {},
                  "condition": {
                    "path": "string",
                    "value": "string",
                    "condition": "dateTimeBefore"
                  },
                  "error": {}
                },
                {
                  "satisfied": false,
                  "value": {},
                  "condition": {
                    "path": "string",
                    "value": "string",
                    "condition": "dateTimeBefore"
                  },
                  "error": {}
                },
                {
                  "satisfied": false,
                  "value": {},
                  "condition": {
                    "path": "string",
                    "value": "string",
                    "condition": "dateTimeAfter"
                  },
                  "error": {}
                },
                {
                  "satisfied": false,
                  "value": {},
                  "condition": {
                    "path": "string",
                    "value": "string",
                    "condition": "isA"
                  },
                  "error": {}
                },
                {
                  "satisfied": false,
                  "value": {},
                  "condition": {
                    "path": "string",
                    "value": "string",
                    "condition": "dateTimeAfter"
                  },
                  "error": {}
                },
                {
                  "satisfied": false,
                  "value": {},
                  "condition": {
                    "path": "string",
                    "value": "string",
                    "condition": "dateTimeAfter"
                  },
                  "error": {}
                },
                {
                  "satisfied": false,
                  "value": {},
                  "condition": {
                    "path": "string",
                    "value": "string",
                    "condition": "exists"
                  },
                  "error": {}
                }
              ]
            },
            "jobRunStatus": "UNKNOWN_ERROR",
            "jobId": "string",
            "executionId": "string",
            "errorMsg": "string",
            "renderedOptions": {}
          },
          {
            "ruleEvaluation": {
              "satisfied": true,
              "rule": {
                "name": "string",
                "description": "string",
                "debug": false,
                "enabled": true,
                "policy": "all",
                "jobId": "string",
                "jobArgString": "string",
                "jobOptions": [
                  {
                    "name": "string",
                    "value": "string"
                  },
                  {
                    "name": "string",
                    "value": "string"
                  },
                  {
                    "name": "string",
                    "value": "string"
                  },
                  {
                    "name": "string",
                    "value": "string"
                  }
                ],
                "nodeFilter": "string",
                "user": "string",
                "conditions": [
                  {
                    "path": "string",
                    "value": "string",
                    "condition": "dateTimeAfter"
                  },
                  {
                    "path": "string",
                    "value": "string",
                    "condition": "isA"
                  },
                  {
                    "path": "string",
                    "value": "string",
                    "condition": "dateTimeAfter"
                  },
                  {
                    "path": "string",
                    "value": "string",
                    "condition": "dateTimeBefore"
                  },
                  {
                    "path": "string",
                    "value": "string",
                    "condition": "isA"
                  },
                  {
                    "path": "string",
                    "value": "string",
                    "condition": "isA"
                  },
                  {
                    "path": "string",
                    "value": "string",
                    "condition": "exists"
                  }
                ]
              },
              "conditionEvaluations": [
                {
                  "satisfied": true,
                  "value": {},
                  "condition": {
                    "path": "string",
                    "value": "string",
                    "condition": "dateTimeAfter"
                  },
                  "error": {}
                },
                {
                  "satisfied": false,
                  "value": {},
                  "condition": {
                    "path": "string",
                    "value": "string",
                    "condition": "dateTimeBefore"
                  },
                  "error": {}
                },
                {
                  "satisfied": false,
                  "value": {},
                  "condition": {
                    "path": "string",
                    "value": "string",
                    "condition": "isA"
                  },
                  "error": {}
                }
              ]
            },
            "jobRunStatus": "NOT_FOUND",
            "jobId": "string",
            "executionId": "string",
            "errorMsg": "string",
            "renderedOptions": {}
          },
          {
            "ruleEvaluation": {
              "satisfied": true,
              "rule": {
                "name": "string",
                "description": "string",
                "debug": false,
                "enabled": true,
                "policy": "all",
                "jobId": "string",
                "jobArgString": "string",
                "jobOptions": [
                  {
                    "name": "string",
                    "value": "string"
                  },
                  {
                    "name": "string",
                    "value": "string"
                  },
                  {
                    "name": "string",
                    "value": "string"
                  }
                ],
                "nodeFilter": "string",
                "user": "string",
                "conditions": [
                  {
                    "path": "string",
                    "value": "string",
                    "condition": "contains"
                  },
                  {
                    "path": "string",
                    "value": "string",
                    "condition": "exists"
                  },
                  {
                    "path": "string",
                    "value": "string",
                    "condition": "equals"
                  },
                  {
                    "path": "string",
                    "value": "string",
                    "condition": "dateTimeAfter"
                  },
                  {
                    "path": "string",
                    "value": "string",
                    "condition": "equals"
                  },
                  {
                    "path": "string",
                    "value": "string",
                    "condition": "dateTimeBefore"
                  }
                ]
              },
              "conditionEvaluations": [
                {
                  "satisfied": true,
                  "value": {},
                  "condition": {
                    "path": "string",
                    "value": "string",
                    "condition": "dateTimeAfter"
                  },
                  "error": {}
                },
                {
                  "satisfied": false,
                  "value": {},
                  "condition": {
                    "path": "string",
                    "value": "string",
                    "condition": "equals"
                  },
                  "error": {}
                },
                {
                  "satisfied": true,
                  "value": {},
                  "condition": {
                    "path": "string",
                    "value": "string",
                    "condition": "contains"
                  },
                  "error": {}
                }
              ]
            },
            "jobRunStatus": "NOT_FOUND",
            "jobId": "string",
            "executionId": "string",
            "errorMsg": "string",
            "renderedOptions": {}
          },
          {
            "ruleEvaluation": {
              "satisfied": false,
              "rule": {
                "name": "string",
                "description": "string",
                "debug": true,
                "enabled": true,
                "policy": "all",
                "jobId": "string",
                "jobArgString": "string",
                "jobOptions": [
                  {
                    "name": "string",
                    "value": "string"
                  },
                  {
                    "name": "string",
                    "value": "string"
                  },
                  {
                    "name": "string",
                    "value": "string"
                  }
                ],
                "nodeFilter": "string",
                "user": "string",
                "conditions": [
                  {
                    "path": "string",
                    "value": "string",
                    "condition": "exists"
                  },
                  {
                    "path": "string",
                    "value": "string",
                    "condition": "contains"
                  },
                  {
                    "path": "string",
                    "value": "string",
                    "condition": "contains"
                  }
                ]
              },
              "conditionEvaluations": [
                {
                  "satisfied": true,
                  "value": {},
                  "condition": {
                    "path": "string",
                    "value": "string",
                    "condition": "dateTimeBefore"
                  },
                  "error": {}
                },
                {
                  "satisfied": true,
                  "value": {},
                  "condition": {
                    "path": "string",
                    "value": "string",
                    "condition": "contains"
                  },
                  "error": {}
                },
                {
                  "satisfied": false,
                  "value": {},
                  "condition": {
                    "path": "string",
                    "value": "string",
                    "condition": "isA"
                  },
                  "error": {}
                },
                {
                  "satisfied": true,
                  "value": {},
                  "condition": {
                    "path": "string",
                    "value": "string",
                    "condition": "equals"
                  },
                  "error": {}
                },
                {
                  "satisfied": false,
                  "value": {},
                  "condition": {
                    "path": "string",
                    "value": "string",
                    "condition": "dateTimeBefore"
                  },
                  "error": {}
                },
                {
                  "satisfied": true,
                  "value": {},
                  "condition": {
                    "path": "string",
                    "value": "string",
                    "condition": "dateTimeAfter"
                  },
                  "error": {}
                },
                {
                  "satisfied": false,
                  "value": {},
                  "condition": {
                    "path": "string",
                    "value": "string",
                    "condition": "exists"
                  },
                  "error": {}
                }
              ]
            },
            "jobRunStatus": "NOT_STARTED",
            "jobId": "string",
            "executionId": "string",
            "errorMsg": "string",
            "renderedOptions": {}
          },
          {
            "ruleEvaluation": {
              "satisfied": true,
              "rule": {
                "name": "string",
                "description": "string",
                "debug": false,
                "enabled": true,
                "policy": "all",
                "jobId": "string",
                "jobArgString": "string",
                "jobOptions": [
                  {
                    "name": "string",
                    "value": "string"
                  },
                  {
                    "name": "string",
                    "value": "string"
                  },
                  {
                    "name": "string",
                    "value": "string"
                  },
                  {
                    "name": "string",
                    "value": "string"
                  },
                  {
                    "name": "string",
                    "value": "string"
                  }
                ],
                "nodeFilter": "string",
                "user": "string",
                "conditions": [
                  {
                    "path": "string",
                    "value": "string",
                    "condition": "dateTimeBefore"
                  },
                  {
                    "path": "string",
                    "value": "string",
                    "condition": "contains"
                  },
                  {
                    "path": "string",
                    "value": "string",
                    "condition": "dateTimeBefore"
                  }
                ]
              },
              "conditionEvaluations": [
                {
                  "satisfied": false,
                  "value": {},
                  "condition": {
                    "path": "string",
                    "value": "string",
                    "condition": "isA"
                  },
                  "error": {}
                },
                {
                  "satisfied": true,
                  "value": {},
                  "condition": {
                    "path": "string",
                    "value": "string",
                    "condition": "equals"
                  },
                  "error": {}
                },
                {
                  "satisfied": true,
                  "value": {},
                  "condition": {
                    "path": "string",
                    "value": "string",
                    "condition": "dateTimeAfter"
                  },
                  "error": {}
                },
                {
                  "satisfied": true,
                  "value": {},
                  "condition": {
                    "path": "string",
                    "value": "string",
                    "condition": "isA"
                  },
                  "error": {}
                },
                {
                  "satisfied": false,
                  "value": {},
                  "condition": {
                    "path": "string",
                    "value": "string",
                    "condition": "exists"
                  },
                  "error": {}
                },
                {
                  "satisfied": false,
                  "value": {},
                  "condition": {
                    "path": "string",
                    "value": "string",
                    "condition": "dateTimeBefore"
                  },
                  "error": {}
                }
              ]
            },
            "jobRunStatus": "NOT_STARTED",
            "jobId": "string",
            "executionId": "string",
            "errorMsg": "string",
            "renderedOptions": {}
          },
          {
            "ruleEvaluation": {
              "satisfied": true,
              "rule": {
                "name": "string",
                "description": "string",
                "debug": true,
                "enabled": false,
                "policy": "all",
                "jobId": "string",
                "jobArgString": "string",
                "jobOptions": [
                  {
                    "name": "string",
                    "value": "string"
                  },
                  {
                    "name": "string",
                    "value": "string"
                  },
                  {
                    "name": "string",
                    "value": "string"
                  }
                ],
                "nodeFilter": "string",
                "user": "string",
                "conditions": [
                  {
                    "path": "string",
                    "value": "string",
                    "condition": "contains"
                  },
                  {
                    "path": "string",
                    "value": "string",
                    "condition": "isA"
                  },
                  {
                    "path": "string",
                    "value": "string",
                    "condition": "dateTimeAfter"
                  }
                ]
              },
              "conditionEvaluations": [
                {
                  "satisfied": false,
                  "value": {},
                  "condition": {
                    "path": "string",
                    "value": "string",
                    "condition": "dateTimeBefore"
                  },
                  "error": {}
                },
                {
                  "satisfied": false,
                  "value": {},
                  "condition": {
                    "path": "string",
                    "value": "string",
                    "condition": "contains"
                  },
                  "error": {}
                },
                {
                  "satisfied": false,
                  "value": {},
                  "condition": {
                    "path": "string",
                    "value": "string",
                    "condition": "dateTimeBefore"
                  },
                  "error": {}
                },
                {
                  "satisfied": false,
                  "value": {},
                  "condition": {
                    "path": "string",
                    "value": "string",
                    "condition": "isA"
                  },
                  "error": {}
                },
                {
                  "satisfied": true,
                  "value": {},
                  "condition": {
                    "path": "string",
                    "value": "string",
                    "condition": "contains"
                  },
                  "error": {}
                },
                {
                  "satisfied": true,
                  "value": {},
                  "condition": {
                    "path": "string",
                    "value": "string",
                    "condition": "dateTimeBefore"
                  },
                  "error": {}
                },
                {
                  "satisfied": true,
                  "value": {},
                  "condition": {
                    "path": "string",
                    "value": "string",
                    "condition": "dateTimeBefore"
                  },
                  "error": {}
                },
                {
                  "satisfied": false,
                  "value": {},
                  "condition": {
                    "path": "string",
                    "value": "string",
                    "condition": "equals"
                  },
                  "error": {}
                },
                {
                  "satisfied": true,
                  "value": {},
                  "condition": {
                    "path": "string",
                    "value": "string",
                    "condition": "equals"
                  },
                  "error": {}
                }
              ]
            },
            "jobRunStatus": "NOT_FOUND",
            "jobId": "string",
            "executionId": "string",
            "errorMsg": "string",
            "renderedOptions": {}
          }
        ]
      },
      {
        "event": {
          "meta": {
            "id": "string"
          },
          "event": {}
        },
        "ruleRoutingResults": [
          {
            "ruleEvaluation": {
              "satisfied": true,
              "rule": {
                "name": "string",
                "description": "string",
                "debug": true,
                "enabled": false,
                "policy": "any",
                "jobId": "string",
                "jobArgString": "string",
                "jobOptions": [
                  {
                    "name": "string",
                    "value": "string"
                  },
                  {
                    "name": "string",
                    "value": "string"
                  },
                  {
                    "name": "string",
                    "value": "string"
                  },
                  {
                    "name": "string",
                    "value": "string"
                  },
                  {
                    "name": "string",
                    "value": "string"
                  },
                  {
                    "name": "string",
                    "value": "string"
                  },
                  {
                    "name": "string",
                    "value": "string"
                  },
                  {
                    "name": "string",
                    "value": "string"
                  },
                  {
                    "name": "string",
                    "value": "string"
                  },
                  {
                    "name": "string",
                    "value": "string"
                  }
                ],
                "nodeFilter": "string",
                "user": "string",
                "conditions": [
                  {
                    "path": "string",
                    "value": "string",
                    "condition": "isA"
                  },
                  {
                    "path": "string",
                    "value": "string",
                    "condition": "contains"
                  },
                  {
                    "path": "string",
                    "value": "string",
                    "condition": "dateTimeBefore"
                  },
                  {
                    "path": "string",
                    "value": "string",
                    "condition": "contains"
                  },
                  {
                    "path": "string",
                    "value": "string",
                    "condition": "equals"
                  },
                  {
                    "path": "string",
                    "value": "string",
                    "condition": "dateTimeAfter"
                  },
                  {
                    "path": "string",
                    "value": "string",
                    "condition": "exists"
                  },
                  {
                    "path": "string",
                    "value": "string",
                    "condition": "isA"
                  }
                ]
              },
              "conditionEvaluations": [
                {
                  "satisfied": true,
                  "value": {},
                  "condition": {
                    "path": "string",
                    "value": "string",
                    "condition": "exists"
                  },
                  "error": {}
                },
                {
                  "satisfied": false,
                  "value": {},
                  "condition": {
                    "path": "string",
                    "value": "string",
                    "condition": "exists"
                  },
                  "error": {}
                },
                {
                  "satisfied": false,
                  "value": {},
                  "condition": {
                    "path": "string",
                    "value": "string",
                    "condition": "isA"
                  },
                  "error": {}
                },
                {
                  "satisfied": false,
                  "value": {},
                  "condition": {
                    "path": "string",
                    "value": "string",
                    "condition": "equals"
                  },
                  "error": {}
                },
                {
                  "satisfied": true,
                  "value": {},
                  "condition": {
                    "path": "string",
                    "value": "string",
                    "condition": "exists"
                  },
                  "error": {}
                },
                {
                  "satisfied": false,
                  "value": {},
                  "condition": {
                    "path": "string",
                    "value": "string",
                    "condition": "dateTimeAfter"
                  },
                  "error": {}
                },
                {
                  "satisfied": true,
                  "value": {},
                  "condition": {
                    "path": "string",
                    "value": "string",
                    "condition": "equals"
                  },
                  "error": {}
                },
                {
                  "satisfied": false,
                  "value": {},
                  "condition": {
                    "path": "string",
                    "value": "string",
                    "condition": "dateTimeBefore"
                  },
                  "error": {}
                },
                {
                  "satisfied": true,
                  "value": {},
                  "condition": {
                    "path": "string",
                    "value": "string",
                    "condition": "dateTimeBefore"
                  },
                  "error": {}
                }
              ]
            },
            "jobRunStatus": "NOT_STARTED",
            "jobId": "string",
            "executionId": "string",
            "errorMsg": "string",
            "renderedOptions": {}
          }
        ]
      },
      {
        "event": {
          "meta": {
            "id": "string"
          },
          "event": {}
        },
        "ruleRoutingResults": [
          {
            "ruleEvaluation": {
              "satisfied": false,
              "rule": {
                "name": "string",
                "description": "string",
                "debug": true,
                "enabled": true,
                "policy": "all",
                "jobId": "string",
                "jobArgString": "string",
                "jobOptions": [
                  {
                    "name": "string",
                    "value": "string"
                  },
                  {
                    "name": "string",
                    "value": "string"
                  },
                  {
                    "name": "string",
                    "value": "string"
                  },
                  {
                    "name": "string",
                    "value": "string"
                  },
                  {
                    "name": "string",
                    "value": "string"
                  },
                  {
                    "name": "string",
                    "value": "string"
                  },
                  {
                    "name": "string",
                    "value": "string"
                  },
                  {
                    "name": "string",
                    "value": "string"
                  },
                  {
                    "name": "string",
                    "value": "string"
                  }
                ],
                "nodeFilter": "string",
                "user": "string",
                "conditions": [
                  {
                    "path": "string",
                    "value": "string",
                    "condition": "equals"
                  },
                  {
                    "path": "string",
                    "value": "string",
                    "condition": "exists"
                  },
                  {
                    "path": "string",
                    "value": "string",
                    "condition": "exists"
                  },
                  {
                    "path": "string",
                    "value": "string",
                    "condition": "dateTimeAfter"
                  }
                ]
              },
              "conditionEvaluations": [
                {
                  "satisfied": true,
                  "value": {},
                  "condition": {
                    "path": "string",
                    "value": "string",
                    "condition": "exists"
                  },
                  "error": {}
                },
                {
                  "satisfied": false,
                  "value": {},
                  "condition": {
                    "path": "string",
                    "value": "string",
                    "condition": "contains"
                  },
                  "error": {}
                },
                {
                  "satisfied": false,
                  "value": {},
                  "condition": {
                    "path": "string",
                    "value": "string",
                    "condition": "isA"
                  },
                  "error": {}
                },
                {
                  "satisfied": false,
                  "value": {},
                  "condition": {
                    "path": "string",
                    "value": "string",
                    "condition": "isA"
                  },
                  "error": {}
                },
                {
                  "satisfied": true,
                  "value": {},
                  "condition": {
                    "path": "string",
                    "value": "string",
                    "condition": "contains"
                  },
                  "error": {}
                },
                {
                  "satisfied": false,
                  "value": {},
                  "condition": {
                    "path": "string",
                    "value": "string",
                    "condition": "exists"
                  },
                  "error": {}
                },
                {
                  "satisfied": false,
                  "value": {},
                  "condition": {
                    "path": "string",
                    "value": "string",
                    "condition": "dateTimeAfter"
                  },
                  "error": {}
                },
                {
                  "satisfied": false,
                  "value": {},
                  "condition": {
                    "path": "string",
                    "value": "string",
                    "condition": "isA"
                  },
                  "error": {}
                },
                {
                  "satisfied": true,
                  "value": {},
                  "condition": {
                    "path": "string",
                    "value": "string",
                    "condition": "isA"
                  },
                  "error": {}
                }
              ]
            },
            "jobRunStatus": "UNKNOWN_ERROR",
            "jobId": "string",
            "executionId": "string",
            "errorMsg": "string",
            "renderedOptions": {}
          },
          {
            "ruleEvaluation": {
              "satisfied": false,
              "rule": {
                "name": "string",
                "description": "string",
                "debug": true,
                "enabled": false,
                "policy": "any",
                "jobId": "string",
                "jobArgString": "string",
                "jobOptions": [
                  {
                    "name": "string",
                    "value": "string"
                  },
                  {
                    "name": "string",
                    "value": "string"
                  },
                  {
                    "name": "string",
                    "value": "string"
                  },
                  {
                    "name": "string",
                    "value": "string"
                  },
                  {
                    "name": "string",
                    "value": "string"
                  },
                  {
                    "name": "string",
                    "value": "string"
                  },
                  {
                    "name": "string",
                    "value": "string"
                  },
                  {
                    "name": "string",
                    "value": "string"
                  },
                  {
                    "name": "string",
                    "value": "string"
                  }
                ],
                "nodeFilter": "string",
                "user": "string",
                "conditions": [
                  {
                    "path": "string",
                    "value": "string",
                    "condition": "exists"
                  },
                  {
                    "path": "string",
                    "value": "string",
                    "condition": "isA"
                  },
                  {
                    "path": "string",
                    "value": "string",
                    "condition": "dateTimeBefore"
                  },
                  {
                    "path": "string",
                    "value": "string",
                    "condition": "equals"
                  },
                  {
                    "path": "string",
                    "value": "string",
                    "condition": "isA"
                  },
                  {
                    "path": "string",
                    "value": "string",
                    "condition": "isA"
                  },
                  {
                    "path": "string",
                    "value": "string",
                    "condition": "equals"
                  },
                  {
                    "path": "string",
                    "value": "string",
                    "condition": "dateTimeBefore"
                  }
                ]
              },
              "conditionEvaluations": [
                {
                  "satisfied": true,
                  "value": {},
                  "condition": {
                    "path": "string",
                    "value": "string",
                    "condition": "dateTimeAfter"
                  },
                  "error": {}
                }
              ]
            },
            "jobRunStatus": "STARTED",
            "jobId": "string",
            "executionId": "string",
            "errorMsg": "string",
            "renderedOptions": {}
          },
          {
            "ruleEvaluation": {
              "satisfied": false,
              "rule": {
                "name": "string",
                "description": "string",
                "debug": true,
                "enabled": true,
                "policy": "any",
                "jobId": "string",
                "jobArgString": "string",
                "jobOptions": [
                  {
                    "name": "string",
                    "value": "string"
                  },
                  {
                    "name": "string",
                    "value": "string"
                  },
                  {
                    "name": "string",
                    "value": "string"
                  },
                  {
                    "name": "string",
                    "value": "string"
                  },
                  {
                    "name": "string",
                    "value": "string"
                  }
                ],
                "nodeFilter": "string",
                "user": "string",
                "conditions": [
                  {
                    "path": "string",
                    "value": "string",
                    "condition": "exists"
                  },
                  {
                    "path": "string",
                    "value": "string",
                    "condition": "exists"
                  },
                  {
                    "path": "string",
                    "value": "string",
                    "condition": "contains"
                  },
                  {
                    "path": "string",
                    "value": "string",
                    "condition": "exists"
                  },
                  {
                    "path": "string",
                    "value": "string",
                    "condition": "dateTimeBefore"
                  },
                  {
                    "path": "string",
                    "value": "string",
                    "condition": "contains"
                  },
                  {
                    "path": "string",
                    "value": "string",
                    "condition": "exists"
                  },
                  {
                    "path": "string",
                    "value": "string",
                    "condition": "contains"
                  },
                  {
                    "path": "string",
                    "value": "string",
                    "condition": "exists"
                  },
                  {
                    "path": "string",
                    "value": "string",
                    "condition": "dateTimeBefore"
                  }
                ]
              },
              "conditionEvaluations": [
                {
                  "satisfied": true,
                  "value": {},
                  "condition": {
                    "path": "string",
                    "value": "string",
                    "condition": "isA"
                  },
                  "error": {}
                },
                {
                  "satisfied": false,
                  "value": {},
                  "condition": {
                    "path": "string",
                    "value": "string",
                    "condition": "dateTimeAfter"
                  },
                  "error": {}
                },
                {
                  "satisfied": false,
                  "value": {},
                  "condition": {
                    "path": "string",
                    "value": "string",
                    "condition": "contains"
                  },
                  "error": {}
                },
                {
                  "satisfied": false,
                  "value": {},
                  "condition": {
                    "path": "string",
                    "value": "string",
                    "condition": "isA"
                  },
                  "error": {}
                }
              ]
            },
            "jobRunStatus": "NOT_STARTED",
            "jobId": "string",
            "executionId": "string",
            "errorMsg": "string",
            "renderedOptions": {}
          },
          {
            "ruleEvaluation": {
              "satisfied": true,
              "rule": {
                "name": "string",
                "description": "string",
                "debug": false,
                "enabled": false,
                "policy": "any",
                "jobId": "string",
                "jobArgString": "string",
                "jobOptions": [
                  {
                    "name": "string",
                    "value": "string"
                  }
                ],
                "nodeFilter": "string",
                "user": "string",
                "conditions": [
                  {
                    "path": "string",
                    "value": "string",
                    "condition": "isA"
                  },
                  {
                    "path": "string",
                    "value": "string",
                    "condition": "dateTimeAfter"
                  },
                  {
                    "path": "string",
                    "value": "string",
                    "condition": "equals"
                  },
                  {
                    "path": "string",
                    "value": "string",
                    "condition": "dateTimeBefore"
                  },
                  {
                    "path": "string",
                    "value": "string",
                    "condition": "dateTimeAfter"
                  },
                  {
                    "path": "string",
                    "value": "string",
                    "condition": "contains"
                  },
                  {
                    "path": "string",
                    "value": "string",
                    "condition": "exists"
                  },
                  {
                    "path": "string",
                    "value": "string",
                    "condition": "dateTimeAfter"
                  }
                ]
              },
              "conditionEvaluations": [
                {
                  "satisfied": false,
                  "value": {},
                  "condition": {
                    "path": "string",
                    "value": "string",
                    "condition": "equals"
                  },
                  "error": {}
                },
                {
                  "satisfied": false,
                  "value": {},
                  "condition": {
                    "path": "string",
                    "value": "string",
                    "condition": "exists"
                  },
                  "error": {}
                }
              ]
            },
            "jobRunStatus": "NOT_FOUND",
            "jobId": "string",
            "executionId": "string",
            "errorMsg": "string",
            "renderedOptions": {}
          }
        ]
      }
    ]
  }
]