{
  "requestCount": 5,
  "allsuccessful": false,
  "successCount": 2,
  "failedCount": 3,
  "failures": [
    {
      "id": "82",
      "message": "Not found: 82"
    },
    {
      "id": "83",
      "message": "Not found: 83"
    },
    {
      "id": "84",
      "message": "Not found: 84"
    }
  ]
}