{
  "actions": [
    {
      "name": "getTransportControllerGroupsV2",
      "protocol": "REST",
      "method": "GET",
      "entitypath": "{base_path}/{version}/transportControllerGroups/v2?{query}",
      "requestSchema": "schema.json",
      "responseSchema": "schema.json",
      "timeout": 0,
      "sendEmpty": false,
      "sendGetBody": false,
      "requestDatatype": "JSON",
      "responseDatatype": "JSON",
      "headers": {},
      "responseObjects": [
        {
          "type": "default",
          "key": "",
          "mockFile": ""
        }
      ]
    },
    {
      "name": "postTransportControllerGroupsV2",
      "protocol": "REST",
      "method": "POST",
      "entitypath": "{base_path}/{version}/transportControllerGroups/v2?{query}",
      "requestSchema": "schema.json",
      "responseSchema": "schema.json",
      "timeout": 0,
      "sendEmpty": false,
      "requestDatatype": "JSON",
      "responseDatatype": "JSON",
      "headers": {},
      "responseObjects": [
        {
          "type": "default",
          "key": "",
          "mockFile": ""
        }
      ]
    },
    {
      "name": "deleteTransportControllerGroupsV2",
      "protocol": "REST",
      "method": "DELETE",
      "entitypath": "{base_path}/{version}/transportControllerGroups/v2?{query}",
      "requestSchema": "schema.json",
      "responseSchema": "schema.json",
      "timeout": 0,
      "sendEmpty": false,
      "requestDatatype": "JSON",
      "responseDatatype": "JSON",
      "headers": {},
      "responseObjects": [
        {
          "type": "default",
          "key": "",
          "mockFile": ""
        }
      ]
    },
    {
      "name": "getTransportControllerGroupsV2TransportControllerGroupName",
      "protocol": "REST",
      "method": "GET",
      "entitypath": "{base_path}/{version}/transportControllerGroups/v2/{pathv1}?{query}",
      "requestSchema": "schema.json",
      "responseSchema": "schema.json",
      "timeout": 0,
      "sendEmpty": false,
      "sendGetBody": false,
      "requestDatatype": "JSON",
      "responseDatatype": "JSON",
      "headers": {},
      "responseObjects": [
        {
          "type": "default",
          "key": "",
          "mockFile": ""
        }
      ]
    },
    {
      "name": "putTransportControllerGroupsV2TransportControllerGroupName",
      "protocol": "REST",
      "method": "PUT",
      "entitypath": "{base_path}/{version}/transportControllerGroups/v2/{pathv1}?{query}",
      "requestSchema": "schema.json",
      "responseSchema": "schema.json",
      "timeout": 0,
      "sendEmpty": false,
      "requestDatatype": "JSON",
      "responseDatatype": "JSON",
      "headers": {},
      "responseObjects": [
        {
          "type": "default",
          "key": "",
          "mockFile": ""
        }
      ]
    },
    {
      "name": "postTransportControllerGroupsV2TransportControllerGroupName",
      "protocol": "REST",
      "method": "POST",
      "entitypath": "{base_path}/{version}/transportControllerGroups/v2/{pathv1}?{query}",
      "requestSchema": "schema.json",
      "responseSchema": "schema.json",
      "timeout": 0,
      "sendEmpty": false,
      "requestDatatype": "JSON",
      "responseDatatype": "JSON",
      "headers": {},
      "responseObjects": [
        {
          "type": "default",
          "key": "",
          "mockFile": ""
        }
      ]
    },
    {
      "name": "deleteTransportControllerGroupsV2TransportControllerGroupName",
      "protocol": "REST",
      "method": "DELETE",
      "entitypath": "{base_path}/{version}/transportControllerGroups/v2/{pathv1}?{query}",
      "requestSchema": "schema.json",
      "responseSchema": "schema.json",
      "timeout": 0,
      "sendEmpty": false,
      "requestDatatype": "JSON",
      "responseDatatype": "JSON",
      "headers": {},
      "responseObjects": [
        {
          "type": "default",
          "key": "",
          "mockFile": ""
        }
      ]
    }
  ]
}