{
    "$id": ".system-schemaTokenReq_MFA_Step_2.json",
    "type": "object",
    "schema": "http://json-schema.org/draft-07/schema#",
    "translate": true,
    "dynamicfields": true,
    "properties": {
      "ph_request_type": {
        "type": "string",
        "description": "type of request (internal to adapter)",
        "default": "MFA_Step_2",
        "enum": [
          "MFA_Step_2"
        ],
        "external_name": "ph_request_type"
      },
      "scopeId": {
        "type": "string",
        "description": "scopeId",
        "external_name": "scope_id"
      }
    },
    "definitions": {}
  }