{
  "status": "AUTHENTICATED",
  "user_id": "781d4678b18",
  "accessToken": "garbagetoken",
  "scopes": [
      {
          "id": "cb43a7fb-903f-4e81-b6ca-86f980f8ec68",
          "name": "default",
          "display_name": "default",
          "type": "SP"
      },
      {
          "id": "8b43d1e1-2737-4333-ac52-82020537377d",
          "name": "northstar",
          "display_name": "northstar",
          "type": "Tenant",
          "parent_id": "cb43a7fb-903f-4e81-b6ca-86f980f8ec68",
          "parent_name": "default",
          "parent_type": "SP"
      },
      {
          "id": "a6d7b958-7541-42b7-97d8-befa924664f2",
          "name": "tm",
          "display_name": "tm",
          "type": "Tenant",
          "parent_id": "cb43a7fb-903f-4e81-b6ca-86f980f8ec68",
          "parent_name": "default",
          "parent_type": "SP"
      },
      {
          "id": "e9539c7f-4565-472a-91ed-95f573f4a320",
          "name": "ems-dmon",
          "display_name": "ems-dmon",
          "type": "Tenant",
          "parent_id": "cb43a7fb-903f-4e81-b6ca-86f980f8ec68",
          "parent_name": "default",
          "parent_type": "SP"
      }
  ],
  "identity_provider_type": "Local"
}