{
  "bundle": {
    "name": "PrimaryBundle",
    "auto_approve": true,
    "id": "enrollment_bundles-3",
    "automatic_tags": [
      {
        "id": "enrollment_bundles_automatic_tags-4",
        "name": "Location",
        "value": "Brisbane"
      }
    ],
    "nodes": [],
    "templates": [
      "templates-4",
      "templates-5"
    ],
    "token": "BCDEFGHIJKLMNOPQRSTUVWXYZ123456",
    "manifest_link": "/api/v1.1/bundles/enrollment_bundles-3/manifest"
  }
}