{
  "$id": "schema.json",
  "type": "object",
  "schema": "http://json-schema.org/draft-07/schema#",
  "translate": true,
  "dynamicfields": true,
  "properties": {
    "ph_request_type": {
      "type": "string",
      "description": "type of request (internal to adapter)",
      "default": "getInterfaces",
      "enum": [
        "getInterfaces",
        "getInterfacesId",
        "putInterfacesId"
      ],
      "external_name": "ph_request_type"
    },
    "perPage": {
      "type": "number",
      "description": "Number of interfaces expected per page",
      "parse": false,
      "encode": false,
      "encrypt": {
        "type": "AES",
        "key": ""
      },
      "external_name": "per_page"
    }
  },
  "definitions": {}
}