{
  "node": {
    "tag_list": {
      "id": "nodes-3",
      "rights": {
        "delete": true,
        "create": true,
        "modify": true
      },
      "tags": []
    },
    "etags": [],
    "rights": {
      "view_template_push_status": true,
      "delete": true,
      "view_config_sync_status": true,
      "modify": true
    },
    "status": "Pending",
    "approved": true,
    "runtime_status": {
      "change_delta": 0,
      "change_time": 1535071583,
      "action_status": "in progress",
      "id": "nodes-3",
      "action_error_message": "",
      "action_type": "registration",
      "connection_status": "never seen"
    },
    "config_push_status": {},
    "id": "nodes-3",
    "enrollment_bundle": "Global",
    "name": "nodes-3",
    "interfaces": [],
    "ports": []
  }
}