{
  "actions": [
    {
      "name": "getPorts",
      "protocol": "REST",
      "method": "GET",
      "entitypath": "{base_path}/{version}/ports?{query}",
      "requestSchema": "schema.json",
      "responseSchema": "schema.json",
      "timeout": 0,
      "sendEmpty": false,
      "sendGetBody": false,
      "requestDatatype": "JSON",
      "responseDatatype": "JSON",
      "headers": {},
      "responseObjects": [
        {
          "type": "default",
          "key": "",
          "mockFile": "mockdatafiles/getPorts-default.json"
        }
      ]
    },
    {
      "name": "getPortsId",
      "protocol": "REST",
      "method": "GET",
      "entitypath": "{base_path}/{version}/ports/{pathv1}?{query}",
      "requestSchema": "schema.json",
      "responseSchema": "schema.json",
      "timeout": 0,
      "sendEmpty": false,
      "sendGetBody": false,
      "requestDatatype": "JSON",
      "responseDatatype": "JSON",
      "headers": {},
      "responseObjects": [
        {
          "type": "default",
          "key": "",
          "mockFile": ""
        }
      ]
    },
    {
      "name": "getPortsSmartgroups",
      "protocol": "REST",
      "method": "GET",
      "entitypath": "{base_path}/{version}/ports/smartgroups?{query}",
      "requestSchema": "schema.json",
      "responseSchema": "schema.json",
      "timeout": 0,
      "sendEmpty": false,
      "sendGetBody": false,
      "requestDatatype": "JSON",
      "responseDatatype": "JSON",
      "headers": {},
      "responseObjects": [
        {
          "type": "default",
          "key": "",
          "mockFile": "mockdatafiles/getPortsSmartgroups-default.json"
        }
      ]
    },
    {
      "name": "postPortsSmartgroups",
      "protocol": "REST",
      "method": "POST",
      "entitypath": "{base_path}/{version}/ports/smartgroups?{query}",
      "requestSchema": "schema.json",
      "responseSchema": "schema.json",
      "timeout": 0,
      "sendEmpty": false,
      "requestDatatype": "JSON",
      "responseDatatype": "JSON",
      "headers": {},
      "responseObjects": [
        {
          "type": "default",
          "key": "",
          "mockFile": "mockdatafiles/postPortsSmartgroups-default.json"
        }
      ]
    },
    {
      "name": "getPortsSmartgroupsId",
      "protocol": "REST",
      "method": "GET",
      "entitypath": "{base_path}/{version}/ports/smartgroups/{pathv1}?{query}",
      "requestSchema": "schema.json",
      "responseSchema": "schema.json",
      "timeout": 0,
      "sendEmpty": false,
      "sendGetBody": false,
      "requestDatatype": "JSON",
      "responseDatatype": "JSON",
      "headers": {},
      "responseObjects": [
        {
          "type": "default",
          "key": "",
          "mockFile": "mockdatafiles/getPortsSmartgroupsId-default.json"
        }
      ]
    },
    {
      "name": "putPortsSmartgroupsId",
      "protocol": "REST",
      "method": "PUT",
      "entitypath": "{base_path}/{version}/ports/smartgroups/{pathv1}?{query}",
      "requestSchema": "schema.json",
      "responseSchema": "schema.json",
      "timeout": 0,
      "sendEmpty": false,
      "requestDatatype": "JSON",
      "responseDatatype": "JSON",
      "headers": {},
      "responseObjects": [
        {
          "type": "default",
          "key": "",
          "mockFile": "mockdatafiles/putPortsSmartgroupsId-default.json"
        }
      ]
    },
    {
      "name": "deletePortsSmartgroupsId",
      "protocol": "REST",
      "method": "DELETE",
      "entitypath": "{base_path}/{version}/ports/smartgroups/{pathv1}?{query}",
      "requestSchema": "schema.json",
      "responseSchema": "schema.json",
      "timeout": 0,
      "sendEmpty": false,
      "requestDatatype": "JSON",
      "responseDatatype": "JSON",
      "headers": {},
      "responseObjects": [
        {
          "type": "default",
          "key": "",
          "mockFile": ""
        }
      ]
    }
  ]
}