{
  "actions": [
    {
      "name": "postV1CMDBNetworkSettings",
      "protocol": "REST",
      "method": "POST",
      "entitypath": "{base_path}/{version}/CMDB/NetworkSettings?{query}",
      "requestSchema": "schema.json",
      "responseSchema": "schema.json",
      "timeout": 0,
      "sendEmpty": false,
      "sendGetBody": false,
      "requestDatatype": "JSON",
      "responseDatatype": "JSON",
      "headers": {},
      "responseObjects": [
        {
          "type": "default",
          "key": "",
          "mockFile": ""
        }
      ]
    },
    {
      "name": "putV1CMDBNetworkSettings",
      "protocol": "REST",
      "method": "PUT",
      "entitypath": "{base_path}/{version}/CMDB/NetworkSettings?{query}",
      "requestSchema": "schema.json",
      "responseSchema": "schema.json",
      "timeout": 0,
      "sendEmpty": false,
      "sendGetBody": false,
      "requestDatatype": "JSON",
      "responseDatatype": "JSON",
      "headers": {},
      "responseObjects": [
        {
          "type": "default",
          "key": "",
          "mockFile": ""
        }
      ]
    },
    {
      "name": "deleteV1CMDBNetworkSettings",
      "protocol": "REST",
      "method": "DELETE",
      "entitypath": "{base_path}/{version}/CMDB/NetworkSettings?{query}",
      "requestSchema": "schema.json",
      "responseSchema": "schema.json",
      "timeout": 0,
      "sendEmpty": false,
      "sendGetBody": false,
      "requestDatatype": "JSON",
      "responseDatatype": "JSON",
      "headers": {},
      "responseObjects": [
        {
          "type": "default",
          "key": "",
          "mockFile": ""
        }
      ]
    },
    {
      "name": "getcmdbNetworkSettingsTelnetInfoCheckDeviceCount",
      "protocol": "REST",
      "method": "GET",
      "entitypath": "{base_path}/{version}/CMDB/NetworkSettings/TelnetInfo/CheckDeviceCount?{query}",
      "requestSchema": "schema.json",
      "responseSchema": "schema.json",
      "timeout": 0,
      "sendEmpty": false,
      "sendGetBody": false,
      "requestDatatype": "JSON",
      "responseDatatype": "JSON",
      "headers": {},
      "responseObjects": [
        {
          "type": "default",
          "key": "",
          "mockFile": ""
        }
      ]
    },
    {
      "name": "getcmdbNetworkSettingsTelnetInfoRefreshDeviceCount",
      "protocol": "REST",
      "method": "GET",
      "entitypath": "{base_path}/{version}/CMDB/NetworkSettings/TelnetInfo/RefreshDeviceCount?{query}",
      "requestSchema": "schema.json",
      "responseSchema": "schema.json",
      "timeout": 0,
      "sendEmpty": false,
      "sendGetBody": false,
      "requestDatatype": "JSON",
      "responseDatatype": "JSON",
      "headers": {},
      "responseObjects": [
        {
          "type": "default",
          "key": "",
          "mockFile": ""
        }
      ]
    }
  ]
}