{
  "$id": "schema.json",
  "type": "object",
  "schema": "http://json-schema.org/draft-07/schema#",
  "translate": false,
  "dynamicfields": true,
  "properties": {
    "ph_request_type": {
      "type": "string",
      "description": "type of request (internal to adapter)",
      "default": "postV1CMDBPathCalculation",
      "enum": [
        "postV1CMDBPathCalculation",
        "getV1CMDBPathCalculationTaskIDResult",
        "getV1CMDBPathGateways",
        "postV1CMDBPathCalculationStop"
      ],
      "external_name": "ph_request_type"
    }
  },
  "definitions": {}
}