{
  "$id": "schema.json",
  "type": "object",
  "schema": "http://json-schema.org/draft-07/schema#",
  "translate": true,
  "dynamicfields": true,
  "properties": {
    "ph_request_type": {
      "type": "string",
      "description": "type of request (internal to adapter)",
      "default": "getV1CMDBDevices",
      "enum": [
        "getV1CMDBDevices",
        "deleteV1CMDBDevices",
        "getV1CMDBDevicesGroupDevicesGroupName",
        "getV1CMDBDevicesHostnameFrontServer",
        "getV1CMDBDevicesAttributes",
        "getV1CMDBInterfaces",
        "getV1CMDBInterfacesAttributes",
        "getV1CMDBModules",
        "getV1CMDBModulesAttributes",
        "getV1CMDBTopologyDevicesNeighbors",
        "getV1CMDBTopologyDevicesIpConnectedSwitchPort",
        "getV1CMDBDataEngineDeviceDataConfiguration",
        "getV1CMDBTopologyOneIPTable",
        "postV1CMDBFiles"
      ],
      "external_name": "ph_request_type"
    },
    "request": {
      "type": "object",
      "description": "See the model for details",
      "parse": false,
      "encode": false,
      "encrypt": {
        "type": "AES",
        "key": ""
      },
      "external_name": "Request"
    }
  },
  "definitions": {}
}