{
  "$id": "schema.json",
  "type": "object",
  "schema": "http://json-schema.org/draft-07/schema#",
  "translate": true,
  "dynamicfields": true,
  "properties": {
    "ph_request_type": {
      "type": "string",
      "description": "type of request (internal to adapter)",
      "default": "postV1CMDBNetworkSettings",
      "enum": [
        "postV1CMDBNetworkSettings",
        "putV1CMDBNetworkSettings",
        "deleteV1CMDBNetworkSettings",
        "getcmdbNetworkSettingsTelnetInfoCheckDeviceCount",
        "getcmdbNetworkSettingsTelnetInfoRefreshDeviceCount"
      ],
      "external_name": "ph_request_type"
    },
    "request": {
      "type": "object",
      "description": "See the model for details",
      "parse": false,
      "encode": false,
      "encrypt": {
        "type": "AES",
        "key": ""
      },
      "external_name": "Request"
    }
  },
  "definitions": {}
}