[
  {
    "topologyIndex": 2,
    "topologyObjectType": "string",
    "node": {
      "topoObjectType": "string",
      "nodeIndex": 10,
      "id": "string",
      "topologyIndex": 9
    },
    "table": "string",
    "prefix": {
      "topoObjectType": "string",
      "address": "string",
      "length": 2
    },
    "pathCookie": 5,
    "asPath": [
      "string",
      "string",
      "string"
    ],
    "protocolNextHops": [
      "string",
      "string",
      "string",
      "string",
      "string",
      "string",
      "string",
      "string",
      "string"
    ],
    "protocol": "string",
    "routePreference": 9,
    "localPreference": 3,
    "vpnLabel": 9
  },
  {
    "topologyIndex": 9,
    "topologyObjectType": "string",
    "node": {
      "topoObjectType": "string",
      "nodeIndex": 7,
      "id": "string",
      "topologyIndex": 4
    },
    "table": "string",
    "prefix": {
      "topoObjectType": "string",
      "address": "string",
      "length": 7
    },
    "pathCookie": 4,
    "asPath": [
      "string",
      "string",
      "string",
      "string",
      "string",
      "string",
      "string",
      "string",
      "string"
    ],
    "protocolNextHops": [
      "string",
      "string",
      "string",
      "string",
      "string",
      "string",
      "string",
      "string"
    ],
    "protocol": "string",
    "routePreference": 1,
    "localPreference": 10,
    "vpnLabel": 9
  }
]