[
  {
    "operationalStatus": "string",
    "plannedProperties": {
      "bandwidth": "string",
      "setupPriority": 5,
      "holdingPriority": 1,
      "calculatedEro": [
        {
          "topoObjectType": "string",
          "address": "string",
          "loose": false
        },
        {
          "topoObjectType": "string",
          "address": "string",
          "loose": false
        },
        {
          "topoObjectType": "string",
          "address": "string",
          "loose": true
        },
        {
          "topoObjectType": "string",
          "address": "string",
          "loose": true
        },
        {
          "topoObjectType": "string",
          "address": "string",
          "loose": false
        },
        {
          "topoObjectType": "string",
          "address": "string",
          "loose": true
        }
      ],
      "routingStatus": "string",
      "adminStatus": "string",
      "design": {
        "routingMethod": "string"
      },
      "lastStatusString": "string",
      "controllerStatus": {
        "status": "string"
      },
      "correlatedRROHopCount": 9
    },
    "name": "string",
    "from": {
      "topoObjectType": "string",
      "address": "string"
    },
    "pathType": "string",
    "to": {
      "topoObjectType": "string",
      "address": "string"
    },
    "lspIndex": 9,
    "controlType": "string",
    "provisioningType": "string",
    "collectedProperties": {
      "bandwidth": "string",
      "setupPriority": 4,
      "holdingPriority": 8,
      "calculatedEro": [
        {
          "topoObjectType": "string",
          "address": "string",
          "loose": true
        },
        {
          "topoObjectType": "string",
          "address": "string",
          "loose": false
        },
        {
          "topoObjectType": "string",
          "address": "string",
          "loose": true
        },
        {
          "topoObjectType": "string",
          "address": "string",
          "loose": false
        },
        {
          "topoObjectType": "string",
          "address": "string",
          "loose": false
        },
        {
          "topoObjectType": "string",
          "address": "string",
          "loose": true
        }
      ],
      "routingStatus": "string",
      "adminStatus": "string",
      "correlatedRROHopCount": 10
    },
    "tunnelId": 5,
    "liveProperties": {
      "bandwidth": 4,
      "metric": 8,
      "setupPriority": 8,
      "holdingPriority": 3,
      "operationalStatus": "string",
      "adminStatus": "string",
      "ero": [
        {
          "topoObjectType": "string",
          "address": "string",
          "loose": false
        },
        {
          "topoObjectType": "string",
          "address": "string",
          "loose": false
        },
        {
          "topoObjectType": "string",
          "address": "string",
          "loose": false
        },
        {
          "topoObjectType": "string",
          "address": "string",
          "loose": false
        },
        {
          "topoObjectType": "string",
          "address": "string",
          "loose": false
        },
        {
          "topoObjectType": "string",
          "address": "string",
          "loose": false
        },
        {
          "topoObjectType": "string",
          "address": "string",
          "loose": false
        },
        {
          "topoObjectType": "string",
          "address": "string",
          "loose": true
        }
      ],
      "rro": [
        {
          "topoObjectType": "string",
          "address": "string",
          "protectionInUse": false,
          "protectionAvailable": true
        },
        {
          "topoObjectType": "string",
          "address": "string",
          "protectionInUse": false,
          "protectionAvailable": false
        },
        {
          "topoObjectType": "string",
          "address": "string",
          "protectionInUse": false,
          "protectionAvailable": false
        },
        {
          "topoObjectType": "string",
          "address": "string",
          "protectionInUse": false,
          "protectionAvailable": true
        },
        {
          "topoObjectType": "string",
          "address": "string",
          "protectionInUse": false,
          "protectionAvailable": true
        },
        {
          "topoObjectType": "string",
          "address": "string",
          "protectionInUse": true,
          "protectionAvailable": false
        },
        {
          "topoObjectType": "string",
          "address": "string",
          "protectionInUse": true,
          "protectionAvailable": false
        },
        {
          "topoObjectType": "string",
          "address": "string",
          "protectionInUse": true,
          "protectionAvailable": false
        }
      ]
    },
    "controller": "string",
    "p2mpIndex": 1,
    "p2mpName": "string",
    "initiator": "string"
  },
  {
    "operationalStatus": "string",
    "plannedProperties": {
      "bandwidth": "string",
      "setupPriority": 7,
      "holdingPriority": 2,
      "calculatedEro": [
        {
          "topoObjectType": "string",
          "address": "string",
          "loose": false
        }
      ],
      "routingStatus": "string",
      "adminStatus": "string",
      "design": {
        "routingMethod": "string"
      },
      "lastStatusString": "string",
      "controllerStatus": {
        "status": "string"
      },
      "correlatedRROHopCount": 3
    },
    "name": "string",
    "from": {
      "topoObjectType": "string",
      "address": "string"
    },
    "pathType": "string",
    "to": {
      "topoObjectType": "string",
      "address": "string"
    },
    "lspIndex": 8,
    "controlType": "string",
    "provisioningType": "string",
    "collectedProperties": {
      "bandwidth": "string",
      "setupPriority": 2,
      "holdingPriority": 9,
      "calculatedEro": [
        {
          "topoObjectType": "string",
          "address": "string",
          "loose": true
        },
        {
          "topoObjectType": "string",
          "address": "string",
          "loose": false
        },
        {
          "topoObjectType": "string",
          "address": "string",
          "loose": true
        },
        {
          "topoObjectType": "string",
          "address": "string",
          "loose": false
        },
        {
          "topoObjectType": "string",
          "address": "string",
          "loose": true
        },
        {
          "topoObjectType": "string",
          "address": "string",
          "loose": false
        },
        {
          "topoObjectType": "string",
          "address": "string",
          "loose": false
        }
      ],
      "routingStatus": "string",
      "adminStatus": "string",
      "correlatedRROHopCount": 10
    },
    "tunnelId": 1,
    "liveProperties": {
      "bandwidth": 6,
      "metric": 8,
      "setupPriority": 8,
      "holdingPriority": 5,
      "operationalStatus": "string",
      "adminStatus": "string",
      "ero": [
        {
          "topoObjectType": "string",
          "address": "string",
          "loose": false
        },
        {
          "topoObjectType": "string",
          "address": "string",
          "loose": true
        },
        {
          "topoObjectType": "string",
          "address": "string",
          "loose": true
        },
        {
          "topoObjectType": "string",
          "address": "string",
          "loose": false
        },
        {
          "topoObjectType": "string",
          "address": "string",
          "loose": false
        },
        {
          "topoObjectType": "string",
          "address": "string",
          "loose": true
        },
        {
          "topoObjectType": "string",
          "address": "string",
          "loose": true
        },
        {
          "topoObjectType": "string",
          "address": "string",
          "loose": false
        },
        {
          "topoObjectType": "string",
          "address": "string",
          "loose": true
        }
      ],
      "rro": [
        {
          "topoObjectType": "string",
          "address": "string",
          "protectionInUse": true,
          "protectionAvailable": true
        },
        {
          "topoObjectType": "string",
          "address": "string",
          "protectionInUse": false,
          "protectionAvailable": true
        },
        {
          "topoObjectType": "string",
          "address": "string",
          "protectionInUse": true,
          "protectionAvailable": true
        },
        {
          "topoObjectType": "string",
          "address": "string",
          "protectionInUse": false,
          "protectionAvailable": true
        },
        {
          "topoObjectType": "string",
          "address": "string",
          "protectionInUse": false,
          "protectionAvailable": true
        },
        {
          "topoObjectType": "string",
          "address": "string",
          "protectionInUse": true,
          "protectionAvailable": false
        },
        {
          "topoObjectType": "string",
          "address": "string",
          "protectionInUse": false,
          "protectionAvailable": false
        },
        {
          "topoObjectType": "string",
          "address": "string",
          "protectionInUse": true,
          "protectionAvailable": true
        },
        {
          "topoObjectType": "string",
          "address": "string",
          "protectionInUse": false,
          "protectionAvailable": false
        }
      ]
    },
    "controller": "string",
    "p2mpIndex": 5,
    "p2mpName": "string",
    "initiator": "string"
  },
  {
    "operationalStatus": "string",
    "plannedProperties": {
      "bandwidth": "string",
      "setupPriority": 6,
      "holdingPriority": 1,
      "calculatedEro": [
        {
          "topoObjectType": "string",
          "address": "string",
          "loose": true
        },
        {
          "topoObjectType": "string",
          "address": "string",
          "loose": true
        }
      ],
      "routingStatus": "string",
      "adminStatus": "string",
      "design": {
        "routingMethod": "string"
      },
      "lastStatusString": "string",
      "controllerStatus": {
        "status": "string"
      },
      "correlatedRROHopCount": 10
    },
    "name": "string",
    "from": {
      "topoObjectType": "string",
      "address": "string"
    },
    "pathType": "string",
    "to": {
      "topoObjectType": "string",
      "address": "string"
    },
    "lspIndex": 7,
    "controlType": "string",
    "provisioningType": "string",
    "collectedProperties": {
      "bandwidth": "string",
      "setupPriority": 8,
      "holdingPriority": 7,
      "calculatedEro": [
        {
          "topoObjectType": "string",
          "address": "string",
          "loose": false
        },
        {
          "topoObjectType": "string",
          "address": "string",
          "loose": false
        },
        {
          "topoObjectType": "string",
          "address": "string",
          "loose": true
        },
        {
          "topoObjectType": "string",
          "address": "string",
          "loose": true
        },
        {
          "topoObjectType": "string",
          "address": "string",
          "loose": false
        },
        {
          "topoObjectType": "string",
          "address": "string",
          "loose": false
        },
        {
          "topoObjectType": "string",
          "address": "string",
          "loose": true
        },
        {
          "topoObjectType": "string",
          "address": "string",
          "loose": false
        },
        {
          "topoObjectType": "string",
          "address": "string",
          "loose": false
        },
        {
          "topoObjectType": "string",
          "address": "string",
          "loose": true
        }
      ],
      "routingStatus": "string",
      "adminStatus": "string",
      "correlatedRROHopCount": 8
    },
    "tunnelId": 3,
    "liveProperties": {
      "bandwidth": 4,
      "metric": 9,
      "setupPriority": 10,
      "holdingPriority": 1,
      "operationalStatus": "string",
      "adminStatus": "string",
      "ero": [
        {
          "topoObjectType": "string",
          "address": "string",
          "loose": true
        },
        {
          "topoObjectType": "string",
          "address": "string",
          "loose": true
        },
        {
          "topoObjectType": "string",
          "address": "string",
          "loose": true
        },
        {
          "topoObjectType": "string",
          "address": "string",
          "loose": false
        },
        {
          "topoObjectType": "string",
          "address": "string",
          "loose": false
        },
        {
          "topoObjectType": "string",
          "address": "string",
          "loose": false
        },
        {
          "topoObjectType": "string",
          "address": "string",
          "loose": false
        },
        {
          "topoObjectType": "string",
          "address": "string",
          "loose": false
        },
        {
          "topoObjectType": "string",
          "address": "string",
          "loose": true
        }
      ],
      "rro": [
        {
          "topoObjectType": "string",
          "address": "string",
          "protectionInUse": true,
          "protectionAvailable": true
        },
        {
          "topoObjectType": "string",
          "address": "string",
          "protectionInUse": false,
          "protectionAvailable": true
        },
        {
          "topoObjectType": "string",
          "address": "string",
          "protectionInUse": true,
          "protectionAvailable": false
        },
        {
          "topoObjectType": "string",
          "address": "string",
          "protectionInUse": false,
          "protectionAvailable": false
        },
        {
          "topoObjectType": "string",
          "address": "string",
          "protectionInUse": false,
          "protectionAvailable": true
        },
        {
          "topoObjectType": "string",
          "address": "string",
          "protectionInUse": false,
          "protectionAvailable": true
        },
        {
          "topoObjectType": "string",
          "address": "string",
          "protectionInUse": false,
          "protectionAvailable": false
        },
        {
          "topoObjectType": "string",
          "address": "string",
          "protectionInUse": false,
          "protectionAvailable": true
        },
        {
          "topoObjectType": "string",
          "address": "string",
          "protectionInUse": true,
          "protectionAvailable": true
        }
      ]
    },
    "controller": "string",
    "p2mpIndex": 8,
    "p2mpName": "string",
    "initiator": "string"
  },
  {
    "operationalStatus": "string",
    "plannedProperties": {
      "bandwidth": "string",
      "setupPriority": 4,
      "holdingPriority": 9,
      "calculatedEro": [
        {
          "topoObjectType": "string",
          "address": "string",
          "loose": false
        },
        {
          "topoObjectType": "string",
          "address": "string",
          "loose": false
        },
        {
          "topoObjectType": "string",
          "address": "string",
          "loose": true
        }
      ],
      "routingStatus": "string",
      "adminStatus": "string",
      "design": {
        "routingMethod": "string"
      },
      "lastStatusString": "string",
      "controllerStatus": {
        "status": "string"
      },
      "correlatedRROHopCount": 5
    },
    "name": "string",
    "from": {
      "topoObjectType": "string",
      "address": "string"
    },
    "pathType": "string",
    "to": {
      "topoObjectType": "string",
      "address": "string"
    },
    "lspIndex": 3,
    "controlType": "string",
    "provisioningType": "string",
    "collectedProperties": {
      "bandwidth": "string",
      "setupPriority": 9,
      "holdingPriority": 8,
      "calculatedEro": [
        {
          "topoObjectType": "string",
          "address": "string",
          "loose": true
        },
        {
          "topoObjectType": "string",
          "address": "string",
          "loose": false
        },
        {
          "topoObjectType": "string",
          "address": "string",
          "loose": true
        },
        {
          "topoObjectType": "string",
          "address": "string",
          "loose": true
        },
        {
          "topoObjectType": "string",
          "address": "string",
          "loose": true
        },
        {
          "topoObjectType": "string",
          "address": "string",
          "loose": false
        },
        {
          "topoObjectType": "string",
          "address": "string",
          "loose": false
        },
        {
          "topoObjectType": "string",
          "address": "string",
          "loose": false
        },
        {
          "topoObjectType": "string",
          "address": "string",
          "loose": false
        }
      ],
      "routingStatus": "string",
      "adminStatus": "string",
      "correlatedRROHopCount": 4
    },
    "tunnelId": 10,
    "liveProperties": {
      "bandwidth": 5,
      "metric": 8,
      "setupPriority": 1,
      "holdingPriority": 9,
      "operationalStatus": "string",
      "adminStatus": "string",
      "ero": [
        {
          "topoObjectType": "string",
          "address": "string",
          "loose": false
        }
      ],
      "rro": [
        {
          "topoObjectType": "string",
          "address": "string",
          "protectionInUse": true,
          "protectionAvailable": true
        },
        {
          "topoObjectType": "string",
          "address": "string",
          "protectionInUse": false,
          "protectionAvailable": true
        }
      ]
    },
    "controller": "string",
    "p2mpIndex": 5,
    "p2mpName": "string",
    "initiator": "string"
  }
]