{
  "name": "string",
  "from": {
    "address": "string",
    "topoObjectType": "string"
  },
  "to": {
    "address": "string",
    "topoObjectType": "string"
  },
  "pathType": "string",
  "plannedProperties": {
    "bandwidth": "string",
    "setupPriority": 4,
    "holdingPriority": 9
  }
}