[
  {
    "topologyIndex": 1,
    "topologyObjectType": "string",
    "node": {
      "topoObjectType": "string",
      "nodeIndex": 9,
      "id": "string",
      "topologyIndex": 10
    },
    "table": "string",
    "prefix": {
      "topoObjectType": "string",
      "address": "string",
      "length": 2
    },
    "pathCookie": 8,
    "asPath": [
      "string",
      "string",
      "string",
      "string",
      "string",
      "string",
      "string"
    ],
    "protocolNextHops": [
      "string",
      "string",
      "string",
      "string",
      "string",
      "string",
      "string",
      "string"
    ],
    "protocol": "string",
    "routePreference": 8,
    "localPreference": 1,
    "vpnLabel": 2
  },
  {
    "topologyIndex": 3,
    "topologyObjectType": "string",
    "node": {
      "topoObjectType": "string",
      "nodeIndex": 9,
      "id": "string",
      "topologyIndex": 10
    },
    "table": "string",
    "prefix": {
      "topoObjectType": "string",
      "address": "string",
      "length": 3
    },
    "pathCookie": 4,
    "asPath": [
      "string",
      "string",
      "string",
      "string",
      "string",
      "string",
      "string",
      "string",
      "string",
      "string"
    ],
    "protocolNextHops": [
      "string",
      "string",
      "string",
      "string",
      "string",
      "string",
      "string",
      "string",
      "string",
      "string"
    ],
    "protocol": "string",
    "routePreference": 5,
    "localPreference": 10,
    "vpnLabel": 7
  }
]