{
  "name": "string",
  "interfaceType": "string",
  "topologyModel": "string",
  "notifyUrl": "string",
  "profileName": "string",
  "reconnectTimeout": 6,
  "topologyUrl": "string",
  "topoObjectType": "string",
  "transportControllerIndex": 4
}