[
  {
    "topologyIndex": 7,
    "topologyObjectType": "string",
    "node": {
      "topoObjectType": "string",
      "nodeIndex": 1,
      "id": "string",
      "topologyIndex": 4
    },
    "table": "string",
    "prefix": {
      "topoObjectType": "string",
      "address": "string",
      "length": 7
    },
    "pathCookie": 9,
    "asPath": [
      "string",
      "string"
    ],
    "protocolNextHops": [
      "string",
      "string",
      "string",
      "string",
      "string",
      "string",
      "string"
    ],
    "protocol": "string",
    "routePreference": 6,
    "localPreference": 2,
    "vpnLabel": 3
  },
  {
    "topologyIndex": 1,
    "topologyObjectType": "string",
    "node": {
      "topoObjectType": "string",
      "nodeIndex": 2,
      "id": "string",
      "topologyIndex": 4
    },
    "table": "string",
    "prefix": {
      "topoObjectType": "string",
      "address": "string",
      "length": 8
    },
    "pathCookie": 1,
    "asPath": [
      "string",
      "string",
      "string",
      "string",
      "string",
      "string"
    ],
    "protocolNextHops": [
      "string",
      "string"
    ],
    "protocol": "string",
    "routePreference": 6,
    "localPreference": 5,
    "vpnLabel": 3
  }
]