[
  {
    "topologyIndex": 6,
    "topologyObjectType": "string",
    "node": {
      "topoObjectType": "string",
      "nodeIndex": 5,
      "id": "string",
      "topologyIndex": 8
    },
    "table": "string",
    "prefix": {
      "topoObjectType": "string",
      "address": "string",
      "length": 1
    },
    "pathCookie": 7,
    "asPath": [
      "string",
      "string",
      "string",
      "string",
      "string",
      "string"
    ],
    "protocolNextHops": [
      "string"
    ],
    "protocol": "string",
    "routePreference": 5,
    "localPreference": 1,
    "vpnLabel": 9
  }
]