[
  {
    "topologyIndex": 9,
    "topologyObjectType": "string",
    "node": {
      "topoObjectType": "string",
      "nodeIndex": 1,
      "id": "string",
      "topologyIndex": 8
    },
    "table": "string",
    "prefix": {
      "topoObjectType": "string",
      "address": "string",
      "length": 7
    },
    "pathCookie": 1,
    "asPath": [
      "string",
      "string",
      "string"
    ],
    "protocolNextHops": [
      "string",
      "string",
      "string",
      "string",
      "string",
      "string",
      "string",
      "string",
      "string"
    ],
    "protocol": "string",
    "routePreference": 2,
    "localPreference": 9,
    "vpnLabel": 7
  },
  {
    "topologyIndex": 3,
    "topologyObjectType": "string",
    "node": {
      "topoObjectType": "string",
      "nodeIndex": 1,
      "id": "string",
      "topologyIndex": 4
    },
    "table": "string",
    "prefix": {
      "topoObjectType": "string",
      "address": "string",
      "length": 7
    },
    "pathCookie": 5,
    "asPath": [
      "string",
      "string",
      "string"
    ],
    "protocolNextHops": [
      "string",
      "string",
      "string",
      "string",
      "string",
      "string",
      "string",
      "string"
    ],
    "protocol": "string",
    "routePreference": 4,
    "localPreference": 6,
    "vpnLabel": 1
  },
  {
    "topologyIndex": 10,
    "topologyObjectType": "string",
    "node": {
      "topoObjectType": "string",
      "nodeIndex": 1,
      "id": "string",
      "topologyIndex": 2
    },
    "table": "string",
    "prefix": {
      "topoObjectType": "string",
      "address": "string",
      "length": 1
    },
    "pathCookie": 3,
    "asPath": [
      "string",
      "string",
      "string",
      "string",
      "string",
      "string"
    ],
    "protocolNextHops": [
      "string",
      "string",
      "string",
      "string",
      "string",
      "string",
      "string",
      "string",
      "string"
    ],
    "protocol": "string",
    "routePreference": 1,
    "localPreference": 1,
    "vpnLabel": 6
  },
  {
    "topologyIndex": 3,
    "topologyObjectType": "string",
    "node": {
      "topoObjectType": "string",
      "nodeIndex": 3,
      "id": "string",
      "topologyIndex": 7
    },
    "table": "string",
    "prefix": {
      "topoObjectType": "string",
      "address": "string",
      "length": 6
    },
    "pathCookie": 8,
    "asPath": [
      "string"
    ],
    "protocolNextHops": [
      "string",
      "string",
      "string",
      "string",
      "string",
      "string",
      "string",
      "string",
      "string",
      "string"
    ],
    "protocol": "string",
    "routePreference": 6,
    "localPreference": 3,
    "vpnLabel": 5
  }
]