[
  {
    "topologyIndex": 4,
    "topologyObjectType": "string",
    "node": {
      "topoObjectType": "string",
      "nodeIndex": 6,
      "id": "string",
      "topologyIndex": 9
    },
    "table": "string",
    "prefix": {
      "topoObjectType": "string",
      "address": "string",
      "length": 4
    },
    "pathCookie": 8,
    "asPath": [
      "string",
      "string",
      "string",
      "string",
      "string",
      "string",
      "string",
      "string",
      "string"
    ],
    "protocolNextHops": [
      "string",
      "string",
      "string",
      "string",
      "string"
    ],
    "protocol": "string",
    "routePreference": 6,
    "localPreference": 3,
    "vpnLabel": 6
  },
  {
    "topologyIndex": 10,
    "topologyObjectType": "string",
    "node": {
      "topoObjectType": "string",
      "nodeIndex": 7,
      "id": "string",
      "topologyIndex": 9
    },
    "table": "string",
    "prefix": {
      "topoObjectType": "string",
      "address": "string",
      "length": 10
    },
    "pathCookie": 3,
    "asPath": [
      "string",
      "string",
      "string",
      "string",
      "string"
    ],
    "protocolNextHops": [
      "string",
      "string",
      "string",
      "string",
      "string",
      "string"
    ],
    "protocol": "string",
    "routePreference": 7,
    "localPreference": 9,
    "vpnLabel": 2
  },
  {
    "topologyIndex": 9,
    "topologyObjectType": "string",
    "node": {
      "topoObjectType": "string",
      "nodeIndex": 3,
      "id": "string",
      "topologyIndex": 7
    },
    "table": "string",
    "prefix": {
      "topoObjectType": "string",
      "address": "string",
      "length": 8
    },
    "pathCookie": 10,
    "asPath": [
      "string",
      "string",
      "string",
      "string",
      "string",
      "string",
      "string"
    ],
    "protocolNextHops": [
      "string",
      "string",
      "string",
      "string",
      "string"
    ],
    "protocol": "string",
    "routePreference": 1,
    "localPreference": 6,
    "vpnLabel": 5
  },
  {
    "topologyIndex": 2,
    "topologyObjectType": "string",
    "node": {
      "topoObjectType": "string",
      "nodeIndex": 4,
      "id": "string",
      "topologyIndex": 1
    },
    "table": "string",
    "prefix": {
      "topoObjectType": "string",
      "address": "string",
      "length": 2
    },
    "pathCookie": 5,
    "asPath": [
      "string",
      "string"
    ],
    "protocolNextHops": [
      "string",
      "string",
      "string",
      "string",
      "string"
    ],
    "protocol": "string",
    "routePreference": 5,
    "localPreference": 10,
    "vpnLabel": 5
  }
]