[
  {
    "topologyIndex": 6,
    "topologyObjectType": "string",
    "node": {
      "topoObjectType": "string",
      "nodeIndex": 10,
      "id": "string",
      "topologyIndex": 9
    },
    "table": "string",
    "prefix": {
      "topoObjectType": "string",
      "address": "string",
      "length": 5
    },
    "pathCookie": 6,
    "asPath": [
      "string",
      "string",
      "string",
      "string",
      "string"
    ],
    "protocolNextHops": [
      "string",
      "string",
      "string",
      "string",
      "string",
      "string",
      "string",
      "string",
      "string"
    ],
    "protocol": "string",
    "routePreference": 8,
    "localPreference": 7,
    "vpnLabel": 9
  },
  {
    "topologyIndex": 7,
    "topologyObjectType": "string",
    "node": {
      "topoObjectType": "string",
      "nodeIndex": 1,
      "id": "string",
      "topologyIndex": 1
    },
    "table": "string",
    "prefix": {
      "topoObjectType": "string",
      "address": "string",
      "length": 5
    },
    "pathCookie": 3,
    "asPath": [
      "string",
      "string",
      "string",
      "string",
      "string",
      "string",
      "string",
      "string",
      "string",
      "string"
    ],
    "protocolNextHops": [
      "string",
      "string",
      "string"
    ],
    "protocol": "string",
    "routePreference": 1,
    "localPreference": 9,
    "vpnLabel": 1
  },
  {
    "topologyIndex": 2,
    "topologyObjectType": "string",
    "node": {
      "topoObjectType": "string",
      "nodeIndex": 4,
      "id": "string",
      "topologyIndex": 6
    },
    "table": "string",
    "prefix": {
      "topoObjectType": "string",
      "address": "string",
      "length": 10
    },
    "pathCookie": 10,
    "asPath": [
      "string",
      "string",
      "string",
      "string",
      "string",
      "string",
      "string"
    ],
    "protocolNextHops": [
      "string",
      "string",
      "string",
      "string",
      "string",
      "string",
      "string",
      "string",
      "string",
      "string"
    ],
    "protocol": "string",
    "routePreference": 4,
    "localPreference": 5,
    "vpnLabel": 7
  }
]