[
  {
    "topologyIndex": 7,
    "topologyObjectType": "string",
    "node": {
      "topoObjectType": "string",
      "nodeIndex": 7,
      "id": "string",
      "topologyIndex": 4
    },
    "table": "string",
    "prefix": {
      "topoObjectType": "string",
      "address": "string",
      "length": 6
    },
    "pathCookie": 1,
    "asPath": [
      "string",
      "string"
    ],
    "protocolNextHops": [
      "string",
      "string",
      "string",
      "string",
      "string",
      "string",
      "string"
    ],
    "protocol": "string",
    "routePreference": 6,
    "localPreference": 8,
    "vpnLabel": 4
  }
]