{
  "name": "adapter-f5_bigiq",
  "webName": "Adapter for Integration to F5 BIG-IQ",
  "supportLevel": "community",
  "vendor": "F5",
  "product": "BIG-IQ",
  "techAlliance": true,
  "osVersion": [],
  "apiVersions": [
    "v6.0.1"
  ],
  "iapVersions": [
    "2021.1.x",
    "2021.2.x",
    "2022.1.x",
    "2023.1.x"
  ],
  "method": "REST",
  "type": "Adapter",
  "domains": [
    "Data Center",
    "Network Services"
  ],
  "tags": [
    "Configuration & Compliance",
    "Network Infrastructure Changes",
    "Software Upgrades & Device Maintenance"
  ],
  "useCases": [
    "Device Onboarding",
    "Router configuration backup or restore",
    "Run network compliance checks and remediation",
    "Determine configuration drift",
    "Golden Configuration",
    "Port/VLAN Configuration",
    "EVPN & VXLAN",
    "Port Turn-up",
    "Assign Network & IP",
    "Cloud Managed Networks",
    "Software Upgrade"
  ],
  "deprecated": {
    "isDeprecated": false
  },
  "brokerSince": "",
  "authMethods": [
    {
      "type": "Token",
      "primary": true
    }
  ],
  "documentation": {
    "storeLink": "",
    "npmLink": "https://www.npmjs.com/package/@itentialopensource/adapter-f5_bigiq",
    "repoLink": "https://gitlab.com/itentialopensource/adapters/adapter-f5_bigiq",
    "docLink": "https://gitlab.com/itentialopensource/adapters/adapter-f5_bigiq/-/blob/master/README.md?ref_type=heads",
    "demoLinks": [],
    "trainingLinks": [
      {
        "title": "Itential Academy",
        "link": "https://www.itential.com/itential-academy/"
      }
    ],
    "faqLink": "https://docs.itential.com/opensource/docs/troubleshooting-an-adapter",
    "contributeLink": "https://gitlab.com/itentialopensource/adapters/contributing-guide",
    "issueLink": "https://itential.atlassian.net/servicedesk/customer/portals",
    "webLink": "https://www.itential.com/adapters/f5-big-iq/",
    "vendorLink": "https://www.f5.com/",
    "productLink": "https://www.f5.com/products/big-ip-services/big-iq",
    "apiLinks": [
      {
        "title": "F5 - BIG-IQ API",
        "link": "https://clouddocs.f5.com/products/big-iq/mgmt-api/v6.0.1/",
        "public": true
      }
    ],
    "workshopLinks": [],
    "workshopHomePage": "https://www.itential.com/get-started/"
  },
  "assets": [],
  "relatedItems": {
    "adapters": [],
    "integrations": [],
    "ecosystemApplications": [],
    "workflowProjects": [
      {
        "name": "F5 - BIG-IQ - REST",
        "webName": "Project with workflows for the BIG-IQ from F5",
        "overview": "Project with workflows for the BIG-IQ from F5",
        "isDependency": false,
        "versions": [
          "^1.0.4"
        ],
        "repoLink": "https://gitlab.com/itentialopensource/pre-built-automations/f5-big-iq-rest",
        "docLink": "",
        "webLink": "https://www.itential.com/automations/f5-big-iq-modular-automations/"
      }
    ],
    "transformationProjects": [],
    "exampleProjects": []
  }
}