{
  "actions": [
    {
      "name": "getDNSDataCenter",
      "protocol": "REST",
      "method": "GET",
      "entitypath": "{base_path}/{version}/mgmt/cm/dns/working-config/datacenter/{pathv1}?{query}",
      "requestSchema": "schema.json",
      "responseSchema": "schema.json",
      "timeout": 0,
      "sendEmpty": false,
      "sendGetBody": false,
      "requestDatatype": "JSON",
      "responseDatatype": "JSON",
      "headers": {},
      "responseObjects": [
        {
          "type": "default",
          "key": "",
          "mockFile": ""
        }
      ]
    },
    {
      "name": "patchDNSDataCenter",
      "protocol": "REST",
      "method": "PATCH",
      "entitypath": "{base_path}/{version}/mgmt/cm/dns/working-config/datacenter/{pathv1}?{query}",
      "requestSchema": "schema.json",
      "responseSchema": "schema.json",
      "timeout": 0,
      "sendEmpty": false,
      "requestDatatype": "JSON",
      "responseDatatype": "JSON",
      "headers": {},
      "responseObjects": [
        {
          "type": "default",
          "key": "",
          "mockFile": ""
        }
      ]
    },
    {
      "name": "deleteDNSDataCenter",
      "protocol": "REST",
      "method": "DELETE",
      "entitypath": "{base_path}/{version}/mgmt/cm/dns/working-config/datacenter/{pathv1}?{query}",
      "requestSchema": "schema.json",
      "responseSchema": "schema.json",
      "timeout": 0,
      "sendEmpty": false,
      "requestDatatype": "JSON",
      "responseDatatype": "JSON",
      "headers": {},
      "responseObjects": [
        {
          "type": "default",
          "key": "",
          "mockFile": ""
        }
      ]
    },
    {
      "name": "postDNSDataCenter",
      "protocol": "REST",
      "method": "POST",
      "entitypath": "{base_path}/{version}/mgmt/cm/dns/working-config/datacenter?{query}",
      "requestSchema": "schema.json",
      "responseSchema": "schema.json",
      "timeout": 0,
      "sendEmpty": false,
      "requestDatatype": "JSON",
      "responseDatatype": "JSON",
      "headers": {},
      "responseObjects": [
        {
          "type": "default",
          "key": "",
          "mockFile": ""
        }
      ]
    },
    {
      "name": "getDNSiRule",
      "protocol": "REST",
      "method": "GET",
      "entitypath": "{base_path}/{version}/mgmt/cm/dns/working-config/rule/{pathv1}?{query}",
      "requestSchema": "schema.json",
      "responseSchema": "schema.json",
      "timeout": 0,
      "sendEmpty": false,
      "sendGetBody": false,
      "requestDatatype": "JSON",
      "responseDatatype": "JSON",
      "headers": {},
      "responseObjects": [
        {
          "type": "default",
          "key": "",
          "mockFile": ""
        }
      ]
    },
    {
      "name": "deleteDNSiRule",
      "protocol": "REST",
      "method": "DELETE",
      "entitypath": "{base_path}/{version}/mgmt/cm/dns/working-config/rule/{pathv1}?{query}",
      "requestSchema": "schema.json",
      "responseSchema": "schema.json",
      "timeout": 0,
      "sendEmpty": false,
      "requestDatatype": "JSON",
      "responseDatatype": "JSON",
      "headers": {},
      "responseObjects": [
        {
          "type": "default",
          "key": "",
          "mockFile": ""
        }
      ]
    },
    {
      "name": "patchDNSiRule",
      "protocol": "REST",
      "method": "PATCH",
      "entitypath": "{base_path}/{version}/mgmt/cm/dns/working-config/rule/{pathv1}?{query}",
      "requestSchema": "schema.json",
      "responseSchema": "schema.json",
      "timeout": 0,
      "sendEmpty": false,
      "requestDatatype": "JSON",
      "responseDatatype": "JSON",
      "headers": {},
      "responseObjects": [
        {
          "type": "default",
          "key": "",
          "mockFile": ""
        }
      ]
    },
    {
      "name": "postDNSiRule",
      "protocol": "REST",
      "method": "POST",
      "entitypath": "{base_path}/{version}/mgmt/cm/dns/working-config/rule?{query}",
      "requestSchema": "schema.json",
      "responseSchema": "schema.json",
      "timeout": 0,
      "sendEmpty": false,
      "requestDatatype": "JSON",
      "responseDatatype": "JSON",
      "headers": {},
      "responseObjects": [
        {
          "type": "default",
          "key": "",
          "mockFile": ""
        }
      ]
    },
    {
      "name": "getDNSPoolA",
      "protocol": "REST",
      "method": "GET",
      "entitypath": "{base_path}/{version}/mgmt/cm/dns/working-config/pool/a/{pathv1}?{query}",
      "requestSchema": "schema.json",
      "responseSchema": "schema.json",
      "timeout": 0,
      "sendEmpty": false,
      "sendGetBody": false,
      "requestDatatype": "JSON",
      "responseDatatype": "JSON",
      "headers": {},
      "responseObjects": [
        {
          "type": "default",
          "key": "",
          "mockFile": ""
        }
      ]
    },
    {
      "name": "deleteDNSPoolA",
      "protocol": "REST",
      "method": "DELETE",
      "entitypath": "{base_path}/{version}/mgmt/cm/dns/working-config/pool/a/{pathv1}?{query}",
      "requestSchema": "schema.json",
      "responseSchema": "schema.json",
      "timeout": 0,
      "sendEmpty": false,
      "requestDatatype": "JSON",
      "responseDatatype": "JSON",
      "headers": {},
      "responseObjects": [
        {
          "type": "default",
          "key": "",
          "mockFile": ""
        }
      ]
    },
    {
      "name": "patchDNSPoolA",
      "protocol": "REST",
      "method": "PATCH",
      "entitypath": "{base_path}/{version}/mgmt/cm/dns/working-config/pool/a/{pathv1}?{query}",
      "requestSchema": "schema.json",
      "responseSchema": "schema.json",
      "timeout": 0,
      "sendEmpty": false,
      "requestDatatype": "JSON",
      "responseDatatype": "JSON",
      "headers": {},
      "responseObjects": [
        {
          "type": "default",
          "key": "",
          "mockFile": ""
        }
      ]
    },
    {
      "name": "postDNSPoolA",
      "protocol": "REST",
      "method": "POST",
      "entitypath": "{base_path}/{version}/mgmt/cm/dns/working-config/pool/a?{query}",
      "requestSchema": "schema.json",
      "responseSchema": "schema.json",
      "timeout": 0,
      "sendEmpty": false,
      "requestDatatype": "JSON",
      "responseDatatype": "JSON",
      "headers": {},
      "responseObjects": [
        {
          "type": "default",
          "key": "",
          "mockFile": ""
        }
      ]
    },
    {
      "name": "getDNSPoolAAAA",
      "protocol": "REST",
      "method": "GET",
      "entitypath": "{base_path}/{version}/mgmt/cm/dns/working-config/pool/aaaa/{pathv1}?{query}",
      "requestSchema": "schema.json",
      "responseSchema": "schema.json",
      "timeout": 0,
      "sendEmpty": false,
      "sendGetBody": false,
      "requestDatatype": "JSON",
      "responseDatatype": "JSON",
      "headers": {},
      "responseObjects": [
        {
          "type": "default",
          "key": "",
          "mockFile": ""
        }
      ]
    },
    {
      "name": "deleteDNSPoolAAAA",
      "protocol": "REST",
      "method": "DELETE",
      "entitypath": "{base_path}/{version}/mgmt/cm/dns/working-config/pool/aaaa/{pathv1}?{query}",
      "requestSchema": "schema.json",
      "responseSchema": "schema.json",
      "timeout": 0,
      "sendEmpty": false,
      "requestDatatype": "JSON",
      "responseDatatype": "JSON",
      "headers": {},
      "responseObjects": [
        {
          "type": "default",
          "key": "",
          "mockFile": ""
        }
      ]
    },
    {
      "name": "patchDNSPoolAAAA",
      "protocol": "REST",
      "method": "PATCH",
      "entitypath": "{base_path}/{version}/mgmt/cm/dns/working-config/pool/aaaa/{pathv1}?{query}",
      "requestSchema": "schema.json",
      "responseSchema": "schema.json",
      "timeout": 0,
      "sendEmpty": false,
      "requestDatatype": "JSON",
      "responseDatatype": "JSON",
      "headers": {},
      "responseObjects": [
        {
          "type": "default",
          "key": "",
          "mockFile": ""
        }
      ]
    },
    {
      "name": "postDNSPoolAAAA",
      "protocol": "REST",
      "method": "POST",
      "entitypath": "{base_path}/{version}/mgmt/cm/dns/working-config/pool/aaaa?{query}",
      "requestSchema": "schema.json",
      "responseSchema": "schema.json",
      "timeout": 0,
      "sendEmpty": false,
      "requestDatatype": "JSON",
      "responseDatatype": "JSON",
      "headers": {},
      "responseObjects": [
        {
          "type": "default",
          "key": "",
          "mockFile": ""
        }
      ]
    },
    {
      "name": "getDNSPoolCNAME",
      "protocol": "REST",
      "method": "GET",
      "entitypath": "{base_path}/{version}/mgmt/cm/dns/working-config/cname/{pathv1}?{query}",
      "requestSchema": "schema.json",
      "responseSchema": "schema.json",
      "timeout": 0,
      "sendEmpty": false,
      "sendGetBody": false,
      "requestDatatype": "JSON",
      "responseDatatype": "JSON",
      "headers": {},
      "responseObjects": [
        {
          "type": "default",
          "key": "",
          "mockFile": ""
        }
      ]
    },
    {
      "name": "deleteDNSPoolCNAME",
      "protocol": "REST",
      "method": "DELETE",
      "entitypath": "{base_path}/{version}/mgmt/cm/dns/working-config/cname/{pathv1}?{query}",
      "requestSchema": "schema.json",
      "responseSchema": "schema.json",
      "timeout": 0,
      "sendEmpty": false,
      "requestDatatype": "JSON",
      "responseDatatype": "JSON",
      "headers": {},
      "responseObjects": [
        {
          "type": "default",
          "key": "",
          "mockFile": ""
        }
      ]
    },
    {
      "name": "patchDNSPoolCNAME",
      "protocol": "REST",
      "method": "PATCH",
      "entitypath": "{base_path}/{version}/mgmt/cm/dns/working-config/cname/{pathv1}?{query}",
      "requestSchema": "schema.json",
      "responseSchema": "schema.json",
      "timeout": 0,
      "sendEmpty": false,
      "requestDatatype": "JSON",
      "responseDatatype": "JSON",
      "headers": {},
      "responseObjects": [
        {
          "type": "default",
          "key": "",
          "mockFile": ""
        }
      ]
    },
    {
      "name": "postDNSPoolCNAME",
      "protocol": "REST",
      "method": "POST",
      "entitypath": "{base_path}/{version}/mgmt/cm/dns/working-config/cname?{query}",
      "requestSchema": "schema.json",
      "responseSchema": "schema.json",
      "timeout": 0,
      "sendEmpty": false,
      "requestDatatype": "JSON",
      "responseDatatype": "JSON",
      "headers": {},
      "responseObjects": [
        {
          "type": "default",
          "key": "",
          "mockFile": ""
        }
      ]
    },
    {
      "name": "getDNSPoolMemberA",
      "protocol": "REST",
      "method": "GET",
      "entitypath": "{base_path}/{version}/mgmt/cm/dns/working-config/pool/a/{pathv1}/members/{pathv2}?{query}",
      "requestSchema": "schema.json",
      "responseSchema": "schema.json",
      "timeout": 0,
      "sendEmpty": false,
      "sendGetBody": false,
      "requestDatatype": "JSON",
      "responseDatatype": "JSON",
      "headers": {},
      "responseObjects": [
        {
          "type": "default",
          "key": "",
          "mockFile": ""
        }
      ]
    },
    {
      "name": "deleteDNSPoolMemberA",
      "protocol": "REST",
      "method": "DELETE",
      "entitypath": "{base_path}/{version}/mgmt/cm/dns/working-config/pool/a/{pathv1}/members/{pathv2}?{query}",
      "requestSchema": "schema.json",
      "responseSchema": "schema.json",
      "timeout": 0,
      "sendEmpty": false,
      "requestDatatype": "JSON",
      "responseDatatype": "JSON",
      "headers": {},
      "responseObjects": [
        {
          "type": "default",
          "key": "",
          "mockFile": ""
        }
      ]
    },
    {
      "name": "patchDNSPoolMemberA",
      "protocol": "REST",
      "method": "PATCH",
      "entitypath": "{base_path}/{version}/mgmt/cm/dns/working-config/pool/a/{pathv1}/members/{pathv2}?{query}",
      "requestSchema": "schema.json",
      "responseSchema": "schema.json",
      "timeout": 0,
      "sendEmpty": false,
      "requestDatatype": "JSON",
      "responseDatatype": "JSON",
      "headers": {},
      "responseObjects": [
        {
          "type": "default",
          "key": "",
          "mockFile": ""
        }
      ]
    },
    {
      "name": "postDNSPoolMemberA",
      "protocol": "REST",
      "method": "POST",
      "entitypath": "{base_path}/{version}/mgmt/cm/dns/working-config/pool/a/{pathv1}/members?{query}",
      "requestSchema": "schema.json",
      "responseSchema": "schema.json",
      "timeout": 0,
      "sendEmpty": false,
      "requestDatatype": "JSON",
      "responseDatatype": "JSON",
      "headers": {},
      "responseObjects": [
        {
          "type": "default",
          "key": "",
          "mockFile": ""
        }
      ]
    },
    {
      "name": "getDNSPoolMemberAAAA",
      "protocol": "REST",
      "method": "GET",
      "entitypath": "{base_path}/{version}/mgmt/cm/dns/working-config/pool/aaaa/{pathv1}/members/{pathv2}?{query}",
      "requestSchema": "schema.json",
      "responseSchema": "schema.json",
      "timeout": 0,
      "sendEmpty": false,
      "sendGetBody": false,
      "requestDatatype": "JSON",
      "responseDatatype": "JSON",
      "headers": {},
      "responseObjects": [
        {
          "type": "default",
          "key": "",
          "mockFile": ""
        }
      ]
    },
    {
      "name": "deleteDNSPoolMember",
      "protocol": "REST",
      "method": "DELETE",
      "entitypath": "{base_path}/{version}/mgmt/cm/dns/working-config/pool/aaaa/{pathv1}/members/{pathv2}?{query}",
      "requestSchema": "schema.json",
      "responseSchema": "schema.json",
      "timeout": 0,
      "sendEmpty": false,
      "requestDatatype": "JSON",
      "responseDatatype": "JSON",
      "headers": {},
      "responseObjects": [
        {
          "type": "default",
          "key": "",
          "mockFile": ""
        }
      ]
    },
    {
      "name": "patchDNSPoolMemberAAAA",
      "protocol": "REST",
      "method": "PATCH",
      "entitypath": "{base_path}/{version}/mgmt/cm/dns/working-config/pool/aaaa/{pathv1}/members/{pathv2}?{query}",
      "requestSchema": "schema.json",
      "responseSchema": "schema.json",
      "timeout": 0,
      "sendEmpty": false,
      "requestDatatype": "JSON",
      "responseDatatype": "JSON",
      "headers": {},
      "responseObjects": [
        {
          "type": "default",
          "key": "",
          "mockFile": ""
        }
      ]
    },
    {
      "name": "postDNSPoolMemberAAAA",
      "protocol": "REST",
      "method": "POST",
      "entitypath": "{base_path}/{version}/mgmt/cm/dns/working-config/pool/aaaa/{pathv1}/members?{query}",
      "requestSchema": "schema.json",
      "responseSchema": "schema.json",
      "timeout": 0,
      "sendEmpty": false,
      "requestDatatype": "JSON",
      "responseDatatype": "JSON",
      "headers": {},
      "responseObjects": [
        {
          "type": "default",
          "key": "",
          "mockFile": ""
        }
      ]
    },
    {
      "name": "getDNSPoolMemberCNAME",
      "protocol": "REST",
      "method": "GET",
      "entitypath": "{base_path}/{version}/mgmt/cm/dns/working-config/pool/cname/{pathv1}/members/{pathv2}?{query}",
      "requestSchema": "schema.json",
      "responseSchema": "schema.json",
      "timeout": 0,
      "sendEmpty": false,
      "sendGetBody": false,
      "requestDatatype": "JSON",
      "responseDatatype": "JSON",
      "headers": {},
      "responseObjects": [
        {
          "type": "default",
          "key": "",
          "mockFile": ""
        }
      ]
    },
    {
      "name": "deleteDNSPoolMemberCNAME",
      "protocol": "REST",
      "method": "DELETE",
      "entitypath": "{base_path}/{version}/mgmt/cm/dns/working-config/pool/cname/{pathv1}/members/{pathv2}?{query}",
      "requestSchema": "schema.json",
      "responseSchema": "schema.json",
      "timeout": 0,
      "sendEmpty": false,
      "requestDatatype": "JSON",
      "responseDatatype": "JSON",
      "headers": {},
      "responseObjects": [
        {
          "type": "default",
          "key": "",
          "mockFile": ""
        }
      ]
    },
    {
      "name": "patchDNSPoolMemberCNAME",
      "protocol": "REST",
      "method": "PATCH",
      "entitypath": "{base_path}/{version}/mgmt/cm/dns/working-config/pool/cname/{pathv1}/members/{pathv2}?{query}",
      "requestSchema": "schema.json",
      "responseSchema": "schema.json",
      "timeout": 0,
      "sendEmpty": false,
      "requestDatatype": "JSON",
      "responseDatatype": "JSON",
      "headers": {},
      "responseObjects": [
        {
          "type": "default",
          "key": "",
          "mockFile": ""
        }
      ]
    },
    {
      "name": "postDNSPoolMemberCNAME",
      "protocol": "REST",
      "method": "POST",
      "entitypath": "{base_path}/{version}/mgmt/cm/dns/working-config/pool/cname/{pathv1}/members?{query}",
      "requestSchema": "schema.json",
      "responseSchema": "schema.json",
      "timeout": 0,
      "sendEmpty": false,
      "requestDatatype": "JSON",
      "responseDatatype": "JSON",
      "headers": {},
      "responseObjects": [
        {
          "type": "default",
          "key": "",
          "mockFile": ""
        }
      ]
    },
    {
      "name": "getDNSPoolMemberMX",
      "protocol": "REST",
      "method": "GET",
      "entitypath": "{base_path}/{version}/mgmt/cm/dns/working-config/pool/mx/{pathv1}/members/{pathv2}?{query}",
      "requestSchema": "schema.json",
      "responseSchema": "schema.json",
      "timeout": 0,
      "sendEmpty": false,
      "sendGetBody": false,
      "requestDatatype": "JSON",
      "responseDatatype": "JSON",
      "headers": {},
      "responseObjects": [
        {
          "type": "default",
          "key": "",
          "mockFile": ""
        }
      ]
    },
    {
      "name": "deleteDNSPoolMemberMX",
      "protocol": "REST",
      "method": "DELETE",
      "entitypath": "{base_path}/{version}/mgmt/cm/dns/working-config/pool/mx/{pathv1}/members/{pathv2}?{query}",
      "requestSchema": "schema.json",
      "responseSchema": "schema.json",
      "timeout": 0,
      "sendEmpty": false,
      "requestDatatype": "JSON",
      "responseDatatype": "JSON",
      "headers": {},
      "responseObjects": [
        {
          "type": "default",
          "key": "",
          "mockFile": ""
        }
      ]
    },
    {
      "name": "patchDNSPoolMemberMX",
      "protocol": "REST",
      "method": "PATCH",
      "entitypath": "{base_path}/{version}/mgmt/cm/dns/working-config/pool/mx/{pathv1}/members/{pathv2}?{query}",
      "requestSchema": "schema.json",
      "responseSchema": "schema.json",
      "timeout": 0,
      "sendEmpty": false,
      "requestDatatype": "JSON",
      "responseDatatype": "JSON",
      "headers": {},
      "responseObjects": [
        {
          "type": "default",
          "key": "",
          "mockFile": ""
        }
      ]
    },
    {
      "name": "postDNSPoolMemberMX",
      "protocol": "REST",
      "method": "POST",
      "entitypath": "{base_path}/{version}/mgmt/cm/dns/working-config/pool/mx/{pathv1}/members?{query}",
      "requestSchema": "schema.json",
      "responseSchema": "schema.json",
      "timeout": 0,
      "sendEmpty": false,
      "requestDatatype": "JSON",
      "responseDatatype": "JSON",
      "headers": {},
      "responseObjects": [
        {
          "type": "default",
          "key": "",
          "mockFile": ""
        }
      ]
    },
    {
      "name": "getDNSPoolMemberNAPTR",
      "protocol": "REST",
      "method": "GET",
      "entitypath": "{base_path}/{version}/mgmt/cm/dns/working-config/pool/naptr/{pathv1}/members/{pathv2}?{query}",
      "requestSchema": "schema.json",
      "responseSchema": "schema.json",
      "timeout": 0,
      "sendEmpty": false,
      "sendGetBody": false,
      "requestDatatype": "JSON",
      "responseDatatype": "JSON",
      "headers": {},
      "responseObjects": [
        {
          "type": "default",
          "key": "",
          "mockFile": ""
        }
      ]
    },
    {
      "name": "deleteDNSPoolMemberNAPTR",
      "protocol": "REST",
      "method": "DELETE",
      "entitypath": "{base_path}/{version}/mgmt/cm/dns/working-config/pool/naptr/{pathv1}/members/{pathv2}?{query}",
      "requestSchema": "schema.json",
      "responseSchema": "schema.json",
      "timeout": 0,
      "sendEmpty": false,
      "requestDatatype": "JSON",
      "responseDatatype": "JSON",
      "headers": {},
      "responseObjects": [
        {
          "type": "default",
          "key": "",
          "mockFile": ""
        }
      ]
    },
    {
      "name": "patchDNSPoolMemberNAPTR",
      "protocol": "REST",
      "method": "PATCH",
      "entitypath": "{base_path}/{version}/mgmt/cm/dns/working-config/pool/naptr/{pathv1}/members/{pathv2}?{query}",
      "requestSchema": "schema.json",
      "responseSchema": "schema.json",
      "timeout": 0,
      "sendEmpty": false,
      "requestDatatype": "JSON",
      "responseDatatype": "JSON",
      "headers": {},
      "responseObjects": [
        {
          "type": "default",
          "key": "",
          "mockFile": ""
        }
      ]
    },
    {
      "name": "postDNSPoolMemberNAPTR",
      "protocol": "REST",
      "method": "POST",
      "entitypath": "{base_path}/{version}/mgmt/cm/dns/working-config/pool/naptr/{pathv1}/members?{query}",
      "requestSchema": "schema.json",
      "responseSchema": "schema.json",
      "timeout": 0,
      "sendEmpty": false,
      "requestDatatype": "JSON",
      "responseDatatype": "JSON",
      "headers": {},
      "responseObjects": [
        {
          "type": "default",
          "key": "",
          "mockFile": ""
        }
      ]
    },
    {
      "name": "getDNSPoolMemberSRV",
      "protocol": "REST",
      "method": "GET",
      "entitypath": "{base_path}/{version}/mgmt/cm/dns/working-config/pool/srv/{pathv1}/members/{pathv2}?{query}",
      "requestSchema": "schema.json",
      "responseSchema": "schema.json",
      "timeout": 0,
      "sendEmpty": false,
      "sendGetBody": false,
      "requestDatatype": "JSON",
      "responseDatatype": "JSON",
      "headers": {},
      "responseObjects": [
        {
          "type": "default",
          "key": "",
          "mockFile": ""
        }
      ]
    },
    {
      "name": "deleteDNSPoolMemberSRV",
      "protocol": "REST",
      "method": "DELETE",
      "entitypath": "{base_path}/{version}/mgmt/cm/dns/working-config/pool/srv/{pathv1}/members/{pathv2}?{query}",
      "requestSchema": "schema.json",
      "responseSchema": "schema.json",
      "timeout": 0,
      "sendEmpty": false,
      "requestDatatype": "JSON",
      "responseDatatype": "JSON",
      "headers": {},
      "responseObjects": [
        {
          "type": "default",
          "key": "",
          "mockFile": ""
        }
      ]
    },
    {
      "name": "patchDNSPoolMemberSRV",
      "protocol": "REST",
      "method": "PATCH",
      "entitypath": "{base_path}/{version}/mgmt/cm/dns/working-config/pool/srv/{pathv1}/members/{pathv2}?{query}",
      "requestSchema": "schema.json",
      "responseSchema": "schema.json",
      "timeout": 0,
      "sendEmpty": false,
      "requestDatatype": "JSON",
      "responseDatatype": "JSON",
      "headers": {},
      "responseObjects": [
        {
          "type": "default",
          "key": "",
          "mockFile": ""
        }
      ]
    },
    {
      "name": "postDNSPoolMemberSRV",
      "protocol": "REST",
      "method": "POST",
      "entitypath": "{base_path}/{version}/mgmt/cm/dns/working-config/pool/srv/{pathv1}/members?{query}",
      "requestSchema": "schema.json",
      "responseSchema": "schema.json",
      "timeout": 0,
      "sendEmpty": false,
      "requestDatatype": "JSON",
      "responseDatatype": "JSON",
      "headers": {},
      "responseObjects": [
        {
          "type": "default",
          "key": "",
          "mockFile": ""
        }
      ]
    },
    {
      "name": "patchDNSPoolMX",
      "protocol": "REST",
      "method": "PATCH",
      "entitypath": "{base_path}/{version}/mgmt/cm/dns/working-config/pool/mx/{pathv1}?{query}",
      "requestSchema": "schema.json",
      "responseSchema": "schema.json",
      "timeout": 0,
      "sendEmpty": false,
      "requestDatatype": "JSON",
      "responseDatatype": "JSON",
      "headers": {},
      "responseObjects": [
        {
          "type": "default",
          "key": "",
          "mockFile": ""
        }
      ]
    },
    {
      "name": "deleteDNSPoolMX",
      "protocol": "REST",
      "method": "DELETE",
      "entitypath": "{base_path}/{version}/mgmt/cm/dns/working-config/pool/mx/{pathv1}?{query}",
      "requestSchema": "schema.json",
      "responseSchema": "schema.json",
      "timeout": 0,
      "sendEmpty": false,
      "requestDatatype": "JSON",
      "responseDatatype": "JSON",
      "headers": {},
      "responseObjects": [
        {
          "type": "default",
          "key": "",
          "mockFile": ""
        }
      ]
    },
    {
      "name": "getDNSPoolMX",
      "protocol": "REST",
      "method": "GET",
      "entitypath": "{base_path}/{version}/mgmt/cm/dns/working-config/pool/mx/{pathv1}?{query}",
      "requestSchema": "schema.json",
      "responseSchema": "schema.json",
      "timeout": 0,
      "sendEmpty": false,
      "sendGetBody": false,
      "requestDatatype": "JSON",
      "responseDatatype": "JSON",
      "headers": {},
      "responseObjects": [
        {
          "type": "default",
          "key": "",
          "mockFile": ""
        }
      ]
    },
    {
      "name": "postDNSPoolMX",
      "protocol": "REST",
      "method": "POST",
      "entitypath": "{base_path}/{version}/mgmt/cm/dns/working-config/pool/mx?{query}",
      "requestSchema": "schema.json",
      "responseSchema": "schema.json",
      "timeout": 0,
      "sendEmpty": false,
      "requestDatatype": "JSON",
      "responseDatatype": "JSON",
      "headers": {},
      "responseObjects": [
        {
          "type": "default",
          "key": "",
          "mockFile": ""
        }
      ]
    },
    {
      "name": "getDNSPoolNAPTR",
      "protocol": "REST",
      "method": "GET",
      "entitypath": "{base_path}/{version}/mgmt/cm/dns/working-config/pool/naptr/{pathv1}?{query}",
      "requestSchema": "schema.json",
      "responseSchema": "schema.json",
      "timeout": 0,
      "sendEmpty": false,
      "sendGetBody": false,
      "requestDatatype": "JSON",
      "responseDatatype": "JSON",
      "headers": {},
      "responseObjects": [
        {
          "type": "default",
          "key": "",
          "mockFile": ""
        }
      ]
    },
    {
      "name": "deleteDNSPoolNAPTR",
      "protocol": "REST",
      "method": "DELETE",
      "entitypath": "{base_path}/{version}/mgmt/cm/dns/working-config/pool/naptr/{pathv1}?{query}",
      "requestSchema": "schema.json",
      "responseSchema": "schema.json",
      "timeout": 0,
      "sendEmpty": false,
      "requestDatatype": "JSON",
      "responseDatatype": "JSON",
      "headers": {},
      "responseObjects": [
        {
          "type": "default",
          "key": "",
          "mockFile": ""
        }
      ]
    },
    {
      "name": "patchDNSPoolNAPTR",
      "protocol": "REST",
      "method": "PATCH",
      "entitypath": "{base_path}/{version}/mgmt/cm/dns/working-config/pool/naptr/{pathv1}?{query}",
      "requestSchema": "schema.json",
      "responseSchema": "schema.json",
      "timeout": 0,
      "sendEmpty": false,
      "requestDatatype": "JSON",
      "responseDatatype": "JSON",
      "headers": {},
      "responseObjects": [
        {
          "type": "default",
          "key": "",
          "mockFile": ""
        }
      ]
    },
    {
      "name": "getDNSPoolSRV",
      "protocol": "REST",
      "method": "GET",
      "entitypath": "{base_path}/{version}/mgmt/cm/dns/working-config/pool/srv/{pathv1}?{query}",
      "requestSchema": "schema.json",
      "responseSchema": "schema.json",
      "timeout": 0,
      "sendEmpty": false,
      "sendGetBody": false,
      "requestDatatype": "JSON",
      "responseDatatype": "JSON",
      "headers": {},
      "responseObjects": [
        {
          "type": "default",
          "key": "",
          "mockFile": ""
        }
      ]
    },
    {
      "name": "deleteDNSPoolSRV",
      "protocol": "REST",
      "method": "DELETE",
      "entitypath": "{base_path}/{version}/mgmt/cm/dns/working-config/pool/srv/{pathv1}?{query}",
      "requestSchema": "schema.json",
      "responseSchema": "schema.json",
      "timeout": 0,
      "sendEmpty": false,
      "requestDatatype": "JSON",
      "responseDatatype": "JSON",
      "headers": {},
      "responseObjects": [
        {
          "type": "default",
          "key": "",
          "mockFile": ""
        }
      ]
    },
    {
      "name": "patchDNSPoolSRV",
      "protocol": "REST",
      "method": "PATCH",
      "entitypath": "{base_path}/{version}/mgmt/cm/dns/working-config/pool/srv/{pathv1}?{query}",
      "requestSchema": "schema.json",
      "responseSchema": "schema.json",
      "timeout": 0,
      "sendEmpty": false,
      "requestDatatype": "JSON",
      "responseDatatype": "JSON",
      "headers": {},
      "responseObjects": [
        {
          "type": "default",
          "key": "",
          "mockFile": ""
        }
      ]
    },
    {
      "name": "postDNSPoolNAPTR",
      "protocol": "REST",
      "method": "POST",
      "entitypath": "{base_path}/{version}/mgmt/cm/dns/working-config/pool/naptr?{query}",
      "requestSchema": "schema.json",
      "responseSchema": "schema.json",
      "timeout": 0,
      "sendEmpty": false,
      "requestDatatype": "JSON",
      "responseDatatype": "JSON",
      "headers": {},
      "responseObjects": [
        {
          "type": "default",
          "key": "",
          "mockFile": ""
        }
      ]
    },
    {
      "name": "postDNSPoolSRV",
      "protocol": "REST",
      "method": "POST",
      "entitypath": "{base_path}/{version}/mgmt/cm/dns/working-config/pool/srv?{query}",
      "requestSchema": "schema.json",
      "responseSchema": "schema.json",
      "timeout": 0,
      "sendEmpty": false,
      "requestDatatype": "JSON",
      "responseDatatype": "JSON",
      "headers": {},
      "responseObjects": [
        {
          "type": "default",
          "key": "",
          "mockFile": ""
        }
      ]
    },
    {
      "name": "getDNSRegion",
      "protocol": "REST",
      "method": "GET",
      "entitypath": "{base_path}/{version}/mgmt/cm/dns/working-config/region/{pathv1}?{query}",
      "requestSchema": "schema.json",
      "responseSchema": "schema.json",
      "timeout": 0,
      "sendEmpty": false,
      "sendGetBody": false,
      "requestDatatype": "JSON",
      "responseDatatype": "JSON",
      "headers": {},
      "responseObjects": [
        {
          "type": "default",
          "key": "",
          "mockFile": ""
        }
      ]
    },
    {
      "name": "deleteDNSRegion",
      "protocol": "REST",
      "method": "DELETE",
      "entitypath": "{base_path}/{version}/mgmt/cm/dns/working-config/region/{pathv1}?{query}",
      "requestSchema": "schema.json",
      "responseSchema": "schema.json",
      "timeout": 0,
      "sendEmpty": false,
      "requestDatatype": "JSON",
      "responseDatatype": "JSON",
      "headers": {},
      "responseObjects": [
        {
          "type": "default",
          "key": "",
          "mockFile": ""
        }
      ]
    },
    {
      "name": "patchDNSRegion",
      "protocol": "REST",
      "method": "PATCH",
      "entitypath": "{base_path}/{version}/mgmt/cm/dns/working-config/region/{pathv1}?{query}",
      "requestSchema": "schema.json",
      "responseSchema": "schema.json",
      "timeout": 0,
      "sendEmpty": false,
      "requestDatatype": "JSON",
      "responseDatatype": "JSON",
      "headers": {},
      "responseObjects": [
        {
          "type": "default",
          "key": "",
          "mockFile": ""
        }
      ]
    },
    {
      "name": "postDNSRegion",
      "protocol": "REST",
      "method": "POST",
      "entitypath": "{base_path}/{version}/mgmt/cm/dns/working-config/region?{query}",
      "requestSchema": "schema.json",
      "responseSchema": "schema.json",
      "timeout": 0,
      "sendEmpty": false,
      "requestDatatype": "JSON",
      "responseDatatype": "JSON",
      "headers": {},
      "responseObjects": [
        {
          "type": "default",
          "key": "",
          "mockFile": ""
        }
      ]
    },
    {
      "name": "patchDNSServer",
      "protocol": "REST",
      "method": "PATCH",
      "entitypath": "{base_path}/{version}/mgmt/cm/dns/working-config/server/{pathv1}?{query}",
      "requestSchema": "schema.json",
      "responseSchema": "schema.json",
      "timeout": 0,
      "sendEmpty": false,
      "requestDatatype": "JSON",
      "responseDatatype": "JSON",
      "headers": {},
      "responseObjects": [
        {
          "type": "default",
          "key": "",
          "mockFile": ""
        }
      ]
    },
    {
      "name": "getDNSServer",
      "protocol": "REST",
      "method": "GET",
      "entitypath": "{base_path}/{version}/mgmt/cm/dns/working-config/server/{pathv1}?{query}",
      "requestSchema": "schema.json",
      "responseSchema": "schema.json",
      "timeout": 0,
      "sendEmpty": false,
      "sendGetBody": false,
      "requestDatatype": "JSON",
      "responseDatatype": "JSON",
      "headers": {},
      "responseObjects": [
        {
          "type": "default",
          "key": "",
          "mockFile": ""
        }
      ]
    },
    {
      "name": "deleteDNSServer",
      "protocol": "REST",
      "method": "DELETE",
      "entitypath": "{base_path}/{version}/mgmt/cm/dns/working-config/server/{pathv1}?{query}",
      "requestSchema": "schema.json",
      "responseSchema": "schema.json",
      "timeout": 0,
      "sendEmpty": false,
      "requestDatatype": "JSON",
      "responseDatatype": "JSON",
      "headers": {},
      "responseObjects": [
        {
          "type": "default",
          "key": "",
          "mockFile": ""
        }
      ]
    },
    {
      "name": "postDNSServer",
      "protocol": "REST",
      "method": "POST",
      "entitypath": "{base_path}/{version}/mgmt/cm/dns/working-config/server?{query}",
      "requestSchema": "schema.json",
      "responseSchema": "schema.json",
      "timeout": 0,
      "sendEmpty": false,
      "requestDatatype": "JSON",
      "responseDatatype": "JSON",
      "headers": {},
      "responseObjects": [
        {
          "type": "default",
          "key": "",
          "mockFile": ""
        }
      ]
    },
    {
      "name": "getDNSServerDevice",
      "protocol": "REST",
      "method": "GET",
      "entitypath": "{base_path}/{version}/mgmt/cm/dns/working-config/server/{pathv1}/devices/{pathv2}?{query}",
      "requestSchema": "schema.json",
      "responseSchema": "schema.json",
      "timeout": 0,
      "sendEmpty": false,
      "sendGetBody": false,
      "requestDatatype": "JSON",
      "responseDatatype": "JSON",
      "headers": {},
      "responseObjects": [
        {
          "type": "default",
          "key": "",
          "mockFile": ""
        }
      ]
    },
    {
      "name": "deleteDNSServerDevice",
      "protocol": "REST",
      "method": "DELETE",
      "entitypath": "{base_path}/{version}/mgmt/cm/dns/working-config/server/{pathv1}/devices/{pathv2}?{query}",
      "requestSchema": "schema.json",
      "responseSchema": "schema.json",
      "timeout": 0,
      "sendEmpty": false,
      "requestDatatype": "JSON",
      "responseDatatype": "JSON",
      "headers": {},
      "responseObjects": [
        {
          "type": "default",
          "key": "",
          "mockFile": ""
        }
      ]
    },
    {
      "name": "patchDNSServerDevice",
      "protocol": "REST",
      "method": "PATCH",
      "entitypath": "{base_path}/{version}/mgmt/cm/dns/working-config/server/{pathv1}/devices/{pathv2}?{query}",
      "requestSchema": "schema.json",
      "responseSchema": "schema.json",
      "timeout": 0,
      "sendEmpty": false,
      "requestDatatype": "JSON",
      "responseDatatype": "JSON",
      "headers": {},
      "responseObjects": [
        {
          "type": "default",
          "key": "",
          "mockFile": ""
        }
      ]
    },
    {
      "name": "postDNSServerDevice",
      "protocol": "REST",
      "method": "POST",
      "entitypath": "{base_path}/{version}/mgmt/cm/dns/working-config/server/{pathv1}/devices?{query}",
      "requestSchema": "schema.json",
      "responseSchema": "schema.json",
      "timeout": 0,
      "sendEmpty": false,
      "requestDatatype": "JSON",
      "responseDatatype": "JSON",
      "headers": {},
      "responseObjects": [
        {
          "type": "default",
          "key": "",
          "mockFile": ""
        }
      ]
    },
    {
      "name": "getDNSTopology",
      "protocol": "REST",
      "method": "GET",
      "entitypath": "{base_path}/{version}/mgmt/cm/dns/working-config/topology/{pathv1}?{query}",
      "requestSchema": "schema.json",
      "responseSchema": "schema.json",
      "timeout": 0,
      "sendEmpty": false,
      "sendGetBody": false,
      "requestDatatype": "JSON",
      "responseDatatype": "JSON",
      "headers": {},
      "responseObjects": [
        {
          "type": "default",
          "key": "",
          "mockFile": ""
        }
      ]
    },
    {
      "name": "deleteDNSTopolgoy",
      "protocol": "REST",
      "method": "DELETE",
      "entitypath": "{base_path}/{version}/mgmt/cm/dns/working-config/topology/{pathv1}?{query}",
      "requestSchema": "schema.json",
      "responseSchema": "schema.json",
      "timeout": 0,
      "sendEmpty": false,
      "requestDatatype": "JSON",
      "responseDatatype": "JSON",
      "headers": {},
      "responseObjects": [
        {
          "type": "default",
          "key": "",
          "mockFile": ""
        }
      ]
    },
    {
      "name": "patchDNSTopology",
      "protocol": "REST",
      "method": "PATCH",
      "entitypath": "{base_path}/{version}/mgmt/cm/dns/working-config/topology/{pathv1}?{query}",
      "requestSchema": "schema.json",
      "responseSchema": "schema.json",
      "timeout": 0,
      "sendEmpty": false,
      "requestDatatype": "JSON",
      "responseDatatype": "JSON",
      "headers": {},
      "responseObjects": [
        {
          "type": "default",
          "key": "",
          "mockFile": ""
        }
      ]
    },
    {
      "name": "postDNSTopology",
      "protocol": "REST",
      "method": "POST",
      "entitypath": "{base_path}/{version}/mgmt/cm/dns/working-config/topology?{query}",
      "requestSchema": "schema.json",
      "responseSchema": "schema.json",
      "timeout": 0,
      "sendEmpty": false,
      "requestDatatype": "JSON",
      "responseDatatype": "JSON",
      "headers": {},
      "responseObjects": [
        {
          "type": "default",
          "key": "",
          "mockFile": ""
        }
      ]
    },
    {
      "name": "patchDNSVirtualServer",
      "protocol": "REST",
      "method": "PATCH",
      "entitypath": "{base_path}/{version}/mgmt/cm/dns/working-config/server/{pathv1}/virtual-servers/{pathv2}?{query}",
      "requestSchema": "schema.json",
      "responseSchema": "schema.json",
      "timeout": 0,
      "sendEmpty": false,
      "requestDatatype": "JSON",
      "responseDatatype": "JSON",
      "headers": {},
      "responseObjects": [
        {
          "type": "default",
          "key": "",
          "mockFile": ""
        }
      ]
    },
    {
      "name": "getDNSVirtualServer",
      "protocol": "REST",
      "method": "GET",
      "entitypath": "{base_path}/{version}/mgmt/cm/dns/working-config/server/{pathv1}/virtual-servers/{pathv2}?{query}",
      "requestSchema": "schema.json",
      "responseSchema": "schema.json",
      "timeout": 0,
      "sendEmpty": false,
      "sendGetBody": false,
      "requestDatatype": "JSON",
      "responseDatatype": "JSON",
      "headers": {},
      "responseObjects": [
        {
          "type": "default",
          "key": "",
          "mockFile": ""
        }
      ]
    },
    {
      "name": "deleteDNSVirtualServer",
      "protocol": "REST",
      "method": "DELETE",
      "entitypath": "{base_path}/{version}/mgmt/cm/dns/working-config/server/{pathv1}/virtual-servers/{pathv2}?{query}",
      "requestSchema": "schema.json",
      "responseSchema": "schema.json",
      "timeout": 0,
      "sendEmpty": false,
      "requestDatatype": "JSON",
      "responseDatatype": "JSON",
      "headers": {},
      "responseObjects": [
        {
          "type": "default",
          "key": "",
          "mockFile": ""
        }
      ]
    },
    {
      "name": "postDNSVirtualServer",
      "protocol": "REST",
      "method": "POST",
      "entitypath": "{base_path}/{version}/mgmt/cm/dns/working-config/server/{pathv1}/virtual-servers?{query}",
      "requestSchema": "schema.json",
      "responseSchema": "schema.json",
      "timeout": 0,
      "sendEmpty": false,
      "requestDatatype": "JSON",
      "responseDatatype": "JSON",
      "headers": {},
      "responseObjects": [
        {
          "type": "default",
          "key": "",
          "mockFile": ""
        }
      ]
    },
    {
      "name": "getDNSWideIPA",
      "protocol": "REST",
      "method": "GET",
      "entitypath": "{base_path}/{version}/mgmt/cm/dns/working-config/wideip/a/{pathv1}?{query}",
      "requestSchema": "schema.json",
      "responseSchema": "schema.json",
      "timeout": 0,
      "sendEmpty": false,
      "sendGetBody": false,
      "requestDatatype": "JSON",
      "responseDatatype": "JSON",
      "headers": {},
      "responseObjects": [
        {
          "type": "default",
          "key": "",
          "mockFile": ""
        }
      ]
    },
    {
      "name": "deleteDNSWideIPA",
      "protocol": "REST",
      "method": "DELETE",
      "entitypath": "{base_path}/{version}/mgmt/cm/dns/working-config/wideip/a/{pathv1}?{query}",
      "requestSchema": "schema.json",
      "responseSchema": "schema.json",
      "timeout": 0,
      "sendEmpty": false,
      "requestDatatype": "JSON",
      "responseDatatype": "JSON",
      "headers": {},
      "responseObjects": [
        {
          "type": "default",
          "key": "",
          "mockFile": ""
        }
      ]
    },
    {
      "name": "patchDNSWideIPA",
      "protocol": "REST",
      "method": "PATCH",
      "entitypath": "{base_path}/{version}/mgmt/cm/dns/working-config/wideip/a/{pathv1}?{query}",
      "requestSchema": "schema.json",
      "responseSchema": "schema.json",
      "timeout": 0,
      "sendEmpty": false,
      "requestDatatype": "JSON",
      "responseDatatype": "JSON",
      "headers": {},
      "responseObjects": [
        {
          "type": "default",
          "key": "",
          "mockFile": ""
        }
      ]
    },
    {
      "name": "postDNSWideIPA",
      "protocol": "REST",
      "method": "POST",
      "entitypath": "{base_path}/{version}/mgmt/cm/dns/working-config/wideip/a?{query}",
      "requestSchema": "schema.json",
      "responseSchema": "schema.json",
      "timeout": 0,
      "sendEmpty": false,
      "requestDatatype": "JSON",
      "responseDatatype": "JSON",
      "headers": {},
      "responseObjects": [
        {
          "type": "default",
          "key": "",
          "mockFile": ""
        }
      ]
    },
    {
      "name": "getDNSWideIPAAAA",
      "protocol": "REST",
      "method": "GET",
      "entitypath": "{base_path}/{version}/mgmt/cm/dns/working-config/wideip/aaaa/{pathv1}?{query}",
      "requestSchema": "schema.json",
      "responseSchema": "schema.json",
      "timeout": 0,
      "sendEmpty": false,
      "sendGetBody": false,
      "requestDatatype": "JSON",
      "responseDatatype": "JSON",
      "headers": {},
      "responseObjects": [
        {
          "type": "default",
          "key": "",
          "mockFile": ""
        }
      ]
    },
    {
      "name": "deleteDNSWideIPAAAA",
      "protocol": "REST",
      "method": "DELETE",
      "entitypath": "{base_path}/{version}/mgmt/cm/dns/working-config/wideip/aaaa/{pathv1}?{query}",
      "requestSchema": "schema.json",
      "responseSchema": "schema.json",
      "timeout": 0,
      "sendEmpty": false,
      "requestDatatype": "JSON",
      "responseDatatype": "JSON",
      "headers": {},
      "responseObjects": [
        {
          "type": "default",
          "key": "",
          "mockFile": ""
        }
      ]
    },
    {
      "name": "patchDNSWideIPAAAA",
      "protocol": "REST",
      "method": "PATCH",
      "entitypath": "{base_path}/{version}/mgmt/cm/dns/working-config/wideip/aaaa/{pathv1}?{query}",
      "requestSchema": "schema.json",
      "responseSchema": "schema.json",
      "timeout": 0,
      "sendEmpty": false,
      "requestDatatype": "JSON",
      "responseDatatype": "JSON",
      "headers": {},
      "responseObjects": [
        {
          "type": "default",
          "key": "",
          "mockFile": ""
        }
      ]
    },
    {
      "name": "postDNSWideIPAAAA",
      "protocol": "REST",
      "method": "POST",
      "entitypath": "{base_path}/{version}/mgmt/cm/dns/working-config/wideip/aaaa?{query}",
      "requestSchema": "schema.json",
      "responseSchema": "schema.json",
      "timeout": 0,
      "sendEmpty": false,
      "requestDatatype": "JSON",
      "responseDatatype": "JSON",
      "headers": {},
      "responseObjects": [
        {
          "type": "default",
          "key": "",
          "mockFile": ""
        }
      ]
    },
    {
      "name": "getDNSWideIPCNAME",
      "protocol": "REST",
      "method": "GET",
      "entitypath": "{base_path}/{version}/mgmt/cm/dns/working-config/wideip/cname/{pathv1}?{query}",
      "requestSchema": "schema.json",
      "responseSchema": "schema.json",
      "timeout": 0,
      "sendEmpty": false,
      "sendGetBody": false,
      "requestDatatype": "JSON",
      "responseDatatype": "JSON",
      "headers": {},
      "responseObjects": [
        {
          "type": "default",
          "key": "",
          "mockFile": ""
        }
      ]
    },
    {
      "name": "deleteDNSWideIPCNAME",
      "protocol": "REST",
      "method": "DELETE",
      "entitypath": "{base_path}/{version}/mgmt/cm/dns/working-config/wideip/cname/{pathv1}?{query}",
      "requestSchema": "schema.json",
      "responseSchema": "schema.json",
      "timeout": 0,
      "sendEmpty": false,
      "requestDatatype": "JSON",
      "responseDatatype": "JSON",
      "headers": {},
      "responseObjects": [
        {
          "type": "default",
          "key": "",
          "mockFile": ""
        }
      ]
    },
    {
      "name": "patchDNSWideIPCNAME",
      "protocol": "REST",
      "method": "PATCH",
      "entitypath": "{base_path}/{version}/mgmt/cm/dns/working-config/wideip/cname/{pathv1}?{query}",
      "requestSchema": "schema.json",
      "responseSchema": "schema.json",
      "timeout": 0,
      "sendEmpty": false,
      "requestDatatype": "JSON",
      "responseDatatype": "JSON",
      "headers": {},
      "responseObjects": [
        {
          "type": "default",
          "key": "",
          "mockFile": ""
        }
      ]
    },
    {
      "name": "getDNSWideIPMX",
      "protocol": "REST",
      "method": "GET",
      "entitypath": "{base_path}/{version}/mgmt/cm/dns/working-config/wideip/mx/{pathv1}?{query}",
      "requestSchema": "schema.json",
      "responseSchema": "schema.json",
      "timeout": 0,
      "sendEmpty": false,
      "sendGetBody": false,
      "requestDatatype": "JSON",
      "responseDatatype": "JSON",
      "headers": {},
      "responseObjects": [
        {
          "type": "default",
          "key": "",
          "mockFile": ""
        }
      ]
    },
    {
      "name": "deleteDNSWideIPMX",
      "protocol": "REST",
      "method": "DELETE",
      "entitypath": "{base_path}/{version}/mgmt/cm/dns/working-config/wideip/mx/{pathv1}?{query}",
      "requestSchema": "schema.json",
      "responseSchema": "schema.json",
      "timeout": 0,
      "sendEmpty": false,
      "requestDatatype": "JSON",
      "responseDatatype": "JSON",
      "headers": {},
      "responseObjects": [
        {
          "type": "default",
          "key": "",
          "mockFile": ""
        }
      ]
    },
    {
      "name": "patchDNSWideIPMX",
      "protocol": "REST",
      "method": "PATCH",
      "entitypath": "{base_path}/{version}/mgmt/cm/dns/working-config/wideip/mx/{pathv1}?{query}",
      "requestSchema": "schema.json",
      "responseSchema": "schema.json",
      "timeout": 0,
      "sendEmpty": false,
      "requestDatatype": "JSON",
      "responseDatatype": "JSON",
      "headers": {},
      "responseObjects": [
        {
          "type": "default",
          "key": "",
          "mockFile": ""
        }
      ]
    },
    {
      "name": "getDNSWideIPNAPTR",
      "protocol": "REST",
      "method": "GET",
      "entitypath": "{base_path}/{version}/mgmt/cm/dns/working-config/wideip/naptr/{pathv1}?{query}",
      "requestSchema": "schema.json",
      "responseSchema": "schema.json",
      "timeout": 0,
      "sendEmpty": false,
      "sendGetBody": false,
      "requestDatatype": "JSON",
      "responseDatatype": "JSON",
      "headers": {},
      "responseObjects": [
        {
          "type": "default",
          "key": "",
          "mockFile": ""
        }
      ]
    },
    {
      "name": "deleteDNSWideIPNAPTR",
      "protocol": "REST",
      "method": "DELETE",
      "entitypath": "{base_path}/{version}/mgmt/cm/dns/working-config/wideip/naptr/{pathv1}?{query}",
      "requestSchema": "schema.json",
      "responseSchema": "schema.json",
      "timeout": 0,
      "sendEmpty": false,
      "requestDatatype": "JSON",
      "responseDatatype": "JSON",
      "headers": {},
      "responseObjects": [
        {
          "type": "default",
          "key": "",
          "mockFile": ""
        }
      ]
    },
    {
      "name": "getDNSWideIPSRV",
      "protocol": "REST",
      "method": "GET",
      "entitypath": "{base_path}/{version}/mgmt/cm/dns/working-config/wideip/srv/{pathv1}?{query}",
      "requestSchema": "schema.json",
      "responseSchema": "schema.json",
      "timeout": 0,
      "sendEmpty": false,
      "sendGetBody": false,
      "requestDatatype": "JSON",
      "responseDatatype": "JSON",
      "headers": {},
      "responseObjects": [
        {
          "type": "default",
          "key": "",
          "mockFile": ""
        }
      ]
    },
    {
      "name": "deleteDNSWideIPSRV",
      "protocol": "REST",
      "method": "DELETE",
      "entitypath": "{base_path}/{version}/mgmt/cm/dns/working-config/wideip/srv/{pathv1}?{query}",
      "requestSchema": "schema.json",
      "responseSchema": "schema.json",
      "timeout": 0,
      "sendEmpty": false,
      "requestDatatype": "JSON",
      "responseDatatype": "JSON",
      "headers": {},
      "responseObjects": [
        {
          "type": "default",
          "key": "",
          "mockFile": ""
        }
      ]
    },
    {
      "name": "postDNSWideIPCNAME",
      "protocol": "REST",
      "method": "POST",
      "entitypath": "{base_path}/{version}/mgmt/cm/dns/working-config/wideip/cname?{query}",
      "requestSchema": "schema.json",
      "responseSchema": "schema.json",
      "timeout": 0,
      "sendEmpty": false,
      "requestDatatype": "JSON",
      "responseDatatype": "JSON",
      "headers": {},
      "responseObjects": [
        {
          "type": "default",
          "key": "",
          "mockFile": ""
        }
      ]
    },
    {
      "name": "postDNSWideIPMX",
      "protocol": "REST",
      "method": "POST",
      "entitypath": "{base_path}/{version}/mgmt/cm/dns/working-config/wideip/mx?{query}",
      "requestSchema": "schema.json",
      "responseSchema": "schema.json",
      "timeout": 0,
      "sendEmpty": false,
      "requestDatatype": "JSON",
      "responseDatatype": "JSON",
      "headers": {},
      "responseObjects": [
        {
          "type": "default",
          "key": "",
          "mockFile": ""
        }
      ]
    },
    {
      "name": "postDNSWideIPNAPTR",
      "protocol": "REST",
      "method": "POST",
      "entitypath": "{base_path}/{version}/mgmt/cm/dns/working-config/wideip/naptr?{query}",
      "requestSchema": "schema.json",
      "responseSchema": "schema.json",
      "timeout": 0,
      "sendEmpty": false,
      "requestDatatype": "JSON",
      "responseDatatype": "JSON",
      "headers": {},
      "responseObjects": [
        {
          "type": "default",
          "key": "",
          "mockFile": ""
        }
      ]
    },
    {
      "name": "postDNSWideIPSRV",
      "protocol": "REST",
      "method": "POST",
      "entitypath": "{base_path}/{version}/mgmt/cm/dns/working-config/wideip/srv?{query}",
      "requestSchema": "schema.json",
      "responseSchema": "schema.json",
      "timeout": 0,
      "sendEmpty": false,
      "requestDatatype": "JSON",
      "responseDatatype": "JSON",
      "headers": {},
      "responseObjects": [
        {
          "type": "default",
          "key": "",
          "mockFile": ""
        }
      ]
    },
    {
      "name": "patchDNSWideIPSRV",
      "protocol": "REST",
      "method": "PATCH",
      "entitypath": "{base_path}/{version}/mgmt/cm/dns/working-config/srv/mx/{pathv1}?{query}",
      "requestSchema": "schema.json",
      "responseSchema": "schema.json",
      "timeout": 0,
      "sendEmpty": false,
      "requestDatatype": "JSON",
      "responseDatatype": "JSON",
      "headers": {},
      "responseObjects": [
        {
          "type": "default",
          "key": "",
          "mockFile": ""
        }
      ]
    },
    {
      "name": "patchDNSWideIPNAPTR",
      "protocol": "REST",
      "method": "PATCH",
      "entitypath": "{base_path}/{version}/mgmt/cm/dns/working-config/naptr/mx/{pathv1}?{query}",
      "requestSchema": "schema.json",
      "responseSchema": "schema.json",
      "timeout": 0,
      "sendEmpty": false,
      "requestDatatype": "JSON",
      "responseDatatype": "JSON",
      "headers": {},
      "responseObjects": [
        {
          "type": "default",
          "key": "",
          "mockFile": ""
        }
      ]
    }
  ]
}