{
  "id": "string",
  "kind": "string",
  "name": "string",
  "status": "FINISHED",
  "selfLink": "string",
  "username": "string",
  "generation": 12,
  "moduleList": [
    {
      "module": "string",
      "status": "FINISHED",
      "endTime": "string",
      "startTime": "string",
      "taskReference": {
        "link": "string"
      }
    },
    {
      "module": "access",
      "status": "FINISHED"
    },
    {
      "module": "asm",
      "status": "FINISHED"
    },
    {
      "module": "fps",
      "status": "FINISHED"
    },
    {
      "module": "firewall",
      "status": "FINISHED"
    },
    {
      "module": "security_shared",
      "status": "FINISHED"
    },
    {
      "module": "dns",
      "status": "FINISHED"
    },
    {
      "module": "sslo",
      "status": "FINISHED"
    }
  ],
  "currentStep": "DONE",
  "endDateTime": "string",
  "startDateTime": "string",
  "userReference": {
    "link": "string"
  },
  "ownerMachineId": "string",
  "deviceReference": {
    "link": "string"
  },
  "lastUpdateMicros": 16,
  "identityReferences": [
    {
      "link": "string"
    }
  ]
}