{
  "actions": [
    {
      "name": "getPortInfoUsingGET2",
      "protocol": "REST",
      "method": "GET",
      "entitypath": "{base_path}/{version}/ecx/v3/port/userport?{query}",
      "requestSchema": "schema.json",
      "responseSchema": "schema.json",
      "timeout": 0,
      "sendEmpty": false,
      "sendGetBody": false,
      "requestDatatype": "JSON",
      "responseDatatype": "JSON",
      "headers": {},
      "responseObjects": [
        {
          "type": "default",
          "key": "",
          "mockFile": "mockdatafiles/getPortInfoUsingGET2-default.json"
        }
      ]
    },
    {
      "name": "getPostStatUsingGET",
      "protocol": "REST",
      "method": "GET",
      "entitypath": "{base_path}/{version}/ecx/v3/stats/port/{pathv1}?{query}",
      "requestSchema": "schema.json",
      "responseSchema": "schema.json",
      "timeout": 0,
      "sendEmpty": false,
      "sendGetBody": false,
      "requestDatatype": "JSON",
      "responseDatatype": "JSON",
      "headers": {},
      "responseObjects": [
        {
          "type": "default",
          "key": "",
          "mockFile": "mockdatafiles/getPostStatUsingGET-default.json"
        }
      ]
    }
  ]
}