{
  "payLoad": {
    "ibx": "ABC",
    "accountNo": "ABC",
    "levelType": "ibx",
    "levelValue": "ABC",
    "isAlarm": "true",
    "kva": 54.402,
    "amps": 123,
    "soldKva": 598.349,
    "cabinetRating": 341.54,
    "contractualKva": 341.54,
    "percentageKva": 341.54,
    "comparisonData": {
      "datapoint": "percentageKva",
      "yesterday": 0.147,
      "lastWeek": -0.295,
      "lastMonth": -0.184,
      "lastQuarter": 52.434
    },
    "peakKvaLastSevenDays": 55.296,
    "peakKvaLastSevenDaysPercentage": 55.296,
    "peakKvaLastSevenDaysContractualKva": 55.296,
    "peakKvaLastSevenDaysTime": 55.296,
    "soldAmps": 123,
    "primaryKva": 28.31,
    "redundantKva": 26.092,
    "kw": "NA",
    "powerFactor": "NA",
    "readingTime": "1497410400000",
    "lastUpdatedTime": "1497410520000",
    "customerName": "ABC"
  },
  "status": {
    "type": "INFO",
    "statuscode": "1000",
    "msg": "OK"
  }
}