{
  "actions": [
    {
      "name": "getEnvironmentV1Current",
      "protocol": "REST",
      "method": "GET",
      "entitypath": "{base_path}/{version}/environment/v1/current?{query}",
      "requestSchema": "schema.json",
      "responseSchema": "schema.json",
      "timeout": 0,
      "sendEmpty": false,
      "sendGetBody": false,
      "requestDatatype": "JSON",
      "responseDatatype": "JSON",
      "headers": {},
      "responseObjects": [
        {
          "type": "default",
          "key": "",
          "mockFile": "mockdatafiles/getEnvironmentV1Current-default.json"
        }
      ]
    },
    {
      "name": "getEnvironmentV1ListCurrent",
      "protocol": "REST",
      "method": "GET",
      "entitypath": "{base_path}/{version}/environment/v1/listCurrent?{query}",
      "requestSchema": "schema.json",
      "responseSchema": "schema.json",
      "timeout": 0,
      "sendEmpty": false,
      "sendGetBody": false,
      "requestDatatype": "JSON",
      "responseDatatype": "JSON",
      "headers": {},
      "responseObjects": [
        {
          "type": "default",
          "key": "",
          "mockFile": "mockdatafiles/getEnvironmentV1ListCurrent-default.json"
        }
      ]
    },
    {
      "name": "getEnvironmentV1Trending",
      "protocol": "REST",
      "method": "GET",
      "entitypath": "{base_path}/{version}/environment/v1/trending?{query}",
      "requestSchema": "schema.json",
      "responseSchema": "schema.json",
      "timeout": 0,
      "sendEmpty": false,
      "sendGetBody": false,
      "requestDatatype": "JSON",
      "responseDatatype": "JSON",
      "headers": {},
      "responseObjects": [
        {
          "type": "default",
          "key": "",
          "mockFile": "mockdatafiles/getEnvironmentV1Trending-default.json"
        }
      ]
    }
  ]
}