{
  "locations": [
    {
      "ibx": "AM1",
      "cages": [
        {
          "cage": "AM1:02:002MC1",
          "cageTypes": [
            "Shared"
          ],
          "accounts": [
            {
              "number": "1111",
              "name": "ABC Network Services",
              "poTracking": false,
              "pricingEnabled": false,
              "pricingEnforced": false,
              "cabinets": [
                {
                  "cabinet": "AM1:02:002MC1:0601",
                  "cabinetType": "Shared"
                },
                {
                  "cabinet": "AM1:02:002MC1:0602",
                  "cabinetType": "Shared"
                }
              ]
            }
          ]
        }
      ]
    }
  ]
}