{
  "pagination": {
    "offset": 5,
    "limit": 20,
    "total": 1
  },
  "data": [
    {
      "accountName": "ABC INC",
      "accountNumber": "133911",
      "createdBy": "cust0001",
      "createdDate": "2018-01-30T10:30:31.387Z",
      "deviceSerialNo": "53791666484",
      "deviceTypeCategory": "ROUTER",
      "deviceTypeCode": "CSR1000V",
      "deviceTypeName": "CSR 1000v",
      "expiry": {
        "date": 7,
        "day": 4,
        "hours": 8,
        "minutes": 0,
        "month": 1,
        "seconds": 0,
        "time": 1549497600000,
        "timezoneOffset": -480,
        "year": 119
      },
      "region": "AMER",
      "deviceTypeVendor": "Cisco",
      "hostName": "VR-SV-CSR1000V-cust0001-1",
      "uuid": "877a3aa2-c49a-4af1-98a6-007424e737ae",
      "lastUpdatedBy": "cust0002",
      "lastUpdatedDate": "2018-01-30T10:30:31.387Z",
      "licenseFileId": "877a3aa2-c49a-4af1-98a6-007424e737ae",
      "licenseName": "Bring your own license",
      "licenseStatus": "REGISTERED",
      "licenseType": "BYOL",
      "metroCode": "SV",
      "metroName": "Silicon Valley",
      "zoneCode": "zone1",
      "zoneName": "Zone 1",
      "name": "AWS-Azure-Router-csr1000v",
      "notifications": [
        "test@equinix.com"
      ],
      "packageCode": "SEC",
      "packageName": "Security",
      "version": "16.09.02",
      "purchaseOrderNumber": "PO1223",
      "redundancyType": "PRIMARY",
      "redundantUuid": "xxxxx191-xx70-xxxx-xx04-xxxxxxxa67xx",
      "sshIpAddress": "10.195.11.23",
      "sshIpFqdn": "test-device-168-201-97-149.eis.lab.equinix.com",
      "status": "PROVISIONED",
      "throughput": 500,
      "throughputUnit": "Mbps",
      "aclTemplateUuid": "49289456-a63e-47d4-927c-5161cfb77501",
      "core": {
        "core": 4,
        "memory": 4,
        "unit": "GB"
      },
      "pricingDetails": {
        "termLength": 36,
        "orderNumber": "1-198735018693",
        "core": 4,
        "throughput": 1,
        "ThroughputUnit": "Gbps",
        "packageCode": "AX",
        "additionalBandwidth": 100,
        "primary": {
          "currency": "USD",
          "charges": [
            {
              "description": "VIRTUAL_DEVICE",
              "monthlyRecurringCharges": 200
            },
            {
              "description": "VIRTUAL_DEVICE",
              "monthlyRecurringCharges": 200
            },
            {
              "description": "VIRTUAL_DEVICE",
              "monthlyRecurringCharges": 200
            }
          ]
        },
        "secondary": {
          "currency": "USD",
          "charges": [
            {
              "description": "VIRTUAL_DEVICE",
              "monthlyRecurringCharges": 200
            },
            {
              "description": "VIRTUAL_DEVICE",
              "monthlyRecurringCharges": 200
            },
            {
              "description": "VIRTUAL_DEVICE",
              "monthlyRecurringCharges": 200
            },
            {
              "description": "VIRTUAL_DEVICE",
              "monthlyRecurringCharges": 200
            },
            {
              "description": "VIRTUAL_DEVICE",
              "monthlyRecurringCharges": 200
            },
            {
              "description": "VIRTUAL_DEVICE",
              "monthlyRecurringCharges": 200
            },
            {
              "description": "VIRTUAL_DEVICE",
              "monthlyRecurringCharges": 200
            },
            {
              "description": "VIRTUAL_DEVICE",
              "monthlyRecurringCharges": 200
            },
            {
              "description": "VIRTUAL_DEVICE",
              "monthlyRecurringCharges": 200
            },
            {
              "description": "VIRTUAL_DEVICE",
              "monthlyRecurringCharges": 200
            }
          ]
        }
      },
      "interfaceCount": 10,
      "deviceManagementType": "EQUINIX-CONFIGURED",
      "userPublicKey": {
        "username": "test-user-1",
        "publicKeyName": "test-pk-2",
        "publicKey": "ssh-rsa AAAAB3NzaC1yc2EAAAABIwAAAQEAklOUpkDHrfHY17SbrmTIpNLTGK9Tjom/BWDSU\\nGPl+nafzlHDTYW7hdI4yZ5ew18JH4JW9jbhUFrviQzM7xlELEVf4h9lFX5QVkbPppSwg0cda3\\nPbv7kOdJ/MTyBlWXFCR+HAo3FXRitBqxiX1nKhXpHAZsMciLq8V6RjsNAQwdsdMFvSlVK/7XA\\nt3FaoJoAsncM1Q9x5+3V0Ww68/eIFmb1zuUFljQJKprrX88XypNDvjYNby6vw"
      },
      "managementIp": "10.195.237.228/26",
      "managementGatewayIp": "10.195.237.254",
      "publicIp": "149.97.198.95/31",
      "publicGatewayIp": "149.97.198.94",
      "primaryDnsName": "4.0.0.53",
      "secondaryDnsName": "129.250.35.250",
      "termLength": 12,
      "additionalBandwidth": 200,
      "siteId": "12345",
      "systemIpAddress": "192.168.2.5",
      "vendorConfig": {
        "siteId": 567,
        "systemIpAddress": "192.164.0.0",
        "licenseKey": "6735-vwe64568-6a91-4112-8734-bea12d91f7y7",
        "licenseSecret": "h5j0i45e83324pblbfca764532c4a640e7801f0",
        "localId": "branch1@example.com",
        "remoteId": "companyController1@example.com",
        "controller1": "54.219.248.29",
        "controller2": "54.177.220.115",
        "serialNumber": 4545454,
        "adminPassword": 5678909,
        "activationKey": "GJUK-JM2X-59BJ-2TDJ",
        "controllerFqdn": "demo.velocloud.net",
        "rootPassword": "myPassw0rd!",
        "accountName": "accountName",
        "hostname": "hostName",
        "accountKey": "Primary Account Key1",
        "applianceTag": "applianceTag"
      },
      "interfaces": [
        {
          "id": 1,
          "ipv4Mask": "255.255.255.0",
          "ipv4Subnet": "192.168.0.5",
          "name": "ethernet1",
          "status": "ASSIGNED",
          "operationStatus": "DOWN",
          "macAddress": "fa16.3e1c.a8d8",
          "ipAddress": "2.2.2.2",
          "assignedType": "Equinix Managed",
          "type": "DATA"
        },
        {
          "id": 1,
          "ipv4Mask": "255.255.255.0",
          "ipv4Subnet": "192.168.0.5",
          "name": "ethernet1",
          "status": "ASSIGNED",
          "operationStatus": "DOWN",
          "macAddress": "fa16.3e1c.a8d8",
          "ipAddress": "2.2.2.2",
          "assignedType": "Equinix Managed",
          "type": "DATA"
        },
        {
          "id": 1,
          "ipv4Mask": "255.255.255.0",
          "ipv4Subnet": "192.168.0.5",
          "name": "ethernet1",
          "status": "ASSIGNED",
          "operationStatus": "DOWN",
          "macAddress": "fa16.3e1c.a8d8",
          "ipAddress": "2.2.2.2",
          "assignedType": "Equinix Managed",
          "type": "DATA"
        },
        {
          "id": 1,
          "ipv4Mask": "255.255.255.0",
          "ipv4Subnet": "192.168.0.5",
          "name": "ethernet1",
          "status": "ASSIGNED",
          "operationStatus": "DOWN",
          "macAddress": "fa16.3e1c.a8d8",
          "ipAddress": "2.2.2.2",
          "assignedType": "Equinix Managed",
          "type": "DATA"
        },
        {
          "id": 1,
          "ipv4Mask": "255.255.255.0",
          "ipv4Subnet": "192.168.0.5",
          "name": "ethernet1",
          "status": "ASSIGNED",
          "operationStatus": "DOWN",
          "macAddress": "fa16.3e1c.a8d8",
          "ipAddress": "2.2.2.2",
          "assignedType": "Equinix Managed",
          "type": "DATA"
        },
        {
          "id": 1,
          "ipv4Mask": "255.255.255.0",
          "ipv4Subnet": "192.168.0.5",
          "name": "ethernet1",
          "status": "ASSIGNED",
          "operationStatus": "DOWN",
          "macAddress": "fa16.3e1c.a8d8",
          "ipAddress": "2.2.2.2",
          "assignedType": "Equinix Managed",
          "type": "DATA"
        }
      ],
      "asn": 1029
    },
    {
      "accountName": "ABC INC",
      "accountNumber": "133911",
      "createdBy": "cust0001",
      "createdDate": "2018-01-30T10:30:31.387Z",
      "deviceSerialNo": "53791666484",
      "deviceTypeCategory": "ROUTER",
      "deviceTypeCode": "CSR1000V",
      "deviceTypeName": "CSR 1000v",
      "expiry": {
        "date": 7,
        "day": 4,
        "hours": 8,
        "minutes": 0,
        "month": 1,
        "seconds": 0,
        "time": 1549497600000,
        "timezoneOffset": -480,
        "year": 119
      },
      "region": "AMER",
      "deviceTypeVendor": "Cisco",
      "hostName": "VR-SV-CSR1000V-cust0001-1",
      "uuid": "877a3aa2-c49a-4af1-98a6-007424e737ae",
      "lastUpdatedBy": "cust0002",
      "lastUpdatedDate": "2018-01-30T10:30:31.387Z",
      "licenseFileId": "877a3aa2-c49a-4af1-98a6-007424e737ae",
      "licenseName": "Bring your own license",
      "licenseStatus": "REGISTERED",
      "licenseType": "BYOL",
      "metroCode": "SV",
      "metroName": "Silicon Valley",
      "zoneCode": "zone1",
      "zoneName": "Zone 1",
      "name": "AWS-Azure-Router-csr1000v",
      "notifications": [
        "test@equinix.com"
      ],
      "packageCode": "SEC",
      "packageName": "Security",
      "version": "16.09.02",
      "purchaseOrderNumber": "PO1223",
      "redundancyType": "PRIMARY",
      "redundantUuid": "xxxxx191-xx70-xxxx-xx04-xxxxxxxa67xx",
      "sshIpAddress": "10.195.11.23",
      "sshIpFqdn": "test-device-168-201-97-149.eis.lab.equinix.com",
      "status": "PROVISIONED",
      "throughput": 500,
      "throughputUnit": "Mbps",
      "aclTemplateUuid": "49289456-a63e-47d4-927c-5161cfb77501",
      "core": {
        "core": 4,
        "memory": 4,
        "unit": "GB"
      },
      "pricingDetails": {
        "termLength": 36,
        "orderNumber": "1-198735018693",
        "core": 4,
        "throughput": 1,
        "ThroughputUnit": "Gbps",
        "packageCode": "AX",
        "additionalBandwidth": 100,
        "primary": {
          "currency": "USD",
          "charges": [
            {
              "description": "VIRTUAL_DEVICE",
              "monthlyRecurringCharges": 200
            },
            {
              "description": "VIRTUAL_DEVICE",
              "monthlyRecurringCharges": 200
            },
            {
              "description": "VIRTUAL_DEVICE",
              "monthlyRecurringCharges": 200
            }
          ]
        },
        "secondary": {
          "currency": "USD",
          "charges": [
            {
              "description": "VIRTUAL_DEVICE",
              "monthlyRecurringCharges": 200
            },
            {
              "description": "VIRTUAL_DEVICE",
              "monthlyRecurringCharges": 200
            },
            {
              "description": "VIRTUAL_DEVICE",
              "monthlyRecurringCharges": 200
            },
            {
              "description": "VIRTUAL_DEVICE",
              "monthlyRecurringCharges": 200
            },
            {
              "description": "VIRTUAL_DEVICE",
              "monthlyRecurringCharges": 200
            },
            {
              "description": "VIRTUAL_DEVICE",
              "monthlyRecurringCharges": 200
            },
            {
              "description": "VIRTUAL_DEVICE",
              "monthlyRecurringCharges": 200
            },
            {
              "description": "VIRTUAL_DEVICE",
              "monthlyRecurringCharges": 200
            },
            {
              "description": "VIRTUAL_DEVICE",
              "monthlyRecurringCharges": 200
            },
            {
              "description": "VIRTUAL_DEVICE",
              "monthlyRecurringCharges": 200
            }
          ]
        }
      },
      "interfaceCount": 10,
      "deviceManagementType": "EQUINIX-CONFIGURED",
      "userPublicKey": {
        "username": "test-user-1",
        "publicKeyName": "test-pk-2",
        "publicKey": "ssh-rsa AAAAB3NzaC1yc2EAAAABIwAAAQEAklOUpkDHrfHY17SbrmTIpNLTGK9Tjom/BWDSU\\nGPl+nafzlHDTYW7hdI4yZ5ew18JH4JW9jbhUFrviQzM7xlELEVf4h9lFX5QVkbPppSwg0cda3\\nPbv7kOdJ/MTyBlWXFCR+HAo3FXRitBqxiX1nKhXpHAZsMciLq8V6RjsNAQwdsdMFvSlVK/7XA\\nt3FaoJoAsncM1Q9x5+3V0Ww68/eIFmb1zuUFljQJKprrX88XypNDvjYNby6vw"
      },
      "managementIp": "10.195.237.228/26",
      "managementGatewayIp": "10.195.237.254",
      "publicIp": "149.97.198.95/31",
      "publicGatewayIp": "149.97.198.94",
      "primaryDnsName": "4.0.0.53",
      "secondaryDnsName": "129.250.35.250",
      "termLength": 12,
      "additionalBandwidth": 200,
      "siteId": "12345",
      "systemIpAddress": "192.168.2.5",
      "vendorConfig": {
        "siteId": 567,
        "systemIpAddress": "192.164.0.0",
        "licenseKey": "6735-vwe64568-6a91-4112-8734-bea12d91f7y7",
        "licenseSecret": "h5j0i45e83324pblbfca764532c4a640e7801f0",
        "localId": "branch1@example.com",
        "remoteId": "companyController1@example.com",
        "controller1": "54.219.248.29",
        "controller2": "54.177.220.115",
        "serialNumber": 4545454,
        "adminPassword": 5678909,
        "activationKey": "GJUK-JM2X-59BJ-2TDJ",
        "controllerFqdn": "demo.velocloud.net",
        "rootPassword": "myPassw0rd!",
        "accountName": "accountName",
        "hostname": "hostName",
        "accountKey": "Primary Account Key1",
        "applianceTag": "applianceTag"
      },
      "interfaces": [
        {
          "id": 1,
          "ipv4Mask": "255.255.255.0",
          "ipv4Subnet": "192.168.0.5",
          "name": "ethernet1",
          "status": "ASSIGNED",
          "operationStatus": "DOWN",
          "macAddress": "fa16.3e1c.a8d8",
          "ipAddress": "2.2.2.2",
          "assignedType": "Equinix Managed",
          "type": "DATA"
        },
        {
          "id": 1,
          "ipv4Mask": "255.255.255.0",
          "ipv4Subnet": "192.168.0.5",
          "name": "ethernet1",
          "status": "ASSIGNED",
          "operationStatus": "DOWN",
          "macAddress": "fa16.3e1c.a8d8",
          "ipAddress": "2.2.2.2",
          "assignedType": "Equinix Managed",
          "type": "DATA"
        },
        {
          "id": 1,
          "ipv4Mask": "255.255.255.0",
          "ipv4Subnet": "192.168.0.5",
          "name": "ethernet1",
          "status": "ASSIGNED",
          "operationStatus": "DOWN",
          "macAddress": "fa16.3e1c.a8d8",
          "ipAddress": "2.2.2.2",
          "assignedType": "Equinix Managed",
          "type": "DATA"
        },
        {
          "id": 1,
          "ipv4Mask": "255.255.255.0",
          "ipv4Subnet": "192.168.0.5",
          "name": "ethernet1",
          "status": "ASSIGNED",
          "operationStatus": "DOWN",
          "macAddress": "fa16.3e1c.a8d8",
          "ipAddress": "2.2.2.2",
          "assignedType": "Equinix Managed",
          "type": "DATA"
        },
        {
          "id": 1,
          "ipv4Mask": "255.255.255.0",
          "ipv4Subnet": "192.168.0.5",
          "name": "ethernet1",
          "status": "ASSIGNED",
          "operationStatus": "DOWN",
          "macAddress": "fa16.3e1c.a8d8",
          "ipAddress": "2.2.2.2",
          "assignedType": "Equinix Managed",
          "type": "DATA"
        },
        {
          "id": 1,
          "ipv4Mask": "255.255.255.0",
          "ipv4Subnet": "192.168.0.5",
          "name": "ethernet1",
          "status": "ASSIGNED",
          "operationStatus": "DOWN",
          "macAddress": "fa16.3e1c.a8d8",
          "ipAddress": "2.2.2.2",
          "assignedType": "Equinix Managed",
          "type": "DATA"
        }
      ],
      "asn": 1029
    },
    {
      "accountName": "ABC INC",
      "accountNumber": "133911",
      "createdBy": "cust0001",
      "createdDate": "2018-01-30T10:30:31.387Z",
      "deviceSerialNo": "53791666484",
      "deviceTypeCategory": "ROUTER",
      "deviceTypeCode": "CSR1000V",
      "deviceTypeName": "CSR 1000v",
      "expiry": {
        "date": 7,
        "day": 4,
        "hours": 8,
        "minutes": 0,
        "month": 1,
        "seconds": 0,
        "time": 1549497600000,
        "timezoneOffset": -480,
        "year": 119
      },
      "region": "AMER",
      "deviceTypeVendor": "Cisco",
      "hostName": "VR-SV-CSR1000V-cust0001-1",
      "uuid": "877a3aa2-c49a-4af1-98a6-007424e737ae",
      "lastUpdatedBy": "cust0002",
      "lastUpdatedDate": "2018-01-30T10:30:31.387Z",
      "licenseFileId": "877a3aa2-c49a-4af1-98a6-007424e737ae",
      "licenseName": "Bring your own license",
      "licenseStatus": "REGISTERED",
      "licenseType": "BYOL",
      "metroCode": "SV",
      "metroName": "Silicon Valley",
      "zoneCode": "zone1",
      "zoneName": "Zone 1",
      "name": "AWS-Azure-Router-csr1000v",
      "notifications": [
        "test@equinix.com",
        "test@equinix.com"
      ],
      "packageCode": "SEC",
      "packageName": "Security",
      "version": "16.09.02",
      "purchaseOrderNumber": "PO1223",
      "redundancyType": "PRIMARY",
      "redundantUuid": "xxxxx191-xx70-xxxx-xx04-xxxxxxxa67xx",
      "sshIpAddress": "10.195.11.23",
      "sshIpFqdn": "test-device-168-201-97-149.eis.lab.equinix.com",
      "status": "PROVISIONED",
      "throughput": 500,
      "throughputUnit": "Mbps",
      "aclTemplateUuid": "49289456-a63e-47d4-927c-5161cfb77501",
      "core": {
        "core": 4,
        "memory": 4,
        "unit": "GB"
      },
      "pricingDetails": {
        "termLength": 36,
        "orderNumber": "1-198735018693",
        "core": 4,
        "throughput": 1,
        "ThroughputUnit": "Gbps",
        "packageCode": "AX",
        "additionalBandwidth": 100,
        "primary": {
          "currency": "USD",
          "charges": [
            {
              "description": "VIRTUAL_DEVICE",
              "monthlyRecurringCharges": 200
            },
            {
              "description": "VIRTUAL_DEVICE",
              "monthlyRecurringCharges": 200
            },
            {
              "description": "VIRTUAL_DEVICE",
              "monthlyRecurringCharges": 200
            },
            {
              "description": "VIRTUAL_DEVICE",
              "monthlyRecurringCharges": 200
            }
          ]
        },
        "secondary": {
          "currency": "USD",
          "charges": [
            {
              "description": "VIRTUAL_DEVICE",
              "monthlyRecurringCharges": 200
            },
            {
              "description": "VIRTUAL_DEVICE",
              "monthlyRecurringCharges": 200
            },
            {
              "description": "VIRTUAL_DEVICE",
              "monthlyRecurringCharges": 200
            },
            {
              "description": "VIRTUAL_DEVICE",
              "monthlyRecurringCharges": 200
            },
            {
              "description": "VIRTUAL_DEVICE",
              "monthlyRecurringCharges": 200
            },
            {
              "description": "VIRTUAL_DEVICE",
              "monthlyRecurringCharges": 200
            },
            {
              "description": "VIRTUAL_DEVICE",
              "monthlyRecurringCharges": 200
            },
            {
              "description": "VIRTUAL_DEVICE",
              "monthlyRecurringCharges": 200
            },
            {
              "description": "VIRTUAL_DEVICE",
              "monthlyRecurringCharges": 200
            },
            {
              "description": "VIRTUAL_DEVICE",
              "monthlyRecurringCharges": 200
            }
          ]
        }
      },
      "interfaceCount": 10,
      "deviceManagementType": "EQUINIX-CONFIGURED",
      "userPublicKey": {
        "username": "test-user-1",
        "publicKeyName": "test-pk-2",
        "publicKey": "ssh-rsa AAAAB3NzaC1yc2EAAAABIwAAAQEAklOUpkDHrfHY17SbrmTIpNLTGK9Tjom/BWDSU\\nGPl+nafzlHDTYW7hdI4yZ5ew18JH4JW9jbhUFrviQzM7xlELEVf4h9lFX5QVkbPppSwg0cda3\\nPbv7kOdJ/MTyBlWXFCR+HAo3FXRitBqxiX1nKhXpHAZsMciLq8V6RjsNAQwdsdMFvSlVK/7XA\\nt3FaoJoAsncM1Q9x5+3V0Ww68/eIFmb1zuUFljQJKprrX88XypNDvjYNby6vw"
      },
      "managementIp": "10.195.237.228/26",
      "managementGatewayIp": "10.195.237.254",
      "publicIp": "149.97.198.95/31",
      "publicGatewayIp": "149.97.198.94",
      "primaryDnsName": "4.0.0.53",
      "secondaryDnsName": "129.250.35.250",
      "termLength": 12,
      "additionalBandwidth": 200,
      "siteId": "12345",
      "systemIpAddress": "192.168.2.5",
      "vendorConfig": {
        "siteId": 567,
        "systemIpAddress": "192.164.0.0",
        "licenseKey": "6735-vwe64568-6a91-4112-8734-bea12d91f7y7",
        "licenseSecret": "h5j0i45e83324pblbfca764532c4a640e7801f0",
        "localId": "branch1@example.com",
        "remoteId": "companyController1@example.com",
        "controller1": "54.219.248.29",
        "controller2": "54.177.220.115",
        "serialNumber": 4545454,
        "adminPassword": 5678909,
        "activationKey": "GJUK-JM2X-59BJ-2TDJ",
        "controllerFqdn": "demo.velocloud.net",
        "rootPassword": "myPassw0rd!",
        "accountName": "accountName",
        "hostname": "hostName",
        "accountKey": "Primary Account Key1",
        "applianceTag": "applianceTag"
      },
      "interfaces": [
        {
          "id": 1,
          "ipv4Mask": "255.255.255.0",
          "ipv4Subnet": "192.168.0.5",
          "name": "ethernet1",
          "status": "ASSIGNED",
          "operationStatus": "DOWN",
          "macAddress": "fa16.3e1c.a8d8",
          "ipAddress": "2.2.2.2",
          "assignedType": "Equinix Managed",
          "type": "DATA"
        },
        {
          "id": 1,
          "ipv4Mask": "255.255.255.0",
          "ipv4Subnet": "192.168.0.5",
          "name": "ethernet1",
          "status": "ASSIGNED",
          "operationStatus": "DOWN",
          "macAddress": "fa16.3e1c.a8d8",
          "ipAddress": "2.2.2.2",
          "assignedType": "Equinix Managed",
          "type": "DATA"
        },
        {
          "id": 1,
          "ipv4Mask": "255.255.255.0",
          "ipv4Subnet": "192.168.0.5",
          "name": "ethernet1",
          "status": "ASSIGNED",
          "operationStatus": "DOWN",
          "macAddress": "fa16.3e1c.a8d8",
          "ipAddress": "2.2.2.2",
          "assignedType": "Equinix Managed",
          "type": "DATA"
        },
        {
          "id": 1,
          "ipv4Mask": "255.255.255.0",
          "ipv4Subnet": "192.168.0.5",
          "name": "ethernet1",
          "status": "ASSIGNED",
          "operationStatus": "DOWN",
          "macAddress": "fa16.3e1c.a8d8",
          "ipAddress": "2.2.2.2",
          "assignedType": "Equinix Managed",
          "type": "DATA"
        },
        {
          "id": 1,
          "ipv4Mask": "255.255.255.0",
          "ipv4Subnet": "192.168.0.5",
          "name": "ethernet1",
          "status": "ASSIGNED",
          "operationStatus": "DOWN",
          "macAddress": "fa16.3e1c.a8d8",
          "ipAddress": "2.2.2.2",
          "assignedType": "Equinix Managed",
          "type": "DATA"
        },
        {
          "id": 1,
          "ipv4Mask": "255.255.255.0",
          "ipv4Subnet": "192.168.0.5",
          "name": "ethernet1",
          "status": "ASSIGNED",
          "operationStatus": "DOWN",
          "macAddress": "fa16.3e1c.a8d8",
          "ipAddress": "2.2.2.2",
          "assignedType": "Equinix Managed",
          "type": "DATA"
        },
        {
          "id": 1,
          "ipv4Mask": "255.255.255.0",
          "ipv4Subnet": "192.168.0.5",
          "name": "ethernet1",
          "status": "ASSIGNED",
          "operationStatus": "DOWN",
          "macAddress": "fa16.3e1c.a8d8",
          "ipAddress": "2.2.2.2",
          "assignedType": "Equinix Managed",
          "type": "DATA"
        },
        {
          "id": 1,
          "ipv4Mask": "255.255.255.0",
          "ipv4Subnet": "192.168.0.5",
          "name": "ethernet1",
          "status": "ASSIGNED",
          "operationStatus": "DOWN",
          "macAddress": "fa16.3e1c.a8d8",
          "ipAddress": "2.2.2.2",
          "assignedType": "Equinix Managed",
          "type": "DATA"
        }
      ],
      "asn": 1029
    },
    {
      "accountName": "ABC INC",
      "accountNumber": "133911",
      "createdBy": "cust0001",
      "createdDate": "2018-01-30T10:30:31.387Z",
      "deviceSerialNo": "53791666484",
      "deviceTypeCategory": "ROUTER",
      "deviceTypeCode": "CSR1000V",
      "deviceTypeName": "CSR 1000v",
      "expiry": {
        "date": 7,
        "day": 4,
        "hours": 8,
        "minutes": 0,
        "month": 1,
        "seconds": 0,
        "time": 1549497600000,
        "timezoneOffset": -480,
        "year": 119
      },
      "region": "AMER",
      "deviceTypeVendor": "Cisco",
      "hostName": "VR-SV-CSR1000V-cust0001-1",
      "uuid": "877a3aa2-c49a-4af1-98a6-007424e737ae",
      "lastUpdatedBy": "cust0002",
      "lastUpdatedDate": "2018-01-30T10:30:31.387Z",
      "licenseFileId": "877a3aa2-c49a-4af1-98a6-007424e737ae",
      "licenseName": "Bring your own license",
      "licenseStatus": "REGISTERED",
      "licenseType": "BYOL",
      "metroCode": "SV",
      "metroName": "Silicon Valley",
      "zoneCode": "zone1",
      "zoneName": "Zone 1",
      "name": "AWS-Azure-Router-csr1000v",
      "notifications": [
        "test@equinix.com",
        "test@equinix.com",
        "test@equinix.com",
        "test@equinix.com",
        "test@equinix.com",
        "test@equinix.com",
        "test@equinix.com",
        "test@equinix.com"
      ],
      "packageCode": "SEC",
      "packageName": "Security",
      "version": "16.09.02",
      "purchaseOrderNumber": "PO1223",
      "redundancyType": "PRIMARY",
      "redundantUuid": "xxxxx191-xx70-xxxx-xx04-xxxxxxxa67xx",
      "sshIpAddress": "10.195.11.23",
      "sshIpFqdn": "test-device-168-201-97-149.eis.lab.equinix.com",
      "status": "PROVISIONED",
      "throughput": 500,
      "throughputUnit": "Mbps",
      "aclTemplateUuid": "49289456-a63e-47d4-927c-5161cfb77501",
      "core": {
        "core": 4,
        "memory": 4,
        "unit": "GB"
      },
      "pricingDetails": {
        "termLength": 36,
        "orderNumber": "1-198735018693",
        "core": 4,
        "throughput": 1,
        "ThroughputUnit": "Gbps",
        "packageCode": "AX",
        "additionalBandwidth": 100,
        "primary": {
          "currency": "USD",
          "charges": [
            {
              "description": "VIRTUAL_DEVICE",
              "monthlyRecurringCharges": 200
            }
          ]
        },
        "secondary": {
          "currency": "USD",
          "charges": [
            {
              "description": "VIRTUAL_DEVICE",
              "monthlyRecurringCharges": 200
            },
            {
              "description": "VIRTUAL_DEVICE",
              "monthlyRecurringCharges": 200
            },
            {
              "description": "VIRTUAL_DEVICE",
              "monthlyRecurringCharges": 200
            },
            {
              "description": "VIRTUAL_DEVICE",
              "monthlyRecurringCharges": 200
            },
            {
              "description": "VIRTUAL_DEVICE",
              "monthlyRecurringCharges": 200
            },
            {
              "description": "VIRTUAL_DEVICE",
              "monthlyRecurringCharges": 200
            },
            {
              "description": "VIRTUAL_DEVICE",
              "monthlyRecurringCharges": 200
            },
            {
              "description": "VIRTUAL_DEVICE",
              "monthlyRecurringCharges": 200
            },
            {
              "description": "VIRTUAL_DEVICE",
              "monthlyRecurringCharges": 200
            },
            {
              "description": "VIRTUAL_DEVICE",
              "monthlyRecurringCharges": 200
            }
          ]
        }
      },
      "interfaceCount": 10,
      "deviceManagementType": "EQUINIX-CONFIGURED",
      "userPublicKey": {
        "username": "test-user-1",
        "publicKeyName": "test-pk-2",
        "publicKey": "ssh-rsa AAAAB3NzaC1yc2EAAAABIwAAAQEAklOUpkDHrfHY17SbrmTIpNLTGK9Tjom/BWDSU\\nGPl+nafzlHDTYW7hdI4yZ5ew18JH4JW9jbhUFrviQzM7xlELEVf4h9lFX5QVkbPppSwg0cda3\\nPbv7kOdJ/MTyBlWXFCR+HAo3FXRitBqxiX1nKhXpHAZsMciLq8V6RjsNAQwdsdMFvSlVK/7XA\\nt3FaoJoAsncM1Q9x5+3V0Ww68/eIFmb1zuUFljQJKprrX88XypNDvjYNby6vw"
      },
      "managementIp": "10.195.237.228/26",
      "managementGatewayIp": "10.195.237.254",
      "publicIp": "149.97.198.95/31",
      "publicGatewayIp": "149.97.198.94",
      "primaryDnsName": "4.0.0.53",
      "secondaryDnsName": "129.250.35.250",
      "termLength": 12,
      "additionalBandwidth": 200,
      "siteId": "12345",
      "systemIpAddress": "192.168.2.5",
      "vendorConfig": {
        "siteId": 567,
        "systemIpAddress": "192.164.0.0",
        "licenseKey": "6735-vwe64568-6a91-4112-8734-bea12d91f7y7",
        "licenseSecret": "h5j0i45e83324pblbfca764532c4a640e7801f0",
        "localId": "branch1@example.com",
        "remoteId": "companyController1@example.com",
        "controller1": "54.219.248.29",
        "controller2": "54.177.220.115",
        "serialNumber": 4545454,
        "adminPassword": 5678909,
        "activationKey": "GJUK-JM2X-59BJ-2TDJ",
        "controllerFqdn": "demo.velocloud.net",
        "rootPassword": "myPassw0rd!",
        "accountName": "accountName",
        "hostname": "hostName",
        "accountKey": "Primary Account Key1",
        "applianceTag": "applianceTag"
      },
      "interfaces": [
        {
          "id": 1,
          "ipv4Mask": "255.255.255.0",
          "ipv4Subnet": "192.168.0.5",
          "name": "ethernet1",
          "status": "ASSIGNED",
          "operationStatus": "DOWN",
          "macAddress": "fa16.3e1c.a8d8",
          "ipAddress": "2.2.2.2",
          "assignedType": "Equinix Managed",
          "type": "DATA"
        },
        {
          "id": 1,
          "ipv4Mask": "255.255.255.0",
          "ipv4Subnet": "192.168.0.5",
          "name": "ethernet1",
          "status": "ASSIGNED",
          "operationStatus": "DOWN",
          "macAddress": "fa16.3e1c.a8d8",
          "ipAddress": "2.2.2.2",
          "assignedType": "Equinix Managed",
          "type": "DATA"
        },
        {
          "id": 1,
          "ipv4Mask": "255.255.255.0",
          "ipv4Subnet": "192.168.0.5",
          "name": "ethernet1",
          "status": "ASSIGNED",
          "operationStatus": "DOWN",
          "macAddress": "fa16.3e1c.a8d8",
          "ipAddress": "2.2.2.2",
          "assignedType": "Equinix Managed",
          "type": "DATA"
        },
        {
          "id": 1,
          "ipv4Mask": "255.255.255.0",
          "ipv4Subnet": "192.168.0.5",
          "name": "ethernet1",
          "status": "ASSIGNED",
          "operationStatus": "DOWN",
          "macAddress": "fa16.3e1c.a8d8",
          "ipAddress": "2.2.2.2",
          "assignedType": "Equinix Managed",
          "type": "DATA"
        },
        {
          "id": 1,
          "ipv4Mask": "255.255.255.0",
          "ipv4Subnet": "192.168.0.5",
          "name": "ethernet1",
          "status": "ASSIGNED",
          "operationStatus": "DOWN",
          "macAddress": "fa16.3e1c.a8d8",
          "ipAddress": "2.2.2.2",
          "assignedType": "Equinix Managed",
          "type": "DATA"
        },
        {
          "id": 1,
          "ipv4Mask": "255.255.255.0",
          "ipv4Subnet": "192.168.0.5",
          "name": "ethernet1",
          "status": "ASSIGNED",
          "operationStatus": "DOWN",
          "macAddress": "fa16.3e1c.a8d8",
          "ipAddress": "2.2.2.2",
          "assignedType": "Equinix Managed",
          "type": "DATA"
        }
      ],
      "asn": 1029
    },
    {
      "accountName": "ABC INC",
      "accountNumber": "133911",
      "createdBy": "cust0001",
      "createdDate": "2018-01-30T10:30:31.387Z",
      "deviceSerialNo": "53791666484",
      "deviceTypeCategory": "ROUTER",
      "deviceTypeCode": "CSR1000V",
      "deviceTypeName": "CSR 1000v",
      "expiry": {
        "date": 7,
        "day": 4,
        "hours": 8,
        "minutes": 0,
        "month": 1,
        "seconds": 0,
        "time": 1549497600000,
        "timezoneOffset": -480,
        "year": 119
      },
      "region": "AMER",
      "deviceTypeVendor": "Cisco",
      "hostName": "VR-SV-CSR1000V-cust0001-1",
      "uuid": "877a3aa2-c49a-4af1-98a6-007424e737ae",
      "lastUpdatedBy": "cust0002",
      "lastUpdatedDate": "2018-01-30T10:30:31.387Z",
      "licenseFileId": "877a3aa2-c49a-4af1-98a6-007424e737ae",
      "licenseName": "Bring your own license",
      "licenseStatus": "REGISTERED",
      "licenseType": "BYOL",
      "metroCode": "SV",
      "metroName": "Silicon Valley",
      "zoneCode": "zone1",
      "zoneName": "Zone 1",
      "name": "AWS-Azure-Router-csr1000v",
      "notifications": [
        "test@equinix.com",
        "test@equinix.com",
        "test@equinix.com",
        "test@equinix.com",
        "test@equinix.com",
        "test@equinix.com",
        "test@equinix.com",
        "test@equinix.com",
        "test@equinix.com"
      ],
      "packageCode": "SEC",
      "packageName": "Security",
      "version": "16.09.02",
      "purchaseOrderNumber": "PO1223",
      "redundancyType": "PRIMARY",
      "redundantUuid": "xxxxx191-xx70-xxxx-xx04-xxxxxxxa67xx",
      "sshIpAddress": "10.195.11.23",
      "sshIpFqdn": "test-device-168-201-97-149.eis.lab.equinix.com",
      "status": "PROVISIONED",
      "throughput": 500,
      "throughputUnit": "Mbps",
      "aclTemplateUuid": "49289456-a63e-47d4-927c-5161cfb77501",
      "core": {
        "core": 4,
        "memory": 4,
        "unit": "GB"
      },
      "pricingDetails": {
        "termLength": 36,
        "orderNumber": "1-198735018693",
        "core": 4,
        "throughput": 1,
        "ThroughputUnit": "Gbps",
        "packageCode": "AX",
        "additionalBandwidth": 100,
        "primary": {
          "currency": "USD",
          "charges": [
            {
              "description": "VIRTUAL_DEVICE",
              "monthlyRecurringCharges": 200
            },
            {
              "description": "VIRTUAL_DEVICE",
              "monthlyRecurringCharges": 200
            },
            {
              "description": "VIRTUAL_DEVICE",
              "monthlyRecurringCharges": 200
            },
            {
              "description": "VIRTUAL_DEVICE",
              "monthlyRecurringCharges": 200
            },
            {
              "description": "VIRTUAL_DEVICE",
              "monthlyRecurringCharges": 200
            },
            {
              "description": "VIRTUAL_DEVICE",
              "monthlyRecurringCharges": 200
            },
            {
              "description": "VIRTUAL_DEVICE",
              "monthlyRecurringCharges": 200
            },
            {
              "description": "VIRTUAL_DEVICE",
              "monthlyRecurringCharges": 200
            },
            {
              "description": "VIRTUAL_DEVICE",
              "monthlyRecurringCharges": 200
            },
            {
              "description": "VIRTUAL_DEVICE",
              "monthlyRecurringCharges": 200
            }
          ]
        },
        "secondary": {
          "currency": "USD",
          "charges": [
            {
              "description": "VIRTUAL_DEVICE",
              "monthlyRecurringCharges": 200
            },
            {
              "description": "VIRTUAL_DEVICE",
              "monthlyRecurringCharges": 200
            }
          ]
        }
      },
      "interfaceCount": 10,
      "deviceManagementType": "EQUINIX-CONFIGURED",
      "userPublicKey": {
        "username": "test-user-1",
        "publicKeyName": "test-pk-2",
        "publicKey": "ssh-rsa AAAAB3NzaC1yc2EAAAABIwAAAQEAklOUpkDHrfHY17SbrmTIpNLTGK9Tjom/BWDSU\\nGPl+nafzlHDTYW7hdI4yZ5ew18JH4JW9jbhUFrviQzM7xlELEVf4h9lFX5QVkbPppSwg0cda3\\nPbv7kOdJ/MTyBlWXFCR+HAo3FXRitBqxiX1nKhXpHAZsMciLq8V6RjsNAQwdsdMFvSlVK/7XA\\nt3FaoJoAsncM1Q9x5+3V0Ww68/eIFmb1zuUFljQJKprrX88XypNDvjYNby6vw"
      },
      "managementIp": "10.195.237.228/26",
      "managementGatewayIp": "10.195.237.254",
      "publicIp": "149.97.198.95/31",
      "publicGatewayIp": "149.97.198.94",
      "primaryDnsName": "4.0.0.53",
      "secondaryDnsName": "129.250.35.250",
      "termLength": 12,
      "additionalBandwidth": 200,
      "siteId": "12345",
      "systemIpAddress": "192.168.2.5",
      "vendorConfig": {
        "siteId": 567,
        "systemIpAddress": "192.164.0.0",
        "licenseKey": "6735-vwe64568-6a91-4112-8734-bea12d91f7y7",
        "licenseSecret": "h5j0i45e83324pblbfca764532c4a640e7801f0",
        "localId": "branch1@example.com",
        "remoteId": "companyController1@example.com",
        "controller1": "54.219.248.29",
        "controller2": "54.177.220.115",
        "serialNumber": 4545454,
        "adminPassword": 5678909,
        "activationKey": "GJUK-JM2X-59BJ-2TDJ",
        "controllerFqdn": "demo.velocloud.net",
        "rootPassword": "myPassw0rd!",
        "accountName": "accountName",
        "hostname": "hostName",
        "accountKey": "Primary Account Key1",
        "applianceTag": "applianceTag"
      },
      "interfaces": [
        {
          "id": 1,
          "ipv4Mask": "255.255.255.0",
          "ipv4Subnet": "192.168.0.5",
          "name": "ethernet1",
          "status": "ASSIGNED",
          "operationStatus": "DOWN",
          "macAddress": "fa16.3e1c.a8d8",
          "ipAddress": "2.2.2.2",
          "assignedType": "Equinix Managed",
          "type": "DATA"
        },
        {
          "id": 1,
          "ipv4Mask": "255.255.255.0",
          "ipv4Subnet": "192.168.0.5",
          "name": "ethernet1",
          "status": "ASSIGNED",
          "operationStatus": "DOWN",
          "macAddress": "fa16.3e1c.a8d8",
          "ipAddress": "2.2.2.2",
          "assignedType": "Equinix Managed",
          "type": "DATA"
        },
        {
          "id": 1,
          "ipv4Mask": "255.255.255.0",
          "ipv4Subnet": "192.168.0.5",
          "name": "ethernet1",
          "status": "ASSIGNED",
          "operationStatus": "DOWN",
          "macAddress": "fa16.3e1c.a8d8",
          "ipAddress": "2.2.2.2",
          "assignedType": "Equinix Managed",
          "type": "DATA"
        },
        {
          "id": 1,
          "ipv4Mask": "255.255.255.0",
          "ipv4Subnet": "192.168.0.5",
          "name": "ethernet1",
          "status": "ASSIGNED",
          "operationStatus": "DOWN",
          "macAddress": "fa16.3e1c.a8d8",
          "ipAddress": "2.2.2.2",
          "assignedType": "Equinix Managed",
          "type": "DATA"
        },
        {
          "id": 1,
          "ipv4Mask": "255.255.255.0",
          "ipv4Subnet": "192.168.0.5",
          "name": "ethernet1",
          "status": "ASSIGNED",
          "operationStatus": "DOWN",
          "macAddress": "fa16.3e1c.a8d8",
          "ipAddress": "2.2.2.2",
          "assignedType": "Equinix Managed",
          "type": "DATA"
        },
        {
          "id": 1,
          "ipv4Mask": "255.255.255.0",
          "ipv4Subnet": "192.168.0.5",
          "name": "ethernet1",
          "status": "ASSIGNED",
          "operationStatus": "DOWN",
          "macAddress": "fa16.3e1c.a8d8",
          "ipAddress": "2.2.2.2",
          "assignedType": "Equinix Managed",
          "type": "DATA"
        },
        {
          "id": 1,
          "ipv4Mask": "255.255.255.0",
          "ipv4Subnet": "192.168.0.5",
          "name": "ethernet1",
          "status": "ASSIGNED",
          "operationStatus": "DOWN",
          "macAddress": "fa16.3e1c.a8d8",
          "ipAddress": "2.2.2.2",
          "assignedType": "Equinix Managed",
          "type": "DATA"
        },
        {
          "id": 1,
          "ipv4Mask": "255.255.255.0",
          "ipv4Subnet": "192.168.0.5",
          "name": "ethernet1",
          "status": "ASSIGNED",
          "operationStatus": "DOWN",
          "macAddress": "fa16.3e1c.a8d8",
          "ipAddress": "2.2.2.2",
          "assignedType": "Equinix Managed",
          "type": "DATA"
        }
      ],
      "asn": 1029
    },
    {
      "accountName": "ABC INC",
      "accountNumber": "133911",
      "createdBy": "cust0001",
      "createdDate": "2018-01-30T10:30:31.387Z",
      "deviceSerialNo": "53791666484",
      "deviceTypeCategory": "ROUTER",
      "deviceTypeCode": "CSR1000V",
      "deviceTypeName": "CSR 1000v",
      "expiry": {
        "date": 7,
        "day": 4,
        "hours": 8,
        "minutes": 0,
        "month": 1,
        "seconds": 0,
        "time": 1549497600000,
        "timezoneOffset": -480,
        "year": 119
      },
      "region": "AMER",
      "deviceTypeVendor": "Cisco",
      "hostName": "VR-SV-CSR1000V-cust0001-1",
      "uuid": "877a3aa2-c49a-4af1-98a6-007424e737ae",
      "lastUpdatedBy": "cust0002",
      "lastUpdatedDate": "2018-01-30T10:30:31.387Z",
      "licenseFileId": "877a3aa2-c49a-4af1-98a6-007424e737ae",
      "licenseName": "Bring your own license",
      "licenseStatus": "REGISTERED",
      "licenseType": "BYOL",
      "metroCode": "SV",
      "metroName": "Silicon Valley",
      "zoneCode": "zone1",
      "zoneName": "Zone 1",
      "name": "AWS-Azure-Router-csr1000v",
      "notifications": [
        "test@equinix.com",
        "test@equinix.com",
        "test@equinix.com",
        "test@equinix.com",
        "test@equinix.com",
        "test@equinix.com"
      ],
      "packageCode": "SEC",
      "packageName": "Security",
      "version": "16.09.02",
      "purchaseOrderNumber": "PO1223",
      "redundancyType": "PRIMARY",
      "redundantUuid": "xxxxx191-xx70-xxxx-xx04-xxxxxxxa67xx",
      "sshIpAddress": "10.195.11.23",
      "sshIpFqdn": "test-device-168-201-97-149.eis.lab.equinix.com",
      "status": "PROVISIONED",
      "throughput": 500,
      "throughputUnit": "Mbps",
      "aclTemplateUuid": "49289456-a63e-47d4-927c-5161cfb77501",
      "core": {
        "core": 4,
        "memory": 4,
        "unit": "GB"
      },
      "pricingDetails": {
        "termLength": 36,
        "orderNumber": "1-198735018693",
        "core": 4,
        "throughput": 1,
        "ThroughputUnit": "Gbps",
        "packageCode": "AX",
        "additionalBandwidth": 100,
        "primary": {
          "currency": "USD",
          "charges": [
            {
              "description": "VIRTUAL_DEVICE",
              "monthlyRecurringCharges": 200
            },
            {
              "description": "VIRTUAL_DEVICE",
              "monthlyRecurringCharges": 200
            },
            {
              "description": "VIRTUAL_DEVICE",
              "monthlyRecurringCharges": 200
            },
            {
              "description": "VIRTUAL_DEVICE",
              "monthlyRecurringCharges": 200
            },
            {
              "description": "VIRTUAL_DEVICE",
              "monthlyRecurringCharges": 200
            },
            {
              "description": "VIRTUAL_DEVICE",
              "monthlyRecurringCharges": 200
            },
            {
              "description": "VIRTUAL_DEVICE",
              "monthlyRecurringCharges": 200
            },
            {
              "description": "VIRTUAL_DEVICE",
              "monthlyRecurringCharges": 200
            },
            {
              "description": "VIRTUAL_DEVICE",
              "monthlyRecurringCharges": 200
            }
          ]
        },
        "secondary": {
          "currency": "USD",
          "charges": [
            {
              "description": "VIRTUAL_DEVICE",
              "monthlyRecurringCharges": 200
            },
            {
              "description": "VIRTUAL_DEVICE",
              "monthlyRecurringCharges": 200
            }
          ]
        }
      },
      "interfaceCount": 10,
      "deviceManagementType": "EQUINIX-CONFIGURED",
      "userPublicKey": {
        "username": "test-user-1",
        "publicKeyName": "test-pk-2",
        "publicKey": "ssh-rsa AAAAB3NzaC1yc2EAAAABIwAAAQEAklOUpkDHrfHY17SbrmTIpNLTGK9Tjom/BWDSU\\nGPl+nafzlHDTYW7hdI4yZ5ew18JH4JW9jbhUFrviQzM7xlELEVf4h9lFX5QVkbPppSwg0cda3\\nPbv7kOdJ/MTyBlWXFCR+HAo3FXRitBqxiX1nKhXpHAZsMciLq8V6RjsNAQwdsdMFvSlVK/7XA\\nt3FaoJoAsncM1Q9x5+3V0Ww68/eIFmb1zuUFljQJKprrX88XypNDvjYNby6vw"
      },
      "managementIp": "10.195.237.228/26",
      "managementGatewayIp": "10.195.237.254",
      "publicIp": "149.97.198.95/31",
      "publicGatewayIp": "149.97.198.94",
      "primaryDnsName": "4.0.0.53",
      "secondaryDnsName": "129.250.35.250",
      "termLength": 12,
      "additionalBandwidth": 200,
      "siteId": "12345",
      "systemIpAddress": "192.168.2.5",
      "vendorConfig": {
        "siteId": 567,
        "systemIpAddress": "192.164.0.0",
        "licenseKey": "6735-vwe64568-6a91-4112-8734-bea12d91f7y7",
        "licenseSecret": "h5j0i45e83324pblbfca764532c4a640e7801f0",
        "localId": "branch1@example.com",
        "remoteId": "companyController1@example.com",
        "controller1": "54.219.248.29",
        "controller2": "54.177.220.115",
        "serialNumber": 4545454,
        "adminPassword": 5678909,
        "activationKey": "GJUK-JM2X-59BJ-2TDJ",
        "controllerFqdn": "demo.velocloud.net",
        "rootPassword": "myPassw0rd!",
        "accountName": "accountName",
        "hostname": "hostName",
        "accountKey": "Primary Account Key1",
        "applianceTag": "applianceTag"
      },
      "interfaces": [
        {
          "id": 1,
          "ipv4Mask": "255.255.255.0",
          "ipv4Subnet": "192.168.0.5",
          "name": "ethernet1",
          "status": "ASSIGNED",
          "operationStatus": "DOWN",
          "macAddress": "fa16.3e1c.a8d8",
          "ipAddress": "2.2.2.2",
          "assignedType": "Equinix Managed",
          "type": "DATA"
        },
        {
          "id": 1,
          "ipv4Mask": "255.255.255.0",
          "ipv4Subnet": "192.168.0.5",
          "name": "ethernet1",
          "status": "ASSIGNED",
          "operationStatus": "DOWN",
          "macAddress": "fa16.3e1c.a8d8",
          "ipAddress": "2.2.2.2",
          "assignedType": "Equinix Managed",
          "type": "DATA"
        },
        {
          "id": 1,
          "ipv4Mask": "255.255.255.0",
          "ipv4Subnet": "192.168.0.5",
          "name": "ethernet1",
          "status": "ASSIGNED",
          "operationStatus": "DOWN",
          "macAddress": "fa16.3e1c.a8d8",
          "ipAddress": "2.2.2.2",
          "assignedType": "Equinix Managed",
          "type": "DATA"
        },
        {
          "id": 1,
          "ipv4Mask": "255.255.255.0",
          "ipv4Subnet": "192.168.0.5",
          "name": "ethernet1",
          "status": "ASSIGNED",
          "operationStatus": "DOWN",
          "macAddress": "fa16.3e1c.a8d8",
          "ipAddress": "2.2.2.2",
          "assignedType": "Equinix Managed",
          "type": "DATA"
        },
        {
          "id": 1,
          "ipv4Mask": "255.255.255.0",
          "ipv4Subnet": "192.168.0.5",
          "name": "ethernet1",
          "status": "ASSIGNED",
          "operationStatus": "DOWN",
          "macAddress": "fa16.3e1c.a8d8",
          "ipAddress": "2.2.2.2",
          "assignedType": "Equinix Managed",
          "type": "DATA"
        },
        {
          "id": 1,
          "ipv4Mask": "255.255.255.0",
          "ipv4Subnet": "192.168.0.5",
          "name": "ethernet1",
          "status": "ASSIGNED",
          "operationStatus": "DOWN",
          "macAddress": "fa16.3e1c.a8d8",
          "ipAddress": "2.2.2.2",
          "assignedType": "Equinix Managed",
          "type": "DATA"
        },
        {
          "id": 1,
          "ipv4Mask": "255.255.255.0",
          "ipv4Subnet": "192.168.0.5",
          "name": "ethernet1",
          "status": "ASSIGNED",
          "operationStatus": "DOWN",
          "macAddress": "fa16.3e1c.a8d8",
          "ipAddress": "2.2.2.2",
          "assignedType": "Equinix Managed",
          "type": "DATA"
        },
        {
          "id": 1,
          "ipv4Mask": "255.255.255.0",
          "ipv4Subnet": "192.168.0.5",
          "name": "ethernet1",
          "status": "ASSIGNED",
          "operationStatus": "DOWN",
          "macAddress": "fa16.3e1c.a8d8",
          "ipAddress": "2.2.2.2",
          "assignedType": "Equinix Managed",
          "type": "DATA"
        }
      ],
      "asn": 1029
    },
    {
      "accountName": "ABC INC",
      "accountNumber": "133911",
      "createdBy": "cust0001",
      "createdDate": "2018-01-30T10:30:31.387Z",
      "deviceSerialNo": "53791666484",
      "deviceTypeCategory": "ROUTER",
      "deviceTypeCode": "CSR1000V",
      "deviceTypeName": "CSR 1000v",
      "expiry": {
        "date": 7,
        "day": 4,
        "hours": 8,
        "minutes": 0,
        "month": 1,
        "seconds": 0,
        "time": 1549497600000,
        "timezoneOffset": -480,
        "year": 119
      },
      "region": "AMER",
      "deviceTypeVendor": "Cisco",
      "hostName": "VR-SV-CSR1000V-cust0001-1",
      "uuid": "877a3aa2-c49a-4af1-98a6-007424e737ae",
      "lastUpdatedBy": "cust0002",
      "lastUpdatedDate": "2018-01-30T10:30:31.387Z",
      "licenseFileId": "877a3aa2-c49a-4af1-98a6-007424e737ae",
      "licenseName": "Bring your own license",
      "licenseStatus": "REGISTERED",
      "licenseType": "BYOL",
      "metroCode": "SV",
      "metroName": "Silicon Valley",
      "zoneCode": "zone1",
      "zoneName": "Zone 1",
      "name": "AWS-Azure-Router-csr1000v",
      "notifications": [
        "test@equinix.com",
        "test@equinix.com",
        "test@equinix.com",
        "test@equinix.com",
        "test@equinix.com",
        "test@equinix.com",
        "test@equinix.com",
        "test@equinix.com"
      ],
      "packageCode": "SEC",
      "packageName": "Security",
      "version": "16.09.02",
      "purchaseOrderNumber": "PO1223",
      "redundancyType": "PRIMARY",
      "redundantUuid": "xxxxx191-xx70-xxxx-xx04-xxxxxxxa67xx",
      "sshIpAddress": "10.195.11.23",
      "sshIpFqdn": "test-device-168-201-97-149.eis.lab.equinix.com",
      "status": "PROVISIONED",
      "throughput": 500,
      "throughputUnit": "Mbps",
      "aclTemplateUuid": "49289456-a63e-47d4-927c-5161cfb77501",
      "core": {
        "core": 4,
        "memory": 4,
        "unit": "GB"
      },
      "pricingDetails": {
        "termLength": 36,
        "orderNumber": "1-198735018693",
        "core": 4,
        "throughput": 1,
        "ThroughputUnit": "Gbps",
        "packageCode": "AX",
        "additionalBandwidth": 100,
        "primary": {
          "currency": "USD",
          "charges": [
            {
              "description": "VIRTUAL_DEVICE",
              "monthlyRecurringCharges": 200
            },
            {
              "description": "VIRTUAL_DEVICE",
              "monthlyRecurringCharges": 200
            },
            {
              "description": "VIRTUAL_DEVICE",
              "monthlyRecurringCharges": 200
            },
            {
              "description": "VIRTUAL_DEVICE",
              "monthlyRecurringCharges": 200
            }
          ]
        },
        "secondary": {
          "currency": "USD",
          "charges": [
            {
              "description": "VIRTUAL_DEVICE",
              "monthlyRecurringCharges": 200
            }
          ]
        }
      },
      "interfaceCount": 10,
      "deviceManagementType": "EQUINIX-CONFIGURED",
      "userPublicKey": {
        "username": "test-user-1",
        "publicKeyName": "test-pk-2",
        "publicKey": "ssh-rsa AAAAB3NzaC1yc2EAAAABIwAAAQEAklOUpkDHrfHY17SbrmTIpNLTGK9Tjom/BWDSU\\nGPl+nafzlHDTYW7hdI4yZ5ew18JH4JW9jbhUFrviQzM7xlELEVf4h9lFX5QVkbPppSwg0cda3\\nPbv7kOdJ/MTyBlWXFCR+HAo3FXRitBqxiX1nKhXpHAZsMciLq8V6RjsNAQwdsdMFvSlVK/7XA\\nt3FaoJoAsncM1Q9x5+3V0Ww68/eIFmb1zuUFljQJKprrX88XypNDvjYNby6vw"
      },
      "managementIp": "10.195.237.228/26",
      "managementGatewayIp": "10.195.237.254",
      "publicIp": "149.97.198.95/31",
      "publicGatewayIp": "149.97.198.94",
      "primaryDnsName": "4.0.0.53",
      "secondaryDnsName": "129.250.35.250",
      "termLength": 12,
      "additionalBandwidth": 200,
      "siteId": "12345",
      "systemIpAddress": "192.168.2.5",
      "vendorConfig": {
        "siteId": 567,
        "systemIpAddress": "192.164.0.0",
        "licenseKey": "6735-vwe64568-6a91-4112-8734-bea12d91f7y7",
        "licenseSecret": "h5j0i45e83324pblbfca764532c4a640e7801f0",
        "localId": "branch1@example.com",
        "remoteId": "companyController1@example.com",
        "controller1": "54.219.248.29",
        "controller2": "54.177.220.115",
        "serialNumber": 4545454,
        "adminPassword": 5678909,
        "activationKey": "GJUK-JM2X-59BJ-2TDJ",
        "controllerFqdn": "demo.velocloud.net",
        "rootPassword": "myPassw0rd!",
        "accountName": "accountName",
        "hostname": "hostName",
        "accountKey": "Primary Account Key1",
        "applianceTag": "applianceTag"
      },
      "interfaces": [
        {
          "id": 1,
          "ipv4Mask": "255.255.255.0",
          "ipv4Subnet": "192.168.0.5",
          "name": "ethernet1",
          "status": "ASSIGNED",
          "operationStatus": "DOWN",
          "macAddress": "fa16.3e1c.a8d8",
          "ipAddress": "2.2.2.2",
          "assignedType": "Equinix Managed",
          "type": "DATA"
        },
        {
          "id": 1,
          "ipv4Mask": "255.255.255.0",
          "ipv4Subnet": "192.168.0.5",
          "name": "ethernet1",
          "status": "ASSIGNED",
          "operationStatus": "DOWN",
          "macAddress": "fa16.3e1c.a8d8",
          "ipAddress": "2.2.2.2",
          "assignedType": "Equinix Managed",
          "type": "DATA"
        }
      ],
      "asn": 1029
    },
    {
      "accountName": "ABC INC",
      "accountNumber": "133911",
      "createdBy": "cust0001",
      "createdDate": "2018-01-30T10:30:31.387Z",
      "deviceSerialNo": "53791666484",
      "deviceTypeCategory": "ROUTER",
      "deviceTypeCode": "CSR1000V",
      "deviceTypeName": "CSR 1000v",
      "expiry": {
        "date": 7,
        "day": 4,
        "hours": 8,
        "minutes": 0,
        "month": 1,
        "seconds": 0,
        "time": 1549497600000,
        "timezoneOffset": -480,
        "year": 119
      },
      "region": "AMER",
      "deviceTypeVendor": "Cisco",
      "hostName": "VR-SV-CSR1000V-cust0001-1",
      "uuid": "877a3aa2-c49a-4af1-98a6-007424e737ae",
      "lastUpdatedBy": "cust0002",
      "lastUpdatedDate": "2018-01-30T10:30:31.387Z",
      "licenseFileId": "877a3aa2-c49a-4af1-98a6-007424e737ae",
      "licenseName": "Bring your own license",
      "licenseStatus": "REGISTERED",
      "licenseType": "BYOL",
      "metroCode": "SV",
      "metroName": "Silicon Valley",
      "zoneCode": "zone1",
      "zoneName": "Zone 1",
      "name": "AWS-Azure-Router-csr1000v",
      "notifications": [
        "test@equinix.com",
        "test@equinix.com",
        "test@equinix.com",
        "test@equinix.com"
      ],
      "packageCode": "SEC",
      "packageName": "Security",
      "version": "16.09.02",
      "purchaseOrderNumber": "PO1223",
      "redundancyType": "PRIMARY",
      "redundantUuid": "xxxxx191-xx70-xxxx-xx04-xxxxxxxa67xx",
      "sshIpAddress": "10.195.11.23",
      "sshIpFqdn": "test-device-168-201-97-149.eis.lab.equinix.com",
      "status": "PROVISIONED",
      "throughput": 500,
      "throughputUnit": "Mbps",
      "aclTemplateUuid": "49289456-a63e-47d4-927c-5161cfb77501",
      "core": {
        "core": 4,
        "memory": 4,
        "unit": "GB"
      },
      "pricingDetails": {
        "termLength": 36,
        "orderNumber": "1-198735018693",
        "core": 4,
        "throughput": 1,
        "ThroughputUnit": "Gbps",
        "packageCode": "AX",
        "additionalBandwidth": 100,
        "primary": {
          "currency": "USD",
          "charges": [
            {
              "description": "VIRTUAL_DEVICE",
              "monthlyRecurringCharges": 200
            },
            {
              "description": "VIRTUAL_DEVICE",
              "monthlyRecurringCharges": 200
            },
            {
              "description": "VIRTUAL_DEVICE",
              "monthlyRecurringCharges": 200
            },
            {
              "description": "VIRTUAL_DEVICE",
              "monthlyRecurringCharges": 200
            },
            {
              "description": "VIRTUAL_DEVICE",
              "monthlyRecurringCharges": 200
            },
            {
              "description": "VIRTUAL_DEVICE",
              "monthlyRecurringCharges": 200
            },
            {
              "description": "VIRTUAL_DEVICE",
              "monthlyRecurringCharges": 200
            },
            {
              "description": "VIRTUAL_DEVICE",
              "monthlyRecurringCharges": 200
            }
          ]
        },
        "secondary": {
          "currency": "USD",
          "charges": [
            {
              "description": "VIRTUAL_DEVICE",
              "monthlyRecurringCharges": 200
            },
            {
              "description": "VIRTUAL_DEVICE",
              "monthlyRecurringCharges": 200
            },
            {
              "description": "VIRTUAL_DEVICE",
              "monthlyRecurringCharges": 200
            }
          ]
        }
      },
      "interfaceCount": 10,
      "deviceManagementType": "EQUINIX-CONFIGURED",
      "userPublicKey": {
        "username": "test-user-1",
        "publicKeyName": "test-pk-2",
        "publicKey": "ssh-rsa AAAAB3NzaC1yc2EAAAABIwAAAQEAklOUpkDHrfHY17SbrmTIpNLTGK9Tjom/BWDSU\\nGPl+nafzlHDTYW7hdI4yZ5ew18JH4JW9jbhUFrviQzM7xlELEVf4h9lFX5QVkbPppSwg0cda3\\nPbv7kOdJ/MTyBlWXFCR+HAo3FXRitBqxiX1nKhXpHAZsMciLq8V6RjsNAQwdsdMFvSlVK/7XA\\nt3FaoJoAsncM1Q9x5+3V0Ww68/eIFmb1zuUFljQJKprrX88XypNDvjYNby6vw"
      },
      "managementIp": "10.195.237.228/26",
      "managementGatewayIp": "10.195.237.254",
      "publicIp": "149.97.198.95/31",
      "publicGatewayIp": "149.97.198.94",
      "primaryDnsName": "4.0.0.53",
      "secondaryDnsName": "129.250.35.250",
      "termLength": 12,
      "additionalBandwidth": 200,
      "siteId": "12345",
      "systemIpAddress": "192.168.2.5",
      "vendorConfig": {
        "siteId": 567,
        "systemIpAddress": "192.164.0.0",
        "licenseKey": "6735-vwe64568-6a91-4112-8734-bea12d91f7y7",
        "licenseSecret": "h5j0i45e83324pblbfca764532c4a640e7801f0",
        "localId": "branch1@example.com",
        "remoteId": "companyController1@example.com",
        "controller1": "54.219.248.29",
        "controller2": "54.177.220.115",
        "serialNumber": 4545454,
        "adminPassword": 5678909,
        "activationKey": "GJUK-JM2X-59BJ-2TDJ",
        "controllerFqdn": "demo.velocloud.net",
        "rootPassword": "myPassw0rd!",
        "accountName": "accountName",
        "hostname": "hostName",
        "accountKey": "Primary Account Key1",
        "applianceTag": "applianceTag"
      },
      "interfaces": [
        {
          "id": 1,
          "ipv4Mask": "255.255.255.0",
          "ipv4Subnet": "192.168.0.5",
          "name": "ethernet1",
          "status": "ASSIGNED",
          "operationStatus": "DOWN",
          "macAddress": "fa16.3e1c.a8d8",
          "ipAddress": "2.2.2.2",
          "assignedType": "Equinix Managed",
          "type": "DATA"
        },
        {
          "id": 1,
          "ipv4Mask": "255.255.255.0",
          "ipv4Subnet": "192.168.0.5",
          "name": "ethernet1",
          "status": "ASSIGNED",
          "operationStatus": "DOWN",
          "macAddress": "fa16.3e1c.a8d8",
          "ipAddress": "2.2.2.2",
          "assignedType": "Equinix Managed",
          "type": "DATA"
        },
        {
          "id": 1,
          "ipv4Mask": "255.255.255.0",
          "ipv4Subnet": "192.168.0.5",
          "name": "ethernet1",
          "status": "ASSIGNED",
          "operationStatus": "DOWN",
          "macAddress": "fa16.3e1c.a8d8",
          "ipAddress": "2.2.2.2",
          "assignedType": "Equinix Managed",
          "type": "DATA"
        },
        {
          "id": 1,
          "ipv4Mask": "255.255.255.0",
          "ipv4Subnet": "192.168.0.5",
          "name": "ethernet1",
          "status": "ASSIGNED",
          "operationStatus": "DOWN",
          "macAddress": "fa16.3e1c.a8d8",
          "ipAddress": "2.2.2.2",
          "assignedType": "Equinix Managed",
          "type": "DATA"
        },
        {
          "id": 1,
          "ipv4Mask": "255.255.255.0",
          "ipv4Subnet": "192.168.0.5",
          "name": "ethernet1",
          "status": "ASSIGNED",
          "operationStatus": "DOWN",
          "macAddress": "fa16.3e1c.a8d8",
          "ipAddress": "2.2.2.2",
          "assignedType": "Equinix Managed",
          "type": "DATA"
        },
        {
          "id": 1,
          "ipv4Mask": "255.255.255.0",
          "ipv4Subnet": "192.168.0.5",
          "name": "ethernet1",
          "status": "ASSIGNED",
          "operationStatus": "DOWN",
          "macAddress": "fa16.3e1c.a8d8",
          "ipAddress": "2.2.2.2",
          "assignedType": "Equinix Managed",
          "type": "DATA"
        },
        {
          "id": 1,
          "ipv4Mask": "255.255.255.0",
          "ipv4Subnet": "192.168.0.5",
          "name": "ethernet1",
          "status": "ASSIGNED",
          "operationStatus": "DOWN",
          "macAddress": "fa16.3e1c.a8d8",
          "ipAddress": "2.2.2.2",
          "assignedType": "Equinix Managed",
          "type": "DATA"
        },
        {
          "id": 1,
          "ipv4Mask": "255.255.255.0",
          "ipv4Subnet": "192.168.0.5",
          "name": "ethernet1",
          "status": "ASSIGNED",
          "operationStatus": "DOWN",
          "macAddress": "fa16.3e1c.a8d8",
          "ipAddress": "2.2.2.2",
          "assignedType": "Equinix Managed",
          "type": "DATA"
        },
        {
          "id": 1,
          "ipv4Mask": "255.255.255.0",
          "ipv4Subnet": "192.168.0.5",
          "name": "ethernet1",
          "status": "ASSIGNED",
          "operationStatus": "DOWN",
          "macAddress": "fa16.3e1c.a8d8",
          "ipAddress": "2.2.2.2",
          "assignedType": "Equinix Managed",
          "type": "DATA"
        },
        {
          "id": 1,
          "ipv4Mask": "255.255.255.0",
          "ipv4Subnet": "192.168.0.5",
          "name": "ethernet1",
          "status": "ASSIGNED",
          "operationStatus": "DOWN",
          "macAddress": "fa16.3e1c.a8d8",
          "ipAddress": "2.2.2.2",
          "assignedType": "Equinix Managed",
          "type": "DATA"
        }
      ],
      "asn": 1029
    }
  ]
}