{
  "actions": [
    {
      "name": "uploadLicenseUsingPOST",
      "protocol": "REST",
      "method": "POST",
      "entitypath": "{base_path}/{version}/ne/v1/devices/licenseFiles?{query}",
      "requestSchema": "schema.json",
      "responseSchema": "schema.json",
      "timeout": 0,
      "sendEmpty": false,
      "requestDatatype": "FORM",
      "responseDatatype": "JSON",
      "headers": {},
      "responseObjects": [
        {
          "type": "default",
          "key": "",
          "mockFile": "mockdatafiles/uploadLicenseUsingPOST-default.json"
        }
      ]
    },
    {
      "name": "uploadLicenseForDeviceUsingPOST",
      "protocol": "REST",
      "method": "POST",
      "entitypath": "{base_path}/{version}/ne/v1/devices/licenseFiles/{pathv1}?{query}",
      "requestSchema": "schema.json",
      "responseSchema": "schema.json",
      "timeout": 0,
      "sendEmpty": false,
      "requestDatatype": "FORM",
      "responseDatatype": "JSON",
      "headers": {},
      "responseObjects": [
        {
          "type": "default",
          "key": "",
          "mockFile": "mockdatafiles/uploadLicenseForDeviceUsingPOST-default.json"
        }
      ]
    },
    {
      "name": "updateLicenseUsingPOST",
      "protocol": "REST",
      "method": "PUT",
      "entitypath": "{base_path}/{version}/ne/v1/devices/{pathv1}/licenseTokens?{query}",
      "requestSchema": "schema.json",
      "responseSchema": "schema.json",
      "timeout": 0,
      "sendEmpty": false,
      "requestDatatype": "JSON",
      "responseDatatype": "JSON",
      "headers": {},
      "responseObjects": [
        {
          "type": "default",
          "key": "",
          "mockFile": "mockdatafiles/updateLicenseUsingPOST-default.json"
        }
      ]
    },
    {
      "name": "createVirtualDeviceUsingPOST",
      "protocol": "REST",
      "method": "POST",
      "entitypath": "{base_path}/{version}/ne/v1/devices?{query}",
      "requestSchema": "schema.json",
      "responseSchema": "schema.json",
      "timeout": 0,
      "sendEmpty": false,
      "requestDatatype": "JSON",
      "responseDatatype": "JSON",
      "headers": {},
      "responseObjects": [
        {
          "type": "default",
          "key": "",
          "mockFile": "mockdatafiles/createVirtualDeviceUsingPOST-default.json"
        }
      ]
    },
    {
      "name": "getVirtualDevicesUsingGET1",
      "protocol": "REST",
      "method": "GET",
      "entitypath": "{base_path}/{version}/ne/v1/devices?{query}",
      "requestSchema": "schema.json",
      "responseSchema": "schema.json",
      "timeout": 0,
      "sendEmpty": false,
      "sendGetBody": false,
      "requestDatatype": "JSON",
      "responseDatatype": "JSON",
      "headers": {},
      "responseObjects": [
        {
          "type": "default",
          "key": "",
          "mockFile": "mockdatafiles/getVirtualDevicesUsingGET1-default.json"
        }
      ]
    },
    {
      "name": "getVirtualDeviceUsingGET",
      "protocol": "REST",
      "method": "GET",
      "entitypath": "{base_path}/{version}/ne/v1/devices/{pathv1}?{query}",
      "requestSchema": "schema.json",
      "responseSchema": "schema.json",
      "timeout": 0,
      "sendEmpty": false,
      "sendGetBody": false,
      "requestDatatype": "JSON",
      "responseDatatype": "JSON",
      "headers": {},
      "responseObjects": [
        {
          "type": "default",
          "key": "",
          "mockFile": "mockdatafiles/getVirtualDeviceUsingGET-default.json"
        }
      ]
    },
    {
      "name": "updateVirtualDeviceUsingPATCH1",
      "protocol": "REST",
      "method": "PATCH",
      "entitypath": "{base_path}/{version}/ne/v1/devices/{pathv1}?{query}",
      "requestSchema": "schema.json",
      "responseSchema": "schema.json",
      "timeout": 0,
      "sendEmpty": false,
      "requestDatatype": "JSON",
      "responseDatatype": "JSON",
      "headers": {},
      "responseObjects": [
        {
          "type": "default",
          "key": "",
          "mockFile": "mockdatafiles/updateVirtualDeviceUsingPATCH1-default.json"
        }
      ]
    },
    {
      "name": "deleteVRouterUsingDELETE",
      "protocol": "REST",
      "method": "DELETE",
      "entitypath": "{base_path}/{version}/ne/v1/devices/{pathv1}?{query}",
      "requestSchema": "schema.json",
      "responseSchema": "schema.json",
      "timeout": 0,
      "sendEmpty": false,
      "requestDatatype": "JSON",
      "responseDatatype": "JSON",
      "headers": {},
      "responseObjects": [
        {
          "type": "default",
          "key": "",
          "mockFile": ""
        }
      ]
    },
    {
      "name": "updateVirtualDeviceUsingPUT",
      "protocol": "REST",
      "method": "PUT",
      "entitypath": "{base_path}/{version}/ne/v1/devices/{pathv1}?{query}",
      "requestSchema": "schema.json",
      "responseSchema": "schema.json",
      "timeout": 0,
      "sendEmpty": false,
      "requestDatatype": "JSON",
      "responseDatatype": "JSON",
      "headers": {},
      "responseObjects": [
        {
          "type": "default",
          "key": "",
          "mockFile": ""
        }
      ]
    },
    {
      "name": "updateAdditionalBandwidth",
      "protocol": "REST",
      "method": "PUT",
      "entitypath": "{base_path}/{version}/ne/v1/devices/{pathv1}/additionalBandwidths?{query}",
      "requestSchema": "schema.json",
      "responseSchema": "schema.json",
      "timeout": 0,
      "sendEmpty": false,
      "requestDatatype": "JSON",
      "responseDatatype": "JSON",
      "headers": {},
      "responseObjects": [
        {
          "type": "default",
          "key": "",
          "mockFile": ""
        }
      ]
    },
    {
      "name": "getVirtualDeviceInterfacesUsingGET",
      "protocol": "REST",
      "method": "GET",
      "entitypath": "{base_path}/{version}/ne/v1/devices/{pathv1}/interfaces?{query}",
      "requestSchema": "schema.json",
      "responseSchema": "schema.json",
      "timeout": 0,
      "sendEmpty": false,
      "sendGetBody": false,
      "requestDatatype": "JSON",
      "responseDatatype": "JSON",
      "headers": {},
      "responseObjects": [
        {
          "type": "default",
          "key": "",
          "mockFile": "mockdatafiles/getVirtualDeviceInterfacesUsingGET-default.json"
        }
      ]
    },
    {
      "name": "pingDeviceUsingGET",
      "protocol": "REST",
      "method": "GET",
      "entitypath": "{base_path}/{version}/ne/v1/devices/{pathv1}/ping?{query}",
      "requestSchema": "schema.json",
      "responseSchema": "schema.json",
      "timeout": 0,
      "sendEmpty": false,
      "sendGetBody": false,
      "requestDatatype": "JSON",
      "responseDatatype": "JSON",
      "headers": {},
      "responseObjects": [
        {
          "type": "default",
          "key": "",
          "mockFile": ""
        }
      ]
    }
  ]
}