{
  "isLastPage": true,
  "totalCount": 55,
  "isFirstPage": true,
  "pageSize": 1000,
  "pageNumber": 1,
  "content": [
    {
      "uuid": "xxxxx191-xx70-xxxx-xx04-xxxxxxxa37xx",
      "name": "test",
      "authKeyLabel": "Authorization Key",
      "connectionNameLabel": "Connection Name",
      "requiredRedundancy": true,
      "allowCustomSpeed": true,
      "speedBands": [
        {
          "speed": 50,
          "unit": "MB"
        },
        {
          "speed": 50,
          "unit": "MB"
        },
        {
          "speed": 50,
          "unit": "MB"
        },
        {
          "speed": 50,
          "unit": "MB"
        },
        {
          "speed": 50,
          "unit": "MB"
        },
        {
          "speed": 50,
          "unit": "MB"
        },
        {
          "speed": 50,
          "unit": "MB"
        },
        {
          "speed": 50,
          "unit": "MB"
        },
        {
          "speed": 50,
          "unit": "MB"
        },
        {
          "speed": 50,
          "unit": "MB"
        }
      ],
      "metros": {
        "code": "SV",
        "name": "Silicon Valley",
        "ibxs": [
          "SV1"
        ],
        "inTrail": true,
        "displayName": "Silicon Valley"
      },
      "createdDate": "2018-03-22T04:34:48.231Z",
      "createdBy": "Sandbox User",
      "lastUpdatedDate": "2018-04-03T00:30:57.055Z",
      "lastUpdatedBy": "Sandbox User",
      "vlanSameAsPrimary": true,
      "tagType": "CTAGED",
      "ctagLabel": "Seller-Side C-Tag",
      "apiAvailable": true,
      "selfProfile": false,
      "profileEncapsulation": "Dot1q",
      "authorizationKey": "535235",
      "organizationName": "Equinix-ADMIN",
      "private": false,
      "features": {
        "cloudReach": true,
        "testProfile": true
      }
    }
  ]
}