{
  "payLoad": {
    "cages": [
      {
        "name": "CH1:05:000430",
        "type": "cage",
        "cabinets": [
          {
            "name": "CH1:05:000430:0105",
            "type": "cabinet",
            "circuits": [
              {
                "name": 877484,
                "type": "circuit"
              },
              {
                "name": 877484,
                "type": "circuit"
              },
              {
                "name": 877484,
                "type": "circuit"
              },
              {
                "name": 877484,
                "type": "circuit"
              },
              {
                "name": 877484,
                "type": "circuit"
              },
              {
                "name": 877484,
                "type": "circuit"
              }
            ]
          },
          {
            "name": "CH1:05:000430:0105",
            "type": "cabinet",
            "circuits": [
              {
                "name": 877484,
                "type": "circuit"
              }
            ]
          },
          {
            "name": "CH1:05:000430:0105",
            "type": "cabinet",
            "circuits": [
              {
                "name": 877484,
                "type": "circuit"
              },
              {
                "name": 877484,
                "type": "circuit"
              }
            ]
          }
        ]
      },
      {
        "name": "CH1:05:000430",
        "type": "cage",
        "cabinets": [
          {
            "name": "CH1:05:000430:0105",
            "type": "cabinet",
            "circuits": [
              {
                "name": 877484,
                "type": "circuit"
              },
              {
                "name": 877484,
                "type": "circuit"
              },
              {
                "name": 877484,
                "type": "circuit"
              }
            ]
          },
          {
            "name": "CH1:05:000430:0105",
            "type": "cabinet",
            "circuits": [
              {
                "name": 877484,
                "type": "circuit"
              },
              {
                "name": 877484,
                "type": "circuit"
              },
              {
                "name": 877484,
                "type": "circuit"
              },
              {
                "name": 877484,
                "type": "circuit"
              },
              {
                "name": 877484,
                "type": "circuit"
              },
              {
                "name": 877484,
                "type": "circuit"
              },
              {
                "name": 877484,
                "type": "circuit"
              },
              {
                "name": 877484,
                "type": "circuit"
              },
              {
                "name": 877484,
                "type": "circuit"
              },
              {
                "name": 877484,
                "type": "circuit"
              }
            ]
          },
          {
            "name": "CH1:05:000430:0105",
            "type": "cabinet",
            "circuits": [
              {
                "name": 877484,
                "type": "circuit"
              },
              {
                "name": 877484,
                "type": "circuit"
              },
              {
                "name": 877484,
                "type": "circuit"
              },
              {
                "name": 877484,
                "type": "circuit"
              }
            ]
          },
          {
            "name": "CH1:05:000430:0105",
            "type": "cabinet",
            "circuits": [
              {
                "name": 877484,
                "type": "circuit"
              },
              {
                "name": 877484,
                "type": "circuit"
              },
              {
                "name": 877484,
                "type": "circuit"
              },
              {
                "name": 877484,
                "type": "circuit"
              },
              {
                "name": 877484,
                "type": "circuit"
              },
              {
                "name": 877484,
                "type": "circuit"
              },
              {
                "name": 877484,
                "type": "circuit"
              },
              {
                "name": 877484,
                "type": "circuit"
              },
              {
                "name": 877484,
                "type": "circuit"
              }
            ]
          },
          {
            "name": "CH1:05:000430:0105",
            "type": "cabinet",
            "circuits": [
              {
                "name": 877484,
                "type": "circuit"
              },
              {
                "name": 877484,
                "type": "circuit"
              },
              {
                "name": 877484,
                "type": "circuit"
              }
            ]
          }
        ]
      },
      {
        "name": "CH1:05:000430",
        "type": "cage",
        "cabinets": [
          {
            "name": "CH1:05:000430:0105",
            "type": "cabinet",
            "circuits": [
              {
                "name": 877484,
                "type": "circuit"
              }
            ]
          },
          {
            "name": "CH1:05:000430:0105",
            "type": "cabinet",
            "circuits": [
              {
                "name": 877484,
                "type": "circuit"
              },
              {
                "name": 877484,
                "type": "circuit"
              },
              {
                "name": 877484,
                "type": "circuit"
              },
              {
                "name": 877484,
                "type": "circuit"
              },
              {
                "name": 877484,
                "type": "circuit"
              },
              {
                "name": 877484,
                "type": "circuit"
              },
              {
                "name": 877484,
                "type": "circuit"
              },
              {
                "name": 877484,
                "type": "circuit"
              }
            ]
          },
          {
            "name": "CH1:05:000430:0105",
            "type": "cabinet",
            "circuits": [
              {
                "name": 877484,
                "type": "circuit"
              },
              {
                "name": 877484,
                "type": "circuit"
              },
              {
                "name": 877484,
                "type": "circuit"
              },
              {
                "name": 877484,
                "type": "circuit"
              },
              {
                "name": 877484,
                "type": "circuit"
              },
              {
                "name": 877484,
                "type": "circuit"
              },
              {
                "name": 877484,
                "type": "circuit"
              },
              {
                "name": 877484,
                "type": "circuit"
              },
              {
                "name": 877484,
                "type": "circuit"
              },
              {
                "name": 877484,
                "type": "circuit"
              }
            ]
          },
          {
            "name": "CH1:05:000430:0105",
            "type": "cabinet",
            "circuits": [
              {
                "name": 877484,
                "type": "circuit"
              },
              {
                "name": 877484,
                "type": "circuit"
              },
              {
                "name": 877484,
                "type": "circuit"
              },
              {
                "name": 877484,
                "type": "circuit"
              },
              {
                "name": 877484,
                "type": "circuit"
              },
              {
                "name": 877484,
                "type": "circuit"
              },
              {
                "name": 877484,
                "type": "circuit"
              },
              {
                "name": 877484,
                "type": "circuit"
              },
              {
                "name": 877484,
                "type": "circuit"
              }
            ]
          },
          {
            "name": "CH1:05:000430:0105",
            "type": "cabinet",
            "circuits": [
              {
                "name": 877484,
                "type": "circuit"
              },
              {
                "name": 877484,
                "type": "circuit"
              },
              {
                "name": 877484,
                "type": "circuit"
              }
            ]
          }
        ]
      },
      {
        "name": "CH1:05:000430",
        "type": "cage",
        "cabinets": [
          {
            "name": "CH1:05:000430:0105",
            "type": "cabinet",
            "circuits": [
              {
                "name": 877484,
                "type": "circuit"
              },
              {
                "name": 877484,
                "type": "circuit"
              },
              {
                "name": 877484,
                "type": "circuit"
              },
              {
                "name": 877484,
                "type": "circuit"
              },
              {
                "name": 877484,
                "type": "circuit"
              },
              {
                "name": 877484,
                "type": "circuit"
              },
              {
                "name": 877484,
                "type": "circuit"
              },
              {
                "name": 877484,
                "type": "circuit"
              },
              {
                "name": 877484,
                "type": "circuit"
              }
            ]
          },
          {
            "name": "CH1:05:000430:0105",
            "type": "cabinet",
            "circuits": [
              {
                "name": 877484,
                "type": "circuit"
              },
              {
                "name": 877484,
                "type": "circuit"
              },
              {
                "name": 877484,
                "type": "circuit"
              },
              {
                "name": 877484,
                "type": "circuit"
              },
              {
                "name": 877484,
                "type": "circuit"
              },
              {
                "name": 877484,
                "type": "circuit"
              },
              {
                "name": 877484,
                "type": "circuit"
              }
            ]
          },
          {
            "name": "CH1:05:000430:0105",
            "type": "cabinet",
            "circuits": [
              {
                "name": 877484,
                "type": "circuit"
              },
              {
                "name": 877484,
                "type": "circuit"
              },
              {
                "name": 877484,
                "type": "circuit"
              },
              {
                "name": 877484,
                "type": "circuit"
              },
              {
                "name": 877484,
                "type": "circuit"
              },
              {
                "name": 877484,
                "type": "circuit"
              },
              {
                "name": 877484,
                "type": "circuit"
              },
              {
                "name": 877484,
                "type": "circuit"
              },
              {
                "name": 877484,
                "type": "circuit"
              }
            ]
          },
          {
            "name": "CH1:05:000430:0105",
            "type": "cabinet",
            "circuits": [
              {
                "name": 877484,
                "type": "circuit"
              },
              {
                "name": 877484,
                "type": "circuit"
              },
              {
                "name": 877484,
                "type": "circuit"
              },
              {
                "name": 877484,
                "type": "circuit"
              },
              {
                "name": 877484,
                "type": "circuit"
              },
              {
                "name": 877484,
                "type": "circuit"
              },
              {
                "name": 877484,
                "type": "circuit"
              },
              {
                "name": 877484,
                "type": "circuit"
              },
              {
                "name": 877484,
                "type": "circuit"
              },
              {
                "name": 877484,
                "type": "circuit"
              }
            ]
          },
          {
            "name": "CH1:05:000430:0105",
            "type": "cabinet",
            "circuits": [
              {
                "name": 877484,
                "type": "circuit"
              },
              {
                "name": 877484,
                "type": "circuit"
              },
              {
                "name": 877484,
                "type": "circuit"
              },
              {
                "name": 877484,
                "type": "circuit"
              },
              {
                "name": 877484,
                "type": "circuit"
              },
              {
                "name": 877484,
                "type": "circuit"
              },
              {
                "name": 877484,
                "type": "circuit"
              },
              {
                "name": 877484,
                "type": "circuit"
              }
            ]
          },
          {
            "name": "CH1:05:000430:0105",
            "type": "cabinet",
            "circuits": [
              {
                "name": 877484,
                "type": "circuit"
              },
              {
                "name": 877484,
                "type": "circuit"
              },
              {
                "name": 877484,
                "type": "circuit"
              },
              {
                "name": 877484,
                "type": "circuit"
              },
              {
                "name": 877484,
                "type": "circuit"
              },
              {
                "name": 877484,
                "type": "circuit"
              },
              {
                "name": 877484,
                "type": "circuit"
              },
              {
                "name": 877484,
                "type": "circuit"
              }
            ]
          }
        ]
      },
      {
        "name": "CH1:05:000430",
        "type": "cage",
        "cabinets": [
          {
            "name": "CH1:05:000430:0105",
            "type": "cabinet",
            "circuits": [
              {
                "name": 877484,
                "type": "circuit"
              }
            ]
          },
          {
            "name": "CH1:05:000430:0105",
            "type": "cabinet",
            "circuits": [
              {
                "name": 877484,
                "type": "circuit"
              },
              {
                "name": 877484,
                "type": "circuit"
              }
            ]
          },
          {
            "name": "CH1:05:000430:0105",
            "type": "cabinet",
            "circuits": [
              {
                "name": 877484,
                "type": "circuit"
              },
              {
                "name": 877484,
                "type": "circuit"
              },
              {
                "name": 877484,
                "type": "circuit"
              },
              {
                "name": 877484,
                "type": "circuit"
              },
              {
                "name": 877484,
                "type": "circuit"
              },
              {
                "name": 877484,
                "type": "circuit"
              }
            ]
          },
          {
            "name": "CH1:05:000430:0105",
            "type": "cabinet",
            "circuits": [
              {
                "name": 877484,
                "type": "circuit"
              },
              {
                "name": 877484,
                "type": "circuit"
              },
              {
                "name": 877484,
                "type": "circuit"
              },
              {
                "name": 877484,
                "type": "circuit"
              },
              {
                "name": 877484,
                "type": "circuit"
              },
              {
                "name": 877484,
                "type": "circuit"
              },
              {
                "name": 877484,
                "type": "circuit"
              },
              {
                "name": 877484,
                "type": "circuit"
              },
              {
                "name": 877484,
                "type": "circuit"
              },
              {
                "name": 877484,
                "type": "circuit"
              }
            ]
          },
          {
            "name": "CH1:05:000430:0105",
            "type": "cabinet",
            "circuits": [
              {
                "name": 877484,
                "type": "circuit"
              },
              {
                "name": 877484,
                "type": "circuit"
              }
            ]
          }
        ]
      },
      {
        "name": "CH1:05:000430",
        "type": "cage",
        "cabinets": [
          {
            "name": "CH1:05:000430:0105",
            "type": "cabinet",
            "circuits": [
              {
                "name": 877484,
                "type": "circuit"
              },
              {
                "name": 877484,
                "type": "circuit"
              },
              {
                "name": 877484,
                "type": "circuit"
              },
              {
                "name": 877484,
                "type": "circuit"
              },
              {
                "name": 877484,
                "type": "circuit"
              }
            ]
          },
          {
            "name": "CH1:05:000430:0105",
            "type": "cabinet",
            "circuits": [
              {
                "name": 877484,
                "type": "circuit"
              },
              {
                "name": 877484,
                "type": "circuit"
              }
            ]
          },
          {
            "name": "CH1:05:000430:0105",
            "type": "cabinet",
            "circuits": [
              {
                "name": 877484,
                "type": "circuit"
              },
              {
                "name": 877484,
                "type": "circuit"
              },
              {
                "name": 877484,
                "type": "circuit"
              },
              {
                "name": 877484,
                "type": "circuit"
              },
              {
                "name": 877484,
                "type": "circuit"
              },
              {
                "name": 877484,
                "type": "circuit"
              },
              {
                "name": 877484,
                "type": "circuit"
              }
            ]
          },
          {
            "name": "CH1:05:000430:0105",
            "type": "cabinet",
            "circuits": [
              {
                "name": 877484,
                "type": "circuit"
              },
              {
                "name": 877484,
                "type": "circuit"
              },
              {
                "name": 877484,
                "type": "circuit"
              },
              {
                "name": 877484,
                "type": "circuit"
              },
              {
                "name": 877484,
                "type": "circuit"
              },
              {
                "name": 877484,
                "type": "circuit"
              },
              {
                "name": 877484,
                "type": "circuit"
              },
              {
                "name": 877484,
                "type": "circuit"
              }
            ]
          },
          {
            "name": "CH1:05:000430:0105",
            "type": "cabinet",
            "circuits": [
              {
                "name": 877484,
                "type": "circuit"
              }
            ]
          },
          {
            "name": "CH1:05:000430:0105",
            "type": "cabinet",
            "circuits": [
              {
                "name": 877484,
                "type": "circuit"
              },
              {
                "name": 877484,
                "type": "circuit"
              },
              {
                "name": 877484,
                "type": "circuit"
              },
              {
                "name": 877484,
                "type": "circuit"
              },
              {
                "name": 877484,
                "type": "circuit"
              }
            ]
          },
          {
            "name": "CH1:05:000430:0105",
            "type": "cabinet",
            "circuits": [
              {
                "name": 877484,
                "type": "circuit"
              },
              {
                "name": 877484,
                "type": "circuit"
              },
              {
                "name": 877484,
                "type": "circuit"
              },
              {
                "name": 877484,
                "type": "circuit"
              }
            ]
          },
          {
            "name": "CH1:05:000430:0105",
            "type": "cabinet",
            "circuits": [
              {
                "name": 877484,
                "type": "circuit"
              },
              {
                "name": 877484,
                "type": "circuit"
              }
            ]
          }
        ]
      },
      {
        "name": "CH1:05:000430",
        "type": "cage",
        "cabinets": [
          {
            "name": "CH1:05:000430:0105",
            "type": "cabinet",
            "circuits": [
              {
                "name": 877484,
                "type": "circuit"
              },
              {
                "name": 877484,
                "type": "circuit"
              },
              {
                "name": 877484,
                "type": "circuit"
              },
              {
                "name": 877484,
                "type": "circuit"
              },
              {
                "name": 877484,
                "type": "circuit"
              },
              {
                "name": 877484,
                "type": "circuit"
              },
              {
                "name": 877484,
                "type": "circuit"
              },
              {
                "name": 877484,
                "type": "circuit"
              },
              {
                "name": 877484,
                "type": "circuit"
              }
            ]
          },
          {
            "name": "CH1:05:000430:0105",
            "type": "cabinet",
            "circuits": [
              {
                "name": 877484,
                "type": "circuit"
              },
              {
                "name": 877484,
                "type": "circuit"
              },
              {
                "name": 877484,
                "type": "circuit"
              },
              {
                "name": 877484,
                "type": "circuit"
              },
              {
                "name": 877484,
                "type": "circuit"
              },
              {
                "name": 877484,
                "type": "circuit"
              },
              {
                "name": 877484,
                "type": "circuit"
              }
            ]
          },
          {
            "name": "CH1:05:000430:0105",
            "type": "cabinet",
            "circuits": [
              {
                "name": 877484,
                "type": "circuit"
              },
              {
                "name": 877484,
                "type": "circuit"
              },
              {
                "name": 877484,
                "type": "circuit"
              },
              {
                "name": 877484,
                "type": "circuit"
              }
            ]
          },
          {
            "name": "CH1:05:000430:0105",
            "type": "cabinet",
            "circuits": [
              {
                "name": 877484,
                "type": "circuit"
              },
              {
                "name": 877484,
                "type": "circuit"
              },
              {
                "name": 877484,
                "type": "circuit"
              }
            ]
          },
          {
            "name": "CH1:05:000430:0105",
            "type": "cabinet",
            "circuits": [
              {
                "name": 877484,
                "type": "circuit"
              },
              {
                "name": 877484,
                "type": "circuit"
              },
              {
                "name": 877484,
                "type": "circuit"
              },
              {
                "name": 877484,
                "type": "circuit"
              },
              {
                "name": 877484,
                "type": "circuit"
              },
              {
                "name": 877484,
                "type": "circuit"
              },
              {
                "name": 877484,
                "type": "circuit"
              },
              {
                "name": 877484,
                "type": "circuit"
              },
              {
                "name": 877484,
                "type": "circuit"
              },
              {
                "name": 877484,
                "type": "circuit"
              }
            ]
          },
          {
            "name": "CH1:05:000430:0105",
            "type": "cabinet",
            "circuits": [
              {
                "name": 877484,
                "type": "circuit"
              },
              {
                "name": 877484,
                "type": "circuit"
              },
              {
                "name": 877484,
                "type": "circuit"
              },
              {
                "name": 877484,
                "type": "circuit"
              },
              {
                "name": 877484,
                "type": "circuit"
              },
              {
                "name": 877484,
                "type": "circuit"
              },
              {
                "name": 877484,
                "type": "circuit"
              },
              {
                "name": 877484,
                "type": "circuit"
              }
            ]
          },
          {
            "name": "CH1:05:000430:0105",
            "type": "cabinet",
            "circuits": [
              {
                "name": 877484,
                "type": "circuit"
              },
              {
                "name": 877484,
                "type": "circuit"
              },
              {
                "name": 877484,
                "type": "circuit"
              },
              {
                "name": 877484,
                "type": "circuit"
              },
              {
                "name": 877484,
                "type": "circuit"
              }
            ]
          },
          {
            "name": "CH1:05:000430:0105",
            "type": "cabinet",
            "circuits": [
              {
                "name": 877484,
                "type": "circuit"
              },
              {
                "name": 877484,
                "type": "circuit"
              },
              {
                "name": 877484,
                "type": "circuit"
              },
              {
                "name": 877484,
                "type": "circuit"
              },
              {
                "name": 877484,
                "type": "circuit"
              },
              {
                "name": 877484,
                "type": "circuit"
              },
              {
                "name": 877484,
                "type": "circuit"
              },
              {
                "name": 877484,
                "type": "circuit"
              }
            ]
          },
          {
            "name": "CH1:05:000430:0105",
            "type": "cabinet",
            "circuits": [
              {
                "name": 877484,
                "type": "circuit"
              },
              {
                "name": 877484,
                "type": "circuit"
              },
              {
                "name": 877484,
                "type": "circuit"
              },
              {
                "name": 877484,
                "type": "circuit"
              },
              {
                "name": 877484,
                "type": "circuit"
              },
              {
                "name": 877484,
                "type": "circuit"
              },
              {
                "name": 877484,
                "type": "circuit"
              },
              {
                "name": 877484,
                "type": "circuit"
              }
            ]
          }
        ]
      },
      {
        "name": "CH1:05:000430",
        "type": "cage",
        "cabinets": [
          {
            "name": "CH1:05:000430:0105",
            "type": "cabinet",
            "circuits": [
              {
                "name": 877484,
                "type": "circuit"
              },
              {
                "name": 877484,
                "type": "circuit"
              },
              {
                "name": 877484,
                "type": "circuit"
              },
              {
                "name": 877484,
                "type": "circuit"
              },
              {
                "name": 877484,
                "type": "circuit"
              },
              {
                "name": 877484,
                "type": "circuit"
              },
              {
                "name": 877484,
                "type": "circuit"
              },
              {
                "name": 877484,
                "type": "circuit"
              },
              {
                "name": 877484,
                "type": "circuit"
              },
              {
                "name": 877484,
                "type": "circuit"
              }
            ]
          },
          {
            "name": "CH1:05:000430:0105",
            "type": "cabinet",
            "circuits": [
              {
                "name": 877484,
                "type": "circuit"
              },
              {
                "name": 877484,
                "type": "circuit"
              },
              {
                "name": 877484,
                "type": "circuit"
              },
              {
                "name": 877484,
                "type": "circuit"
              },
              {
                "name": 877484,
                "type": "circuit"
              }
            ]
          },
          {
            "name": "CH1:05:000430:0105",
            "type": "cabinet",
            "circuits": [
              {
                "name": 877484,
                "type": "circuit"
              },
              {
                "name": 877484,
                "type": "circuit"
              },
              {
                "name": 877484,
                "type": "circuit"
              },
              {
                "name": 877484,
                "type": "circuit"
              },
              {
                "name": 877484,
                "type": "circuit"
              },
              {
                "name": 877484,
                "type": "circuit"
              }
            ]
          },
          {
            "name": "CH1:05:000430:0105",
            "type": "cabinet",
            "circuits": [
              {
                "name": 877484,
                "type": "circuit"
              },
              {
                "name": 877484,
                "type": "circuit"
              },
              {
                "name": 877484,
                "type": "circuit"
              },
              {
                "name": 877484,
                "type": "circuit"
              },
              {
                "name": 877484,
                "type": "circuit"
              },
              {
                "name": 877484,
                "type": "circuit"
              }
            ]
          },
          {
            "name": "CH1:05:000430:0105",
            "type": "cabinet",
            "circuits": [
              {
                "name": 877484,
                "type": "circuit"
              },
              {
                "name": 877484,
                "type": "circuit"
              },
              {
                "name": 877484,
                "type": "circuit"
              }
            ]
          },
          {
            "name": "CH1:05:000430:0105",
            "type": "cabinet",
            "circuits": [
              {
                "name": 877484,
                "type": "circuit"
              },
              {
                "name": 877484,
                "type": "circuit"
              },
              {
                "name": 877484,
                "type": "circuit"
              },
              {
                "name": 877484,
                "type": "circuit"
              },
              {
                "name": 877484,
                "type": "circuit"
              }
            ]
          },
          {
            "name": "CH1:05:000430:0105",
            "type": "cabinet",
            "circuits": [
              {
                "name": 877484,
                "type": "circuit"
              },
              {
                "name": 877484,
                "type": "circuit"
              },
              {
                "name": 877484,
                "type": "circuit"
              },
              {
                "name": 877484,
                "type": "circuit"
              },
              {
                "name": 877484,
                "type": "circuit"
              },
              {
                "name": 877484,
                "type": "circuit"
              },
              {
                "name": 877484,
                "type": "circuit"
              },
              {
                "name": 877484,
                "type": "circuit"
              }
            ]
          }
        ]
      },
      {
        "name": "CH1:05:000430",
        "type": "cage",
        "cabinets": [
          {
            "name": "CH1:05:000430:0105",
            "type": "cabinet",
            "circuits": [
              {
                "name": 877484,
                "type": "circuit"
              }
            ]
          },
          {
            "name": "CH1:05:000430:0105",
            "type": "cabinet",
            "circuits": [
              {
                "name": 877484,
                "type": "circuit"
              },
              {
                "name": 877484,
                "type": "circuit"
              },
              {
                "name": 877484,
                "type": "circuit"
              },
              {
                "name": 877484,
                "type": "circuit"
              },
              {
                "name": 877484,
                "type": "circuit"
              },
              {
                "name": 877484,
                "type": "circuit"
              },
              {
                "name": 877484,
                "type": "circuit"
              }
            ]
          }
        ]
      }
    ],
    "circuits": [
      {
        "name": 877483,
        "type": "circuit"
      },
      {
        "name": 877483,
        "type": "circuit"
      },
      {
        "name": 877483,
        "type": "circuit"
      },
      {
        "name": 877483,
        "type": "circuit"
      },
      {
        "name": 877483,
        "type": "circuit"
      },
      {
        "name": 877483,
        "type": "circuit"
      }
    ]
  },
  "status": {
    "type": "INFO",
    "statuscode": "1000",
    "msg": "OK"
  }
}