{
  "name": "New template",
  "uuid": "be7ef79e-31e7-4769-be5b-e192496f48aa",
  "description": "My description",
  "inBoundRules": [
    {
      "srcType": "DOMAIN",
      "protocol": "DNS",
      "srcPort": 53,
      "dstPort": "any",
      "fqdn": "equinix.com",
      "subets": [
        "192.168.1.1/32",
        "192.168.1.1/32",
        "192.168.1.1/32",
        "192.168.1.1/32"
      ],
      "seqNo": 1
    },
    {
      "srcType": "DOMAIN",
      "protocol": "DNS",
      "srcPort": 53,
      "dstPort": "any",
      "fqdn": "equinix.com",
      "subets": [
        "192.168.1.1/32",
        "192.168.1.1/32",
        "192.168.1.1/32",
        "192.168.1.1/32",
        "192.168.1.1/32",
        "192.168.1.1/32",
        "192.168.1.1/32",
        "192.168.1.1/32",
        "192.168.1.1/32"
      ],
      "seqNo": 1
    },
    {
      "srcType": "DOMAIN",
      "protocol": "DNS",
      "srcPort": 53,
      "dstPort": "any",
      "fqdn": "equinix.com",
      "subets": [
        "192.168.1.1/32",
        "192.168.1.1/32",
        "192.168.1.1/32"
      ],
      "seqNo": 1
    },
    {
      "srcType": "DOMAIN",
      "protocol": "DNS",
      "srcPort": 53,
      "dstPort": "any",
      "fqdn": "equinix.com",
      "subets": [
        "192.168.1.1/32",
        "192.168.1.1/32",
        "192.168.1.1/32"
      ],
      "seqNo": 1
    },
    {
      "srcType": "DOMAIN",
      "protocol": "DNS",
      "srcPort": 53,
      "dstPort": "any",
      "fqdn": "equinix.com",
      "subets": [
        "192.168.1.1/32",
        "192.168.1.1/32"
      ],
      "seqNo": 1
    },
    {
      "srcType": "DOMAIN",
      "protocol": "DNS",
      "srcPort": 53,
      "dstPort": "any",
      "fqdn": "equinix.com",
      "subets": [
        "192.168.1.1/32",
        "192.168.1.1/32",
        "192.168.1.1/32",
        "192.168.1.1/32",
        "192.168.1.1/32",
        "192.168.1.1/32"
      ],
      "seqNo": 1
    },
    {
      "srcType": "DOMAIN",
      "protocol": "DNS",
      "srcPort": 53,
      "dstPort": "any",
      "fqdn": "equinix.com",
      "subets": [
        "192.168.1.1/32",
        "192.168.1.1/32",
        "192.168.1.1/32",
        "192.168.1.1/32",
        "192.168.1.1/32",
        "192.168.1.1/32",
        "192.168.1.1/32",
        "192.168.1.1/32",
        "192.168.1.1/32",
        "192.168.1.1/32"
      ],
      "seqNo": 1
    },
    {
      "srcType": "DOMAIN",
      "protocol": "DNS",
      "srcPort": 53,
      "dstPort": "any",
      "fqdn": "equinix.com",
      "subets": [
        "192.168.1.1/32"
      ],
      "seqNo": 1
    }
  ],
  "metroCode": "SV",
  "metroName": "Silicon Valley",
  "virtualDeviceName": "Test Device",
  "virtualDeviceUuid": "ce7ef79e-31e7-4769-be5b-e192496f48ab",
  "deviceACLstatus": "PROVISIONING",
  "createdBy": "nfvsit01",
  "createdDate": "2020/10/03T19:41:17.976Z"
}