{
  "name": "string",
  "description": "string",
  "key_size": 1,
  "elliptic_curve": "Ed25519",
  "acct_id": "string",
  "group_id": "string",
  "creator": {
    "app": "string",
    "user": "string"
  },
  "kid": "string",
  "obj_type": "OPAQUE",
  "key_ops": [
    "SIGN",
    "SIGN",
    "ENCRYPT",
    "SIGN"
  ],
  "custom_metadata": {},
  "origin": "FortanixHSM",
  "pub_key": "string",
  "value": "string",
  "enabled": true,
  "compliant_with_policies": true,
  "created_at": "string",
  "lastused_at": "string",
  "transient_key": "string",
  "never_exportable": true,
  "rsa": {
    "key_size": 5,
    "public_exponent": 6,
    "encryption_policy": [
      {
        "padding": {
          "PKCS1_V15": {},
          "OAEP": {
            "mgf": {
              "mgf1": {
                "hash": "SHA3_224"
              }
            }
          }
        }
      },
      {
        "padding": {
          "PKCS1_V15": {},
          "OAEP": {
            "mgf": {
              "mgf1": {
                "hash": "Blake2s256"
              }
            }
          }
        }
      },
      {
        "padding": {
          "PKCS1_V15": {},
          "OAEP": {
            "mgf": {
              "mgf1": {
                "hash": "SHA256"
              }
            }
          }
        }
      },
      {
        "padding": {
          "PKCS1_V15": {},
          "OAEP": {
            "mgf": {
              "mgf1": {
                "hash": "SHA3_512"
              }
            }
          }
        }
      },
      {
        "padding": {
          "PKCS1_V15": {},
          "OAEP": {
            "mgf": {
              "mgf1": {
                "hash": "SHA512"
              }
            }
          }
        }
      },
      {
        "padding": {
          "PKCS1_V15": {},
          "OAEP": {
            "mgf": {
              "mgf1": {
                "hash": "Blake2b512"
              }
            }
          }
        }
      },
      {
        "padding": {
          "PKCS1_V15": {},
          "OAEP": {
            "mgf": {
              "mgf1": {
                "hash": "SHA3_224"
              }
            }
          }
        }
      },
      {
        "padding": {
          "PKCS1_V15": {},
          "OAEP": {
            "mgf": {
              "mgf1": {
                "hash": "Blake2b384"
              }
            }
          }
        }
      },
      {
        "padding": {
          "PKCS1_V15": {},
          "OAEP": {
            "mgf": {
              "mgf1": {
                "hash": "Blake2b384"
              }
            }
          }
        }
      }
    ],
    "signature_policy": [
      {
        "padding": {
          "PKCS1_V15": {},
          "PSS": {
            "mgf": {
              "mgf1": {
                "hash": "SHA512"
              }
            }
          }
        }
      },
      {
        "padding": {
          "PKCS1_V15": {},
          "PSS": {
            "mgf": {
              "mgf1": {
                "hash": "Blake2b512"
              }
            }
          }
        }
      }
    ]
  }
}