{
  "emails": [
    "sandboxuser@example-company.com",
    "sandboxuser@example-company.com",
    "sandboxuser@example-company.com",
    "sandboxuser@example-company.com",
    "sandboxuser@example-company.com"
  ],
  "portThreshold": 20
}