{
  "name": "string",
  "acct_id": "string",
  "description": "string",
  "organization": "string",
  "country": "string",
  "phone": "string",
  "notification_pref": "None",
  "auth_config": {
    "password": {
      "require_2fa": true,
      "administrators_only": false
    },
    "saml": "string",
    "signed_jwt": {
      "valid_issuers": [
        "string",
        "string",
        "string"
      ],
      "signing_keys": {
        "kind": "Stored",
        "keys": {},
        "url": "string",
        "cache_duration": 8
      }
    }
  },
  "subscription": {},
  "state": "Activated",
  "auth_type": "External",
  "logging_configs": {},
  "enabled": true,
  "created_at": "string",
  "initial_purchase_at": "string",
  "pending_subscription_change_request": {
    "subscription": {},
    "contact": "string",
    "comment": "string"
  },
  "custom_metadata": {}
}