[
  {
    "name": "string",
    "projectName": "string",
    "projectId": "string",
    "templateId": "string",
    "versionsInfo": [
      {
        "id": "string",
        "description": "string",
        "versionTime": 6
      },
      {
        "id": "string",
        "description": "string",
        "versionTime": 7
      },
      {
        "id": "string",
        "description": "string",
        "versionTime": 4
      },
      {
        "id": "string",
        "description": "string",
        "versionTime": 2
      },
      {
        "id": "string",
        "description": "string",
        "versionTime": 6
      }
    ],
    "composite": true
  },
  {
    "name": "string",
    "projectName": "string",
    "projectId": "string",
    "templateId": "string",
    "versionsInfo": [
      {
        "id": "string",
        "description": "string",
        "versionTime": 4
      },
      {
        "id": "string",
        "description": "string",
        "versionTime": 9
      },
      {
        "id": "string",
        "description": "string",
        "versionTime": 4
      },
      {
        "id": "string",
        "description": "string",
        "versionTime": 4
      },
      {
        "id": "string",
        "description": "string",
        "versionTime": 2
      },
      {
        "id": "string",
        "description": "string",
        "versionTime": 10
      },
      {
        "id": "string",
        "description": "string",
        "versionTime": 2
      },
      {
        "id": "string",
        "description": "string",
        "versionTime": 7
      },
      {
        "id": "string",
        "description": "string",
        "versionTime": 7
      }
    ],
    "composite": false
  },
  {
    "name": "string",
    "projectName": "string",
    "projectId": "string",
    "templateId": "string",
    "versionsInfo": [
      {
        "id": "string",
        "description": "string",
        "versionTime": 10
      },
      {
        "id": "string",
        "description": "string",
        "versionTime": 3
      },
      {
        "id": "string",
        "description": "string",
        "versionTime": 10
      },
      {
        "id": "string",
        "description": "string",
        "versionTime": 1
      },
      {
        "id": "string",
        "description": "string",
        "versionTime": 2
      },
      {
        "id": "string",
        "description": "string",
        "versionTime": 1
      },
      {
        "id": "string",
        "description": "string",
        "versionTime": 5
      }
    ],
    "composite": false
  },
  {
    "name": "string",
    "projectName": "string",
    "projectId": "string",
    "templateId": "string",
    "versionsInfo": [
      {
        "id": "string",
        "description": "string",
        "versionTime": 2
      }
    ],
    "composite": false
  }
]