{
  "actions": [
    {
      "name": "getDnaintentapiv1filenamespace",
      "protocol": "REST",
      "method": "GET",
      "entitypath": "{base_path}/{version}/file/namespace?{query}",
      "requestSchema": "schema.json",
      "responseSchema": "schema.json",
      "timeout": 0,
      "sendEmpty": false,
      "sendGetBody": false,
      "requestDatatype": "JSON",
      "responseDatatype": "JSON",
      "headers": {},
      "responseObjects": [
        {
          "type": "default",
          "key": "",
          "mockFile": "mockdatafiles/getDnaintentapiv1filenamespace-default.json"
        }
      ]
    },
    {
      "name": "getDnaintentapiv1filenamespacenameSpace",
      "protocol": "REST",
      "method": "GET",
      "entitypath": "{base_path}/{version}/file/namespace/{pathv1}?{query}",
      "requestSchema": "schema.json",
      "responseSchema": "schema.json",
      "timeout": 0,
      "sendEmpty": false,
      "sendGetBody": false,
      "requestDatatype": "JSON",
      "responseDatatype": "JSON",
      "headers": {},
      "responseObjects": [
        {
          "type": "default",
          "key": "",
          "mockFile": "mockdatafiles/getDnaintentapiv1filenamespacenameSpace-default.json"
        }
      ]
    },
    {
      "name": "getDnaintentapiv1filefileId",
      "protocol": "REST",
      "method": "GET",
      "entitypath": "{base_path}/{version}/file/{pathv1}?{query}",
      "requestSchema": "schema.json",
      "responseSchema": "schema.json",
      "timeout": 0,
      "sendEmpty": false,
      "sendGetBody": false,
      "requestDatatype": "JSON",
      "responseDatatype": "JSON",
      "headers": {},
      "responseObjects": [
        {
          "type": "default",
          "key": "",
          "mockFile": ""
        }
      ]
    },
    {
      "name": "uploadFile",
      "protocol": "REST",
      "method": "POST",
      "entitypath": "{base_path}/{version}/file/{pathv1}?{query}",
      "requestSchema": "schema.json",
      "responseSchema": "schema.json",
      "timeout": 0,
      "sendEmpty": false,
      "requestDatatype": "JSON",
      "responseDatatype": "JSON",
      "headers": {},
      "responseObjects": [
        {
          "type": "default",
          "key": "",
          "mockFile": ""
        }
      ]
    }
  ]
}