{
  "virtualAccountId": "string",
  "autoSyncPeriod": 9,
  "syncResultStr": "string",
  "profile": {
    "proxy": false,
    "makeDefault": true,
    "port": 3,
    "profileId": "string",
    "name": "string",
    "addressIpV4": "string",
    "cert": "string",
    "addressFqdn": "string"
  },
  "ccoUser": "string",
  "syncResult": {
    "syncList": [
      {
        "syncType": "string",
        "deviceSnList": [
          "string"
        ]
      },
      {
        "syncType": "string",
        "deviceSnList": [
          "string",
          "string",
          "string",
          "string",
          "string"
        ]
      },
      {
        "syncType": "string",
        "deviceSnList": [
          "string",
          "string",
          "string"
        ]
      },
      {
        "syncType": "string",
        "deviceSnList": [
          "string",
          "string"
        ]
      },
      {
        "syncType": "string",
        "deviceSnList": [
          "string",
          "string",
          "string",
          "string",
          "string",
          "string",
          "string",
          "string",
          "string",
          "string"
        ]
      },
      {
        "syncType": "string",
        "deviceSnList": [
          "string",
          "string",
          "string",
          "string",
          "string"
        ]
      },
      {
        "syncType": "string",
        "deviceSnList": [
          "string",
          "string",
          "string"
        ]
      },
      {
        "syncType": "string",
        "deviceSnList": [
          "string",
          "string"
        ]
      },
      {
        "syncType": "string",
        "deviceSnList": [
          "string"
        ]
      }
    ],
    "syncMsg": "string"
  },
  "token": "string",
  "syncStartTime": 4,
  "lastSync": 5,
  "tenantId": "string",
  "smartAccountId": "string",
  "expiry": 10,
  "syncStatus": "string"
}