{
  "response": {
    "id": "string",
    "links": [
      {
        "additionalInfo": {},
        "endPortID": "string",
        "endPortIpv4Address": "string",
        "endPortIpv4Mask": "string",
        "endPortName": "string",
        "endPortSpeed": "string",
        "greyOut": false,
        "id": "string",
        "linkStatus": "string",
        "source": "string",
        "startPortID": "string",
        "startPortIpv4Address": "string",
        "startPortIpv4Mask": "string",
        "startPortName": "string",
        "startPortSpeed": "string",
        "tag": "string",
        "target": "string"
      },
      {
        "additionalInfo": {},
        "endPortID": "string",
        "endPortIpv4Address": "string",
        "endPortIpv4Mask": "string",
        "endPortName": "string",
        "endPortSpeed": "string",
        "greyOut": false,
        "id": "string",
        "linkStatus": "string",
        "source": "string",
        "startPortID": "string",
        "startPortIpv4Address": "string",
        "startPortIpv4Mask": "string",
        "startPortName": "string",
        "startPortSpeed": "string",
        "tag": "string",
        "target": "string"
      },
      {
        "additionalInfo": {},
        "endPortID": "string",
        "endPortIpv4Address": "string",
        "endPortIpv4Mask": "string",
        "endPortName": "string",
        "endPortSpeed": "string",
        "greyOut": false,
        "id": "string",
        "linkStatus": "string",
        "source": "string",
        "startPortID": "string",
        "startPortIpv4Address": "string",
        "startPortIpv4Mask": "string",
        "startPortName": "string",
        "startPortSpeed": "string",
        "tag": "string",
        "target": "string"
      }
    ],
    "nodes": [
      {
        "aclApplied": true,
        "additionalInfo": {},
        "customParam": {
          "id": "string",
          "label": "string",
          "parentNodeId": "string",
          "x": 1,
          "y": 2
        },
        "dataPathId": "string",
        "deviceType": "string",
        "family": "string",
        "fixed": false,
        "greyOut": true,
        "id": "string",
        "ip": "string",
        "label": "string",
        "networkType": "string",
        "nodeType": "string",
        "order": 9,
        "osType": "string",
        "platformId": "string",
        "role": "string",
        "roleSource": "string",
        "softwareVersion": "string",
        "tags": [
          "string",
          "string",
          "string",
          "string",
          "string",
          "string",
          "string",
          "string",
          "string",
          "string"
        ],
        "upperNode": "string",
        "userId": "string",
        "vlanId": "string",
        "x": 7,
        "y": 5
      },
      {
        "aclApplied": false,
        "additionalInfo": {},
        "customParam": {
          "id": "string",
          "label": "string",
          "parentNodeId": "string",
          "x": 2,
          "y": 4
        },
        "dataPathId": "string",
        "deviceType": "string",
        "family": "string",
        "fixed": false,
        "greyOut": true,
        "id": "string",
        "ip": "string",
        "label": "string",
        "networkType": "string",
        "nodeType": "string",
        "order": 10,
        "osType": "string",
        "platformId": "string",
        "role": "string",
        "roleSource": "string",
        "softwareVersion": "string",
        "tags": [
          "string",
          "string",
          "string",
          "string",
          "string",
          "string"
        ],
        "upperNode": "string",
        "userId": "string",
        "vlanId": "string",
        "x": 5,
        "y": 7
      },
      {
        "aclApplied": false,
        "additionalInfo": {},
        "customParam": {
          "id": "string",
          "label": "string",
          "parentNodeId": "string",
          "x": 3,
          "y": 1
        },
        "dataPathId": "string",
        "deviceType": "string",
        "family": "string",
        "fixed": true,
        "greyOut": false,
        "id": "string",
        "ip": "string",
        "label": "string",
        "networkType": "string",
        "nodeType": "string",
        "order": 6,
        "osType": "string",
        "platformId": "string",
        "role": "string",
        "roleSource": "string",
        "softwareVersion": "string",
        "tags": [
          "string",
          "string",
          "string",
          "string",
          "string",
          "string",
          "string",
          "string",
          "string"
        ],
        "upperNode": "string",
        "userId": "string",
        "vlanId": "string",
        "x": 7,
        "y": 3
      },
      {
        "aclApplied": false,
        "additionalInfo": {},
        "customParam": {
          "id": "string",
          "label": "string",
          "parentNodeId": "string",
          "x": 4,
          "y": 6
        },
        "dataPathId": "string",
        "deviceType": "string",
        "family": "string",
        "fixed": true,
        "greyOut": true,
        "id": "string",
        "ip": "string",
        "label": "string",
        "networkType": "string",
        "nodeType": "string",
        "order": 9,
        "osType": "string",
        "platformId": "string",
        "role": "string",
        "roleSource": "string",
        "softwareVersion": "string",
        "tags": [
          "string"
        ],
        "upperNode": "string",
        "userId": "string",
        "vlanId": "string",
        "x": 7,
        "y": 3
      },
      {
        "aclApplied": false,
        "additionalInfo": {},
        "customParam": {
          "id": "string",
          "label": "string",
          "parentNodeId": "string",
          "x": 8,
          "y": 6
        },
        "dataPathId": "string",
        "deviceType": "string",
        "family": "string",
        "fixed": true,
        "greyOut": true,
        "id": "string",
        "ip": "string",
        "label": "string",
        "networkType": "string",
        "nodeType": "string",
        "order": 1,
        "osType": "string",
        "platformId": "string",
        "role": "string",
        "roleSource": "string",
        "softwareVersion": "string",
        "tags": [
          "string",
          "string",
          "string",
          "string",
          "string",
          "string"
        ],
        "upperNode": "string",
        "userId": "string",
        "vlanId": "string",
        "x": 8,
        "y": 10
      },
      {
        "aclApplied": false,
        "additionalInfo": {},
        "customParam": {
          "id": "string",
          "label": "string",
          "parentNodeId": "string",
          "x": 9,
          "y": 7
        },
        "dataPathId": "string",
        "deviceType": "string",
        "family": "string",
        "fixed": true,
        "greyOut": true,
        "id": "string",
        "ip": "string",
        "label": "string",
        "networkType": "string",
        "nodeType": "string",
        "order": 9,
        "osType": "string",
        "platformId": "string",
        "role": "string",
        "roleSource": "string",
        "softwareVersion": "string",
        "tags": [
          "string",
          "string"
        ],
        "upperNode": "string",
        "userId": "string",
        "vlanId": "string",
        "x": 2,
        "y": 9
      },
      {
        "aclApplied": true,
        "additionalInfo": {},
        "customParam": {
          "id": "string",
          "label": "string",
          "parentNodeId": "string",
          "x": 8,
          "y": 1
        },
        "dataPathId": "string",
        "deviceType": "string",
        "family": "string",
        "fixed": false,
        "greyOut": true,
        "id": "string",
        "ip": "string",
        "label": "string",
        "networkType": "string",
        "nodeType": "string",
        "order": 8,
        "osType": "string",
        "platformId": "string",
        "role": "string",
        "roleSource": "string",
        "softwareVersion": "string",
        "tags": [
          "string",
          "string"
        ],
        "upperNode": "string",
        "userId": "string",
        "vlanId": "string",
        "x": 3,
        "y": 8
      },
      {
        "aclApplied": false,
        "additionalInfo": {},
        "customParam": {
          "id": "string",
          "label": "string",
          "parentNodeId": "string",
          "x": 1,
          "y": 3
        },
        "dataPathId": "string",
        "deviceType": "string",
        "family": "string",
        "fixed": false,
        "greyOut": false,
        "id": "string",
        "ip": "string",
        "label": "string",
        "networkType": "string",
        "nodeType": "string",
        "order": 7,
        "osType": "string",
        "platformId": "string",
        "role": "string",
        "roleSource": "string",
        "softwareVersion": "string",
        "tags": [
          "string",
          "string",
          "string",
          "string",
          "string"
        ],
        "upperNode": "string",
        "userId": "string",
        "vlanId": "string",
        "x": 3,
        "y": 1
      }
    ]
  },
  "version": "string"
}