{
  "response": {
    "attributeInfo": {},
    "cdpLevel": 9,
    "deviceIds": "string",
    "discoveryCondition": "string",
    "discoveryStatus": "string",
    "discoveryType": "string",
    "enablePasswordList": "string",
    "globalCredentialIdList": [
      "string",
      "string",
      "string",
      "string",
      "string",
      "string",
      "string"
    ],
    "httpReadCredential": {
      "comments": "string",
      "credentialType": "APP",
      "description": "string",
      "id": "string",
      "instanceTenantId": "string",
      "instanceUuid": "string",
      "password": "string",
      "port": 6,
      "secure": false,
      "username": "string"
    },
    "httpWriteCredential": {
      "comments": "string",
      "credentialType": "GLOBAL",
      "description": "string",
      "id": "string",
      "instanceTenantId": "string",
      "instanceUuid": "string",
      "password": "string",
      "port": 1,
      "secure": false,
      "username": "string"
    },
    "id": "string",
    "ipAddressList": "string",
    "ipFilterList": "string",
    "isAutoCdp": true,
    "lldpLevel": 5,
    "name": "string",
    "netconfPort": "string",
    "numDevices": 6,
    "parentDiscoveryId": "string",
    "passwordList": "string",
    "preferredMgmtIPMethod": "string",
    "protocolOrder": "string",
    "retryCount": 3,
    "snmpAuthPassphrase": "string",
    "snmpAuthProtocol": "string",
    "snmpMode": "string",
    "snmpPrivPassphrase": "string",
    "snmpPrivProtocol": "string",
    "snmpRoCommunity": "string",
    "snmpRoCommunityDesc": "string",
    "snmpRwCommunity": "string",
    "snmpRwCommunityDesc": "string",
    "snmpUserName": "string",
    "timeOut": 4,
    "updateMgmtIp": false,
    "userNameList": "string"
  },
  "version": "string"
}