{
  "response": {
    "sites": [
      {
        "displayName": "string",
        "groupNameHierarchy": "string",
        "id": "string",
        "latitude": "string",
        "locationAddress": "string",
        "locationCountry": "string",
        "locationType": "string",
        "longitude": "string",
        "name": "string",
        "parentId": "string"
      },
      {
        "displayName": "string",
        "groupNameHierarchy": "string",
        "id": "string",
        "latitude": "string",
        "locationAddress": "string",
        "locationCountry": "string",
        "locationType": "string",
        "longitude": "string",
        "name": "string",
        "parentId": "string"
      },
      {
        "displayName": "string",
        "groupNameHierarchy": "string",
        "id": "string",
        "latitude": "string",
        "locationAddress": "string",
        "locationCountry": "string",
        "locationType": "string",
        "longitude": "string",
        "name": "string",
        "parentId": "string"
      }
    ]
  },
  "version": "string"
}