{
  "response": [
    {
      "adminStatus": "string",
      "className": "string",
      "description": "string",
      "deviceId": "string",
      "duplex": "string",
      "id": "string",
      "ifIndex": "string",
      "instanceTenantId": "string",
      "instanceUuid": "string",
      "interfaceType": "string",
      "ipv4Address": "string",
      "ipv4Mask": "string",
      "isisSupport": "string",
      "lastUpdated": "string",
      "macAddress": "string",
      "mappedPhysicalInterfaceId": "string",
      "mappedPhysicalInterfaceName": "string",
      "mediaType": "string",
      "nativeVlanId": "string",
      "ospfSupport": "string",
      "pid": "string",
      "portMode": "string",
      "portName": "string",
      "portType": "string",
      "serialNo": "string",
      "series": "string",
      "speed": "string",
      "status": "string",
      "vlanId": "string",
      "voiceVlan": "string"
    },
    {
      "adminStatus": "string",
      "className": "string",
      "description": "string",
      "deviceId": "string",
      "duplex": "string",
      "id": "string",
      "ifIndex": "string",
      "instanceTenantId": "string",
      "instanceUuid": "string",
      "interfaceType": "string",
      "ipv4Address": "string",
      "ipv4Mask": "string",
      "isisSupport": "string",
      "lastUpdated": "string",
      "macAddress": "string",
      "mappedPhysicalInterfaceId": "string",
      "mappedPhysicalInterfaceName": "string",
      "mediaType": "string",
      "nativeVlanId": "string",
      "ospfSupport": "string",
      "pid": "string",
      "portMode": "string",
      "portName": "string",
      "portType": "string",
      "serialNo": "string",
      "series": "string",
      "speed": "string",
      "status": "string",
      "vlanId": "string",
      "voiceVlan": "string"
    },
    {
      "adminStatus": "string",
      "className": "string",
      "description": "string",
      "deviceId": "string",
      "duplex": "string",
      "id": "string",
      "ifIndex": "string",
      "instanceTenantId": "string",
      "instanceUuid": "string",
      "interfaceType": "string",
      "ipv4Address": "string",
      "ipv4Mask": "string",
      "isisSupport": "string",
      "lastUpdated": "string",
      "macAddress": "string",
      "mappedPhysicalInterfaceId": "string",
      "mappedPhysicalInterfaceName": "string",
      "mediaType": "string",
      "nativeVlanId": "string",
      "ospfSupport": "string",
      "pid": "string",
      "portMode": "string",
      "portName": "string",
      "portType": "string",
      "serialNo": "string",
      "series": "string",
      "speed": "string",
      "status": "string",
      "vlanId": "string",
      "voiceVlan": "string"
    },
    {
      "adminStatus": "string",
      "className": "string",
      "description": "string",
      "deviceId": "string",
      "duplex": "string",
      "id": "string",
      "ifIndex": "string",
      "instanceTenantId": "string",
      "instanceUuid": "string",
      "interfaceType": "string",
      "ipv4Address": "string",
      "ipv4Mask": "string",
      "isisSupport": "string",
      "lastUpdated": "string",
      "macAddress": "string",
      "mappedPhysicalInterfaceId": "string",
      "mappedPhysicalInterfaceName": "string",
      "mediaType": "string",
      "nativeVlanId": "string",
      "ospfSupport": "string",
      "pid": "string",
      "portMode": "string",
      "portName": "string",
      "portType": "string",
      "serialNo": "string",
      "series": "string",
      "speed": "string",
      "status": "string",
      "vlanId": "string",
      "voiceVlan": "string"
    },
    {
      "adminStatus": "string",
      "className": "string",
      "description": "string",
      "deviceId": "string",
      "duplex": "string",
      "id": "string",
      "ifIndex": "string",
      "instanceTenantId": "string",
      "instanceUuid": "string",
      "interfaceType": "string",
      "ipv4Address": "string",
      "ipv4Mask": "string",
      "isisSupport": "string",
      "lastUpdated": "string",
      "macAddress": "string",
      "mappedPhysicalInterfaceId": "string",
      "mappedPhysicalInterfaceName": "string",
      "mediaType": "string",
      "nativeVlanId": "string",
      "ospfSupport": "string",
      "pid": "string",
      "portMode": "string",
      "portName": "string",
      "portType": "string",
      "serialNo": "string",
      "series": "string",
      "speed": "string",
      "status": "string",
      "vlanId": "string",
      "voiceVlan": "string"
    },
    {
      "adminStatus": "string",
      "className": "string",
      "description": "string",
      "deviceId": "string",
      "duplex": "string",
      "id": "string",
      "ifIndex": "string",
      "instanceTenantId": "string",
      "instanceUuid": "string",
      "interfaceType": "string",
      "ipv4Address": "string",
      "ipv4Mask": "string",
      "isisSupport": "string",
      "lastUpdated": "string",
      "macAddress": "string",
      "mappedPhysicalInterfaceId": "string",
      "mappedPhysicalInterfaceName": "string",
      "mediaType": "string",
      "nativeVlanId": "string",
      "ospfSupport": "string",
      "pid": "string",
      "portMode": "string",
      "portName": "string",
      "portType": "string",
      "serialNo": "string",
      "series": "string",
      "speed": "string",
      "status": "string",
      "vlanId": "string",
      "voiceVlan": "string"
    }
  ],
  "version": "string"
}