{
  "response": [
    {
      "additionalStatusURL": "string",
      "data": "string",
      "endTime": "string",
      "errorCode": "string",
      "errorKey": "string",
      "failureReason": "string",
      "id": "string",
      "instanceTenantId": "string",
      "isError": false,
      "lastUpdate": "string",
      "operationIdList": {},
      "parentId": "string",
      "progress": "string",
      "rootId": "string",
      "serviceType": "string",
      "startTime": "string",
      "username": "string",
      "version": 1
    },
    {
      "additionalStatusURL": "string",
      "data": "string",
      "endTime": "string",
      "errorCode": "string",
      "errorKey": "string",
      "failureReason": "string",
      "id": "string",
      "instanceTenantId": "string",
      "isError": false,
      "lastUpdate": "string",
      "operationIdList": {},
      "parentId": "string",
      "progress": "string",
      "rootId": "string",
      "serviceType": "string",
      "startTime": "string",
      "username": "string",
      "version": 3
    },
    {
      "additionalStatusURL": "string",
      "data": "string",
      "endTime": "string",
      "errorCode": "string",
      "errorKey": "string",
      "failureReason": "string",
      "id": "string",
      "instanceTenantId": "string",
      "isError": true,
      "lastUpdate": "string",
      "operationIdList": {},
      "parentId": "string",
      "progress": "string",
      "rootId": "string",
      "serviceType": "string",
      "startTime": "string",
      "username": "string",
      "version": 2
    },
    {
      "additionalStatusURL": "string",
      "data": "string",
      "endTime": "string",
      "errorCode": "string",
      "errorKey": "string",
      "failureReason": "string",
      "id": "string",
      "instanceTenantId": "string",
      "isError": true,
      "lastUpdate": "string",
      "operationIdList": {},
      "parentId": "string",
      "progress": "string",
      "rootId": "string",
      "serviceType": "string",
      "startTime": "string",
      "username": "string",
      "version": 10
    },
    {
      "additionalStatusURL": "string",
      "data": "string",
      "endTime": "string",
      "errorCode": "string",
      "errorKey": "string",
      "failureReason": "string",
      "id": "string",
      "instanceTenantId": "string",
      "isError": true,
      "lastUpdate": "string",
      "operationIdList": {},
      "parentId": "string",
      "progress": "string",
      "rootId": "string",
      "serviceType": "string",
      "startTime": "string",
      "username": "string",
      "version": 5
    },
    {
      "additionalStatusURL": "string",
      "data": "string",
      "endTime": "string",
      "errorCode": "string",
      "errorKey": "string",
      "failureReason": "string",
      "id": "string",
      "instanceTenantId": "string",
      "isError": false,
      "lastUpdate": "string",
      "operationIdList": {},
      "parentId": "string",
      "progress": "string",
      "rootId": "string",
      "serviceType": "string",
      "startTime": "string",
      "username": "string",
      "version": 10
    }
  ],
  "version": "string"
}