{
  "version": "string",
  "response": [
    {
      "systemTag": true,
      "description": "string",
      "dynamicRules": [
        {
          "memberType": "string",
          "rules": {
            "values": [
              "string",
              "string",
              "string",
              "string",
              "string",
              "string",
              "string",
              "string",
              "string",
              "string"
            ],
            "items": [
              "string",
              "string",
              "string",
              "string",
              "string",
              "string",
              "string",
              "string"
            ],
            "operation": "string",
            "name": "string",
            "value": "string"
          }
        },
        {
          "memberType": "string",
          "rules": {
            "values": [
              "string"
            ],
            "items": [
              "string",
              "string",
              "string",
              "string",
              "string",
              "string",
              "string",
              "string"
            ],
            "operation": "string",
            "name": "string",
            "value": "string"
          }
        }
      ],
      "name": "string",
      "id": "string",
      "instanceTenantId": "string"
    }
  ]
}