{
  "name": "adapter-dna_center",
  "webName": "Adapter for Integration to Cisco DNA Center",
  "supportLevel": "community",
  "vendor": "Cisco Systems",
  "product": "DNA Center",
  "techAlliance": false,
  "osVersion": [],
  "apiVersions": [],
  "iapVersions": [
    "2021.1.x",
    "2021.2.x",
    "2022.1.x",
    "2023.1.x"
  ],
  "method": "REST",
  "type": "Adapter",
  "domains": [
    "Data Center",
    "Network Services"
  ],
  "tags": [
    "Configuration & Compliance",
    "Network Infrastructure Changes",
    "Software Upgrades & Device Maintenance"
  ],
  "useCases": [
    "Device Onboarding",
    "Router configuration backup or restore",
    "Run network compliance checks and remediation",
    "Determine configuration drift",
    "Golden Configuration",
    "Port/VLAN Configuration",
    "EVPN & VXLAN",
    "Port Turn-up",
    "Assign Network & IP",
    "Cloud Managed Networks",
    "Software Upgrade"
  ],
  "deprecated": {
    "isDeprecated": false
  },
  "brokerSince": "",
  "authMethods": [
    {
      "type": "Token",
      "primary": true
    }
  ],
  "documentation": {
    "storeLink": "",
    "npmLink": "https://www.npmjs.com/package/@itentialopensource/adapter-dna_center",
    "repoLink": "https://gitlab.com/itentialopensource/adapters/adapter-dna_center",
    "docLink": "https://gitlab.com/itentialopensource/adapters/adapter-dna_center/-/blob/master/README.md?ref_type=heads",
    "demoLinks": [
      {
        "title": "Itential Expands Multi-Domain Automation Capabilities with Latest integrations Across Cisco Powered SD-WAN, Cloud, and Data Center Networks",
        "link": "https://www.itential.com/news/itential-expands-multi-domain-automation-capabilities-with-latest-integrations-across-cisco-powered-sd-wan-cloud-and-data-center-networks/"
      }
    ],
    "trainingLinks": [
      {
        "title": "Itential Academy",
        "link": "https://www.itential.com/itential-academy/"
      }
    ],
    "faqLink": "https://docs.itential.com/opensource/docs/troubleshooting-an-adapter",
    "contributeLink": "https://gitlab.com/itentialopensource/adapters/contributing-guide",
    "issueLink": "https://itential.atlassian.net/servicedesk/customer/portals",
    "webLink": "https://www.itential.com/adapters/cisco-dna/",
    "vendorLink": "https://www.cisco.com/",
    "productLink": "https://www.cisco.com/site/id/en/products/networking/dna-center-platform/index.html",
    "apiLinks": [
      {
        "title": "Cisco Systems - DNA Center API",
        "link": "https://developer.cisco.com/docs/dna-center/#!api-quick-start/cisco-dna-center-platform-api-overview",
        "public": true
      }
    ],
    "workshopLinks": [],
    "workshopHomePage": "https://www.itential.com/get-started/"
  },
  "assets": [],
  "relatedItems": {
    "adapters": [],
    "integrations": [],
    "ecosystemApplications": [],
    "workflowProjects": [],
    "transformationProjects": [],
    "exampleProjects": []
  }
}