{
  "author": "string",
  "composite": false,
  "containingTemplates": [
    {
      "composite": false,
      "id": "string",
      "name": "string",
      "version": "string"
    },
    {
      "composite": true,
      "id": "string",
      "name": "string",
      "version": "string"
    },
    {
      "composite": false,
      "id": "string",
      "name": "string",
      "version": "string"
    },
    {
      "composite": false,
      "id": "string",
      "name": "string",
      "version": "string"
    }
  ],
  "createTime": 5,
  "description": "string",
  "deviceTypes": [
    {
      "productFamily": "string",
      "productSeries": "string",
      "productType": "string"
    },
    {
      "productFamily": "string",
      "productSeries": "string",
      "productType": "string"
    },
    {
      "productFamily": "string",
      "productSeries": "string",
      "productType": "string"
    },
    {
      "productFamily": "string",
      "productSeries": "string",
      "productType": "string"
    },
    {
      "productFamily": "string",
      "productSeries": "string",
      "productType": "string"
    },
    {
      "productFamily": "string",
      "productSeries": "string",
      "productType": "string"
    },
    {
      "productFamily": "string",
      "productSeries": "string",
      "productType": "string"
    },
    {
      "productFamily": "string",
      "productSeries": "string",
      "productType": "string"
    },
    {
      "productFamily": "string",
      "productSeries": "string",
      "productType": "string"
    },
    {
      "productFamily": "string",
      "productSeries": "string",
      "productType": "string"
    }
  ],
  "failurePolicy": "ROLLBACK_TARGET_ON_ERROR",
  "id": "string",
  "lastUpdateTime": 3,
  "name": "string",
  "parentTemplateId": "string",
  "projectId": "string",
  "projectName": "string",
  "rollbackTemplateContent": "string",
  "rollbackTemplateParams": [
    {
      "binding": "string",
      "dataType": "IPADDRESS",
      "defaultValue": "string",
      "description": "string",
      "displayName": "string",
      "group": "string",
      "id": "string",
      "instructionText": "string",
      "key": "string",
      "notParam": false,
      "order": 6,
      "paramArray": false,
      "parameterName": "string",
      "provider": "string",
      "range": [
        {
          "id": "string",
          "maxValue": 9,
          "minValue": 3
        },
        {
          "id": "string",
          "maxValue": 10,
          "minValue": 10
        },
        {
          "id": "string",
          "maxValue": 6,
          "minValue": 1
        }
      ],
      "required": true,
      "selection": {
        "id": "string",
        "selectionType": "SINGLE_SELECT",
        "selectionValues": {}
      }
    },
    {
      "binding": "string",
      "dataType": "INTEGER",
      "defaultValue": "string",
      "description": "string",
      "displayName": "string",
      "group": "string",
      "id": "string",
      "instructionText": "string",
      "key": "string",
      "notParam": true,
      "order": 6,
      "paramArray": true,
      "parameterName": "string",
      "provider": "string",
      "range": [
        {
          "id": "string",
          "maxValue": 3,
          "minValue": 2
        }
      ],
      "required": true,
      "selection": {
        "id": "string",
        "selectionType": "SINGLE_SELECT",
        "selectionValues": {}
      }
    },
    {
      "binding": "string",
      "dataType": "IPADDRESS",
      "defaultValue": "string",
      "description": "string",
      "displayName": "string",
      "group": "string",
      "id": "string",
      "instructionText": "string",
      "key": "string",
      "notParam": true,
      "order": 5,
      "paramArray": true,
      "parameterName": "string",
      "provider": "string",
      "range": [
        {
          "id": "string",
          "maxValue": 4,
          "minValue": 9
        },
        {
          "id": "string",
          "maxValue": 5,
          "minValue": 4
        },
        {
          "id": "string",
          "maxValue": 9,
          "minValue": 4
        }
      ],
      "required": true,
      "selection": {
        "id": "string",
        "selectionType": "MULTI_SELECT",
        "selectionValues": {}
      }
    },
    {
      "binding": "string",
      "dataType": "IPADDRESS",
      "defaultValue": "string",
      "description": "string",
      "displayName": "string",
      "group": "string",
      "id": "string",
      "instructionText": "string",
      "key": "string",
      "notParam": true,
      "order": 3,
      "paramArray": false,
      "parameterName": "string",
      "provider": "string",
      "range": [
        {
          "id": "string",
          "maxValue": 7,
          "minValue": 1
        },
        {
          "id": "string",
          "maxValue": 4,
          "minValue": 5
        },
        {
          "id": "string",
          "maxValue": 1,
          "minValue": 10
        }
      ],
      "required": false,
      "selection": {
        "id": "string",
        "selectionType": "SINGLE_SELECT",
        "selectionValues": {}
      }
    },
    {
      "binding": "string",
      "dataType": "IPADDRESS",
      "defaultValue": "string",
      "description": "string",
      "displayName": "string",
      "group": "string",
      "id": "string",
      "instructionText": "string",
      "key": "string",
      "notParam": true,
      "order": 1,
      "paramArray": true,
      "parameterName": "string",
      "provider": "string",
      "range": [
        {
          "id": "string",
          "maxValue": 10,
          "minValue": 9
        }
      ],
      "required": true,
      "selection": {
        "id": "string",
        "selectionType": "SINGLE_SELECT",
        "selectionValues": {}
      }
    },
    {
      "binding": "string",
      "dataType": "STRING",
      "defaultValue": "string",
      "description": "string",
      "displayName": "string",
      "group": "string",
      "id": "string",
      "instructionText": "string",
      "key": "string",
      "notParam": false,
      "order": 5,
      "paramArray": true,
      "parameterName": "string",
      "provider": "string",
      "range": [
        {
          "id": "string",
          "maxValue": 3,
          "minValue": 3
        },
        {
          "id": "string",
          "maxValue": 2,
          "minValue": 1
        },
        {
          "id": "string",
          "maxValue": 3,
          "minValue": 3
        },
        {
          "id": "string",
          "maxValue": 10,
          "minValue": 3
        },
        {
          "id": "string",
          "maxValue": 9,
          "minValue": 10
        },
        {
          "id": "string",
          "maxValue": 10,
          "minValue": 9
        },
        {
          "id": "string",
          "maxValue": 4,
          "minValue": 6
        },
        {
          "id": "string",
          "maxValue": 8,
          "minValue": 6
        }
      ],
      "required": false,
      "selection": {
        "id": "string",
        "selectionType": "MULTI_SELECT",
        "selectionValues": {}
      }
    },
    {
      "binding": "string",
      "dataType": "SECTIONDIVIDER",
      "defaultValue": "string",
      "description": "string",
      "displayName": "string",
      "group": "string",
      "id": "string",
      "instructionText": "string",
      "key": "string",
      "notParam": false,
      "order": 1,
      "paramArray": true,
      "parameterName": "string",
      "provider": "string",
      "range": [
        {
          "id": "string",
          "maxValue": 5,
          "minValue": 2
        },
        {
          "id": "string",
          "maxValue": 2,
          "minValue": 2
        },
        {
          "id": "string",
          "maxValue": 8,
          "minValue": 10
        },
        {
          "id": "string",
          "maxValue": 8,
          "minValue": 9
        },
        {
          "id": "string",
          "maxValue": 5,
          "minValue": 4
        },
        {
          "id": "string",
          "maxValue": 9,
          "minValue": 8
        },
        {
          "id": "string",
          "maxValue": 7,
          "minValue": 7
        },
        {
          "id": "string",
          "maxValue": 7,
          "minValue": 3
        }
      ],
      "required": false,
      "selection": {
        "id": "string",
        "selectionType": "MULTI_SELECT",
        "selectionValues": {}
      }
    },
    {
      "binding": "string",
      "dataType": "IPADDRESS",
      "defaultValue": "string",
      "description": "string",
      "displayName": "string",
      "group": "string",
      "id": "string",
      "instructionText": "string",
      "key": "string",
      "notParam": true,
      "order": 3,
      "paramArray": true,
      "parameterName": "string",
      "provider": "string",
      "range": [
        {
          "id": "string",
          "maxValue": 9,
          "minValue": 4
        },
        {
          "id": "string",
          "maxValue": 1,
          "minValue": 5
        },
        {
          "id": "string",
          "maxValue": 6,
          "minValue": 3
        },
        {
          "id": "string",
          "maxValue": 1,
          "minValue": 3
        },
        {
          "id": "string",
          "maxValue": 3,
          "minValue": 8
        },
        {
          "id": "string",
          "maxValue": 5,
          "minValue": 10
        },
        {
          "id": "string",
          "maxValue": 9,
          "minValue": 3
        }
      ],
      "required": false,
      "selection": {
        "id": "string",
        "selectionType": "SINGLE_SELECT",
        "selectionValues": {}
      }
    }
  ],
  "softwareType": "string",
  "softwareVariant": "string",
  "softwareVersion": "string",
  "tags": [
    "string",
    "string",
    "string",
    "string",
    "string",
    "string",
    "string",
    "string",
    "string"
  ],
  "templateContent": "string",
  "templateParams": [
    {
      "binding": "string",
      "dataType": "MACADDRESS",
      "defaultValue": "string",
      "description": "string",
      "displayName": "string",
      "group": "string",
      "id": "string",
      "instructionText": "string",
      "key": "string",
      "notParam": false,
      "order": 10,
      "paramArray": true,
      "parameterName": "string",
      "provider": "string",
      "range": [
        {
          "id": "string",
          "maxValue": 8,
          "minValue": 4
        }
      ],
      "required": false,
      "selection": {
        "id": "string",
        "selectionType": "SINGLE_SELECT",
        "selectionValues": {}
      }
    },
    {
      "binding": "string",
      "dataType": "SECTIONDIVIDER",
      "defaultValue": "string",
      "description": "string",
      "displayName": "string",
      "group": "string",
      "id": "string",
      "instructionText": "string",
      "key": "string",
      "notParam": true,
      "order": 10,
      "paramArray": false,
      "parameterName": "string",
      "provider": "string",
      "range": [
        {
          "id": "string",
          "maxValue": 8,
          "minValue": 9
        },
        {
          "id": "string",
          "maxValue": 9,
          "minValue": 2
        },
        {
          "id": "string",
          "maxValue": 6,
          "minValue": 3
        },
        {
          "id": "string",
          "maxValue": 5,
          "minValue": 8
        },
        {
          "id": "string",
          "maxValue": 5,
          "minValue": 6
        }
      ],
      "required": false,
      "selection": {
        "id": "string",
        "selectionType": "MULTI_SELECT",
        "selectionValues": {}
      }
    },
    {
      "binding": "string",
      "dataType": "SECTIONDIVIDER",
      "defaultValue": "string",
      "description": "string",
      "displayName": "string",
      "group": "string",
      "id": "string",
      "instructionText": "string",
      "key": "string",
      "notParam": true,
      "order": 5,
      "paramArray": true,
      "parameterName": "string",
      "provider": "string",
      "range": [
        {
          "id": "string",
          "maxValue": 1,
          "minValue": 6
        },
        {
          "id": "string",
          "maxValue": 3,
          "minValue": 6
        },
        {
          "id": "string",
          "maxValue": 2,
          "minValue": 3
        },
        {
          "id": "string",
          "maxValue": 8,
          "minValue": 7
        },
        {
          "id": "string",
          "maxValue": 9,
          "minValue": 7
        },
        {
          "id": "string",
          "maxValue": 6,
          "minValue": 6
        },
        {
          "id": "string",
          "maxValue": 9,
          "minValue": 7
        },
        {
          "id": "string",
          "maxValue": 6,
          "minValue": 6
        },
        {
          "id": "string",
          "maxValue": 3,
          "minValue": 9
        },
        {
          "id": "string",
          "maxValue": 9,
          "minValue": 1
        }
      ],
      "required": true,
      "selection": {
        "id": "string",
        "selectionType": "SINGLE_SELECT",
        "selectionValues": {}
      }
    },
    {
      "binding": "string",
      "dataType": "STRING",
      "defaultValue": "string",
      "description": "string",
      "displayName": "string",
      "group": "string",
      "id": "string",
      "instructionText": "string",
      "key": "string",
      "notParam": false,
      "order": 10,
      "paramArray": true,
      "parameterName": "string",
      "provider": "string",
      "range": [
        {
          "id": "string",
          "maxValue": 4,
          "minValue": 8
        },
        {
          "id": "string",
          "maxValue": 5,
          "minValue": 8
        },
        {
          "id": "string",
          "maxValue": 3,
          "minValue": 6
        },
        {
          "id": "string",
          "maxValue": 5,
          "minValue": 2
        },
        {
          "id": "string",
          "maxValue": 5,
          "minValue": 4
        },
        {
          "id": "string",
          "maxValue": 7,
          "minValue": 5
        },
        {
          "id": "string",
          "maxValue": 9,
          "minValue": 7
        },
        {
          "id": "string",
          "maxValue": 8,
          "minValue": 3
        },
        {
          "id": "string",
          "maxValue": 3,
          "minValue": 7
        }
      ],
      "required": true,
      "selection": {
        "id": "string",
        "selectionType": "MULTI_SELECT",
        "selectionValues": {}
      }
    },
    {
      "binding": "string",
      "dataType": "IPADDRESS",
      "defaultValue": "string",
      "description": "string",
      "displayName": "string",
      "group": "string",
      "id": "string",
      "instructionText": "string",
      "key": "string",
      "notParam": false,
      "order": 1,
      "paramArray": false,
      "parameterName": "string",
      "provider": "string",
      "range": [
        {
          "id": "string",
          "maxValue": 3,
          "minValue": 4
        },
        {
          "id": "string",
          "maxValue": 2,
          "minValue": 9
        },
        {
          "id": "string",
          "maxValue": 7,
          "minValue": 9
        },
        {
          "id": "string",
          "maxValue": 8,
          "minValue": 9
        }
      ],
      "required": false,
      "selection": {
        "id": "string",
        "selectionType": "MULTI_SELECT",
        "selectionValues": {}
      }
    },
    {
      "binding": "string",
      "dataType": "SECTIONDIVIDER",
      "defaultValue": "string",
      "description": "string",
      "displayName": "string",
      "group": "string",
      "id": "string",
      "instructionText": "string",
      "key": "string",
      "notParam": true,
      "order": 8,
      "paramArray": true,
      "parameterName": "string",
      "provider": "string",
      "range": [
        {
          "id": "string",
          "maxValue": 6,
          "minValue": 3
        },
        {
          "id": "string",
          "maxValue": 4,
          "minValue": 5
        }
      ],
      "required": true,
      "selection": {
        "id": "string",
        "selectionType": "MULTI_SELECT",
        "selectionValues": {}
      }
    },
    {
      "binding": "string",
      "dataType": "IPADDRESS",
      "defaultValue": "string",
      "description": "string",
      "displayName": "string",
      "group": "string",
      "id": "string",
      "instructionText": "string",
      "key": "string",
      "notParam": false,
      "order": 10,
      "paramArray": false,
      "parameterName": "string",
      "provider": "string",
      "range": [
        {
          "id": "string",
          "maxValue": 4,
          "minValue": 10
        },
        {
          "id": "string",
          "maxValue": 8,
          "minValue": 1
        },
        {
          "id": "string",
          "maxValue": 5,
          "minValue": 7
        },
        {
          "id": "string",
          "maxValue": 6,
          "minValue": 9
        },
        {
          "id": "string",
          "maxValue": 5,
          "minValue": 8
        },
        {
          "id": "string",
          "maxValue": 6,
          "minValue": 3
        },
        {
          "id": "string",
          "maxValue": 6,
          "minValue": 3
        }
      ],
      "required": true,
      "selection": {
        "id": "string",
        "selectionType": "MULTI_SELECT",
        "selectionValues": {}
      }
    }
  ],
  "version": "string"
}