{
  "response": {
    "additionalStatusURL": "string",
    "data": "string",
    "endTime": "string",
    "errorCode": "string",
    "errorKey": "string",
    "failureReason": "string",
    "id": "string",
    "instanceTenantId": "string",
    "isError": false,
    "lastUpdate": "string",
    "operationIdList": {},
    "parentId": "string",
    "progress": "string",
    "rootId": "string",
    "serviceType": "string",
    "startTime": "string",
    "username": "string",
    "version": 6
  },
  "version": "string"
}