{
  "actions": [
    {
      "name": "getDnaintentapiv1taskcount",
      "protocol": "REST",
      "method": "GET",
      "entitypath": "{base_path}/{version}/task/count?{query}",
      "requestSchema": "schema.json",
      "responseSchema": "schema.json",
      "timeout": 0,
      "sendEmpty": false,
      "sendGetBody": false,
      "requestDatatype": "JSON",
      "responseDatatype": "JSON",
      "headers": {},
      "responseObjects": [
        {
          "type": "default",
          "key": "",
          "mockFile": "mockdatafiles/getDnaintentapiv1taskcount-default.json"
        }
      ]
    },
    {
      "name": "getDnaintentapiv1tasktaskId",
      "protocol": "REST",
      "method": "GET",
      "entitypath": "{base_path}/{version}/task/{pathv1}?{query}",
      "requestSchema": "schema.json",
      "responseSchema": "schema.json",
      "timeout": 0,
      "sendEmpty": false,
      "sendGetBody": false,
      "requestDatatype": "JSON",
      "responseDatatype": "JSON",
      "headers": {},
      "responseObjects": [
        {
          "type": "default",
          "key": "",
          "mockFile": "mockdatafiles/getDnaintentapiv1tasktaskId-default.json"
        }
      ]
    },
    {
      "name": "getDnaintentapiv1task",
      "protocol": "REST",
      "method": "GET",
      "entitypath": "{base_path}/{version}/task?{query}",
      "requestSchema": "schema.json",
      "responseSchema": "schema.json",
      "timeout": 0,
      "sendEmpty": false,
      "sendGetBody": false,
      "requestDatatype": "JSON",
      "responseDatatype": "JSON",
      "headers": {},
      "responseObjects": [
        {
          "type": "default",
          "key": "",
          "mockFile": "mockdatafiles/getDnaintentapiv1task-default.json"
        }
      ]
    },
    {
      "name": "getDnaintentapiv1tasktaskIdtree",
      "protocol": "REST",
      "method": "GET",
      "entitypath": "{base_path}/{version}/task/{pathv1}/tree?{query}",
      "requestSchema": "schema.json",
      "responseSchema": "schema.json",
      "timeout": 0,
      "sendEmpty": false,
      "sendGetBody": false,
      "requestDatatype": "JSON",
      "responseDatatype": "JSON",
      "headers": {},
      "responseObjects": [
        {
          "type": "default",
          "key": "",
          "mockFile": "mockdatafiles/getDnaintentapiv1tasktaskIdtree-default.json"
        }
      ]
    },
    {
      "name": "getDnaintentapiv1taskoperationoperationIdoffsetlimit",
      "protocol": "REST",
      "method": "GET",
      "entitypath": "{base_path}/{version}/task/operation/{pathv1}/{pathv2}/{pathv3}?{query}",
      "requestSchema": "schema.json",
      "responseSchema": "schema.json",
      "timeout": 0,
      "sendEmpty": false,
      "sendGetBody": false,
      "requestDatatype": "JSON",
      "responseDatatype": "JSON",
      "headers": {},
      "responseObjects": [
        {
          "type": "default",
          "key": "",
          "mockFile": "mockdatafiles/getDnaintentapiv1taskoperationoperationIdoffsetlimit-default.json"
        }
      ]
    },
    {
      "name": "getBusinessAPIExecutionDetails",
      "protocol": "REST",
      "method": "GET",
      "entitypath": "{base_path}/{version}/dnacaap/management/execution-status/{pathv1}?{query}",
      "requestSchema": "schema.json",
      "responseSchema": "schema.json",
      "timeout": 0,
      "sendEmpty": false,
      "sendGetBody": false,
      "requestDatatype": "JSON",
      "responseDatatype": "JSON",
      "headers": {},
      "responseObjects": [
        {
          "type": "default",
          "key": "",
          "mockFile": ""
        }
      ]
    }
  ]
}