{
  "_id": "string",
  "deviceInfo": {
    "source": "string",
    "serialNumber": "string",
    "stack": false,
    "mode": "string",
    "state": "string",
    "location": {
      "siteId": "string",
      "address": "string",
      "latitude": "string",
      "longitude": "string",
      "altitude": "string"
    },
    "description": "string",
    "onbState": "string",
    "authenticatedMicNumber": "string",
    "authenticatedSudiSerialNo": "string",
    "capabilitiesSupported": [
      "string",
      "string",
      "string",
      "string",
      "string",
      "string"
    ],
    "featuresSupported": [
      "string",
      "string",
      "string",
      "string"
    ],
    "cmState": "string",
    "firstContact": 5,
    "lastContact": 1,
    "macAddress": "string",
    "pid": "string",
    "deviceSudiSerialNos": [
      "string",
      "string",
      "string"
    ],
    "lastUpdateOn": 9,
    "workflowId": "string",
    "workflowName": "string",
    "projectId": "string",
    "projectName": "string",
    "deviceType": "string",
    "agentType": "string",
    "imageVersion": "string",
    "fileSystemList": [
      {
        "type": "string",
        "writeable": true,
        "freespace": 6,
        "name": "string",
        "readable": true,
        "size": 3
      },
      {
        "type": "string",
        "writeable": false,
        "freespace": 5,
        "name": "string",
        "readable": true,
        "size": 4
      },
      {
        "type": "string",
        "writeable": false,
        "freespace": 8,
        "name": "string",
        "readable": true,
        "size": 7
      },
      {
        "type": "string",
        "writeable": true,
        "freespace": 4,
        "name": "string",
        "readable": true,
        "size": 6
      },
      {
        "type": "string",
        "writeable": true,
        "freespace": 8,
        "name": "string",
        "readable": true,
        "size": 7
      },
      {
        "type": "string",
        "writeable": false,
        "freespace": 6,
        "name": "string",
        "readable": true,
        "size": 6
      },
      {
        "type": "string",
        "writeable": true,
        "freespace": 7,
        "name": "string",
        "readable": true,
        "size": 5
      },
      {
        "type": "string",
        "writeable": true,
        "freespace": 5,
        "name": "string",
        "readable": true,
        "size": 8
      },
      {
        "type": "string",
        "writeable": false,
        "freespace": 6,
        "name": "string",
        "readable": false,
        "size": 3
      }
    ],
    "pnpProfileList": [
      {
        "profileName": "string",
        "discoveryCreated": false,
        "createdBy": "string",
        "primaryEndpoint": {
          "port": 9,
          "protocol": "string",
          "ipv4Address": {},
          "ipv6Address": {},
          "fqdn": "string",
          "certificate": "string"
        },
        "secondaryEndpoint": {
          "port": 4,
          "protocol": "string",
          "ipv4Address": {},
          "ipv6Address": {},
          "fqdn": "string",
          "certificate": "string"
        }
      },
      {
        "profileName": "string",
        "discoveryCreated": false,
        "createdBy": "string",
        "primaryEndpoint": {
          "port": 8,
          "protocol": "string",
          "ipv4Address": {},
          "ipv6Address": {},
          "fqdn": "string",
          "certificate": "string"
        },
        "secondaryEndpoint": {
          "port": 4,
          "protocol": "string",
          "ipv4Address": {},
          "ipv6Address": {},
          "fqdn": "string",
          "certificate": "string"
        }
      },
      {
        "profileName": "string",
        "discoveryCreated": true,
        "createdBy": "string",
        "primaryEndpoint": {
          "port": 9,
          "protocol": "string",
          "ipv4Address": {},
          "ipv6Address": {},
          "fqdn": "string",
          "certificate": "string"
        },
        "secondaryEndpoint": {
          "port": 7,
          "protocol": "string",
          "ipv4Address": {},
          "ipv6Address": {},
          "fqdn": "string",
          "certificate": "string"
        }
      },
      {
        "profileName": "string",
        "discoveryCreated": false,
        "createdBy": "string",
        "primaryEndpoint": {
          "port": 4,
          "protocol": "string",
          "ipv4Address": {},
          "ipv6Address": {},
          "fqdn": "string",
          "certificate": "string"
        },
        "secondaryEndpoint": {
          "port": 2,
          "protocol": "string",
          "ipv4Address": {},
          "ipv6Address": {},
          "fqdn": "string",
          "certificate": "string"
        }
      },
      {
        "profileName": "string",
        "discoveryCreated": true,
        "createdBy": "string",
        "primaryEndpoint": {
          "port": 7,
          "protocol": "string",
          "ipv4Address": {},
          "ipv6Address": {},
          "fqdn": "string",
          "certificate": "string"
        },
        "secondaryEndpoint": {
          "port": 10,
          "protocol": "string",
          "ipv4Address": {},
          "ipv6Address": {},
          "fqdn": "string",
          "certificate": "string"
        }
      },
      {
        "profileName": "string",
        "discoveryCreated": true,
        "createdBy": "string",
        "primaryEndpoint": {
          "port": 6,
          "protocol": "string",
          "ipv4Address": {},
          "ipv6Address": {},
          "fqdn": "string",
          "certificate": "string"
        },
        "secondaryEndpoint": {
          "port": 10,
          "protocol": "string",
          "ipv4Address": {},
          "ipv6Address": {},
          "fqdn": "string",
          "certificate": "string"
        }
      },
      {
        "profileName": "string",
        "discoveryCreated": false,
        "createdBy": "string",
        "primaryEndpoint": {
          "port": 7,
          "protocol": "string",
          "ipv4Address": {},
          "ipv6Address": {},
          "fqdn": "string",
          "certificate": "string"
        },
        "secondaryEndpoint": {
          "port": 4,
          "protocol": "string",
          "ipv4Address": {},
          "ipv6Address": {},
          "fqdn": "string",
          "certificate": "string"
        }
      },
      {
        "profileName": "string",
        "discoveryCreated": false,
        "createdBy": "string",
        "primaryEndpoint": {
          "port": 9,
          "protocol": "string",
          "ipv4Address": {},
          "ipv6Address": {},
          "fqdn": "string",
          "certificate": "string"
        },
        "secondaryEndpoint": {
          "port": 4,
          "protocol": "string",
          "ipv4Address": {},
          "ipv6Address": {},
          "fqdn": "string",
          "certificate": "string"
        }
      },
      {
        "profileName": "string",
        "discoveryCreated": false,
        "createdBy": "string",
        "primaryEndpoint": {
          "port": 4,
          "protocol": "string",
          "ipv4Address": {},
          "ipv6Address": {},
          "fqdn": "string",
          "certificate": "string"
        },
        "secondaryEndpoint": {
          "port": 7,
          "protocol": "string",
          "ipv4Address": {},
          "ipv6Address": {},
          "fqdn": "string",
          "certificate": "string"
        }
      }
    ],
    "imageFile": "string",
    "httpHeaders": [
      {
        "key": "string",
        "value": "string"
      },
      {
        "key": "string",
        "value": "string"
      },
      {
        "key": "string",
        "value": "string"
      },
      {
        "key": "string",
        "value": "string"
      },
      {
        "key": "string",
        "value": "string"
      },
      {
        "key": "string",
        "value": "string"
      },
      {
        "key": "string",
        "value": "string"
      },
      {
        "key": "string",
        "value": "string"
      },
      {
        "key": "string",
        "value": "string"
      }
    ],
    "neighborLinks": [
      {
        "localInterfaceName": "string",
        "localShortInterfaceName": "string",
        "localMacAddress": "string",
        "remoteInterfaceName": "string",
        "remoteShortInterfaceName": "string",
        "remoteMacAddress": "string",
        "remoteDeviceName": "string",
        "remotePlatform": "string",
        "remoteVersion": "string"
      },
      {
        "localInterfaceName": "string",
        "localShortInterfaceName": "string",
        "localMacAddress": "string",
        "remoteInterfaceName": "string",
        "remoteShortInterfaceName": "string",
        "remoteMacAddress": "string",
        "remoteDeviceName": "string",
        "remotePlatform": "string",
        "remoteVersion": "string"
      },
      {
        "localInterfaceName": "string",
        "localShortInterfaceName": "string",
        "localMacAddress": "string",
        "remoteInterfaceName": "string",
        "remoteShortInterfaceName": "string",
        "remoteMacAddress": "string",
        "remoteDeviceName": "string",
        "remotePlatform": "string",
        "remoteVersion": "string"
      },
      {
        "localInterfaceName": "string",
        "localShortInterfaceName": "string",
        "localMacAddress": "string",
        "remoteInterfaceName": "string",
        "remoteShortInterfaceName": "string",
        "remoteMacAddress": "string",
        "remoteDeviceName": "string",
        "remotePlatform": "string",
        "remoteVersion": "string"
      },
      {
        "localInterfaceName": "string",
        "localShortInterfaceName": "string",
        "localMacAddress": "string",
        "remoteInterfaceName": "string",
        "remoteShortInterfaceName": "string",
        "remoteMacAddress": "string",
        "remoteDeviceName": "string",
        "remotePlatform": "string",
        "remoteVersion": "string"
      },
      {
        "localInterfaceName": "string",
        "localShortInterfaceName": "string",
        "localMacAddress": "string",
        "remoteInterfaceName": "string",
        "remoteShortInterfaceName": "string",
        "remoteMacAddress": "string",
        "remoteDeviceName": "string",
        "remotePlatform": "string",
        "remoteVersion": "string"
      }
    ],
    "lastSyncTime": 9,
    "ipInterfaces": [
      {
        "status": "string",
        "macAddress": "string",
        "ipv4Address": {},
        "ipv6AddressList": [
          {},
          {},
          {},
          {},
          {},
          {}
        ],
        "name": "string"
      },
      {
        "status": "string",
        "macAddress": "string",
        "ipv4Address": {},
        "ipv6AddressList": [
          {},
          {},
          {},
          {},
          {},
          {}
        ],
        "name": "string"
      },
      {
        "status": "string",
        "macAddress": "string",
        "ipv4Address": {},
        "ipv6AddressList": [
          {},
          {},
          {},
          {},
          {},
          {},
          {},
          {},
          {}
        ],
        "name": "string"
      }
    ],
    "hostname": "string",
    "authStatus": "string",
    "stackInfo": {
      "supportsStackWorkflows": true,
      "isFullRing": true,
      "stackMemberList": [
        {
          "serialNumber": "string",
          "state": "string",
          "role": "string",
          "macAddress": "string",
          "pid": "string",
          "licenseLevel": "string",
          "licenseType": "string",
          "sudiSerialNumber": "string",
          "hardwareVersion": "string",
          "stackNumber": 3,
          "softwareVersion": "string",
          "priority": 7
        },
        {
          "serialNumber": "string",
          "state": "string",
          "role": "string",
          "macAddress": "string",
          "pid": "string",
          "licenseLevel": "string",
          "licenseType": "string",
          "sudiSerialNumber": "string",
          "hardwareVersion": "string",
          "stackNumber": 2,
          "softwareVersion": "string",
          "priority": 8
        },
        {
          "serialNumber": "string",
          "state": "string",
          "role": "string",
          "macAddress": "string",
          "pid": "string",
          "licenseLevel": "string",
          "licenseType": "string",
          "sudiSerialNumber": "string",
          "hardwareVersion": "string",
          "stackNumber": 2,
          "softwareVersion": "string",
          "priority": 3
        },
        {
          "serialNumber": "string",
          "state": "string",
          "role": "string",
          "macAddress": "string",
          "pid": "string",
          "licenseLevel": "string",
          "licenseType": "string",
          "sudiSerialNumber": "string",
          "hardwareVersion": "string",
          "stackNumber": 5,
          "softwareVersion": "string",
          "priority": 7
        },
        {
          "serialNumber": "string",
          "state": "string",
          "role": "string",
          "macAddress": "string",
          "pid": "string",
          "licenseLevel": "string",
          "licenseType": "string",
          "sudiSerialNumber": "string",
          "hardwareVersion": "string",
          "stackNumber": 1,
          "softwareVersion": "string",
          "priority": 6
        },
        {
          "serialNumber": "string",
          "state": "string",
          "role": "string",
          "macAddress": "string",
          "pid": "string",
          "licenseLevel": "string",
          "licenseType": "string",
          "sudiSerialNumber": "string",
          "hardwareVersion": "string",
          "stackNumber": 7,
          "softwareVersion": "string",
          "priority": 1
        }
      ],
      "stackRingProtocol": "string",
      "validLicenseLevels": [
        "string",
        "string",
        "string",
        "string",
        "string",
        "string",
        "string",
        "string"
      ],
      "totalMemberCount": 5
    },
    "reloadRequested": false,
    "addedOn": 10,
    "siteId": "string",
    "aaaCredentials": {
      "password": "string",
      "username": "string"
    },
    "userMicNumbers": [
      "string",
      "string",
      "string",
      "string",
      "string"
    ],
    "userSudiSerialNos": [
      "string",
      "string",
      "string",
      "string",
      "string",
      "string",
      "string",
      "string"
    ],
    "addnMacAddrs": [
      "string",
      "string",
      "string",
      "string",
      "string",
      "string",
      "string",
      "string"
    ],
    "preWorkflowCliOuputs": [
      {
        "cli": "string",
        "cliOutput": "string"
      },
      {
        "cli": "string",
        "cliOutput": "string"
      },
      {
        "cli": "string",
        "cliOutput": "string"
      },
      {
        "cli": "string",
        "cliOutput": "string"
      },
      {
        "cli": "string",
        "cliOutput": "string"
      },
      {
        "cli": "string",
        "cliOutput": "string"
      },
      {
        "cli": "string",
        "cliOutput": "string"
      }
    ],
    "tags": {},
    "sudiRequired": true,
    "smartAccountId": "string",
    "virtualAccountId": "string",
    "populateInventory": true,
    "siteName": "string",
    "name": "string"
  },
  "systemResetWorkflow": {
    "_id": "string",
    "state": "string",
    "type": "string",
    "description": "string",
    "lastupdateOn": 8,
    "imageId": "string",
    "currTaskIdx": 6,
    "addedOn": 7,
    "tasks": [
      {
        "state": "string",
        "type": "string",
        "currWorkItemIdx": 2,
        "taskSeqNo": 3,
        "endTime": 8,
        "startTime": 8,
        "workItemList": [
          {
            "state": "string",
            "command": "string",
            "outputStr": "string",
            "endTime": 10,
            "startTime": 1,
            "timeTaken": 3
          },
          {
            "state": "string",
            "command": "string",
            "outputStr": "string",
            "endTime": 5,
            "startTime": 10,
            "timeTaken": 2
          },
          {
            "state": "string",
            "command": "string",
            "outputStr": "string",
            "endTime": 3,
            "startTime": 4,
            "timeTaken": 4
          },
          {
            "state": "string",
            "command": "string",
            "outputStr": "string",
            "endTime": 10,
            "startTime": 1,
            "timeTaken": 9
          }
        ],
        "timeTaken": 5,
        "name": "string"
      },
      {
        "state": "string",
        "type": "string",
        "currWorkItemIdx": 8,
        "taskSeqNo": 8,
        "endTime": 6,
        "startTime": 4,
        "workItemList": [
          {
            "state": "string",
            "command": "string",
            "outputStr": "string",
            "endTime": 1,
            "startTime": 10,
            "timeTaken": 10
          },
          {
            "state": "string",
            "command": "string",
            "outputStr": "string",
            "endTime": 5,
            "startTime": 3,
            "timeTaken": 10
          },
          {
            "state": "string",
            "command": "string",
            "outputStr": "string",
            "endTime": 4,
            "startTime": 3,
            "timeTaken": 6
          },
          {
            "state": "string",
            "command": "string",
            "outputStr": "string",
            "endTime": 6,
            "startTime": 10,
            "timeTaken": 9
          },
          {
            "state": "string",
            "command": "string",
            "outputStr": "string",
            "endTime": 3,
            "startTime": 3,
            "timeTaken": 2
          },
          {
            "state": "string",
            "command": "string",
            "outputStr": "string",
            "endTime": 8,
            "startTime": 8,
            "timeTaken": 4
          },
          {
            "state": "string",
            "command": "string",
            "outputStr": "string",
            "endTime": 2,
            "startTime": 9,
            "timeTaken": 6
          }
        ],
        "timeTaken": 2,
        "name": "string"
      }
    ],
    "addToInventory": true,
    "instanceType": "string",
    "endTime": 10,
    "execTime": 7,
    "startTime": 4,
    "useState": "string",
    "configId": "string",
    "name": "string",
    "version": 2,
    "tenantId": "string"
  },
  "systemWorkflow": {
    "_id": "string",
    "state": "string",
    "type": "string",
    "description": "string",
    "lastupdateOn": 8,
    "imageId": "string",
    "currTaskIdx": 6,
    "addedOn": 3,
    "tasks": [
      {
        "state": "string",
        "type": "string",
        "currWorkItemIdx": 9,
        "taskSeqNo": 4,
        "endTime": 4,
        "startTime": 10,
        "workItemList": [
          {
            "state": "string",
            "command": "string",
            "outputStr": "string",
            "endTime": 7,
            "startTime": 7,
            "timeTaken": 3
          },
          {
            "state": "string",
            "command": "string",
            "outputStr": "string",
            "endTime": 8,
            "startTime": 4,
            "timeTaken": 2
          },
          {
            "state": "string",
            "command": "string",
            "outputStr": "string",
            "endTime": 5,
            "startTime": 5,
            "timeTaken": 6
          },
          {
            "state": "string",
            "command": "string",
            "outputStr": "string",
            "endTime": 4,
            "startTime": 5,
            "timeTaken": 9
          },
          {
            "state": "string",
            "command": "string",
            "outputStr": "string",
            "endTime": 9,
            "startTime": 9,
            "timeTaken": 2
          },
          {
            "state": "string",
            "command": "string",
            "outputStr": "string",
            "endTime": 10,
            "startTime": 5,
            "timeTaken": 9
          },
          {
            "state": "string",
            "command": "string",
            "outputStr": "string",
            "endTime": 10,
            "startTime": 9,
            "timeTaken": 9
          },
          {
            "state": "string",
            "command": "string",
            "outputStr": "string",
            "endTime": 3,
            "startTime": 8,
            "timeTaken": 10
          }
        ],
        "timeTaken": 8,
        "name": "string"
      },
      {
        "state": "string",
        "type": "string",
        "currWorkItemIdx": 7,
        "taskSeqNo": 4,
        "endTime": 9,
        "startTime": 6,
        "workItemList": [
          {
            "state": "string",
            "command": "string",
            "outputStr": "string",
            "endTime": 7,
            "startTime": 5,
            "timeTaken": 9
          },
          {
            "state": "string",
            "command": "string",
            "outputStr": "string",
            "endTime": 1,
            "startTime": 3,
            "timeTaken": 5
          },
          {
            "state": "string",
            "command": "string",
            "outputStr": "string",
            "endTime": 2,
            "startTime": 10,
            "timeTaken": 6
          },
          {
            "state": "string",
            "command": "string",
            "outputStr": "string",
            "endTime": 10,
            "startTime": 1,
            "timeTaken": 8
          }
        ],
        "timeTaken": 1,
        "name": "string"
      },
      {
        "state": "string",
        "type": "string",
        "currWorkItemIdx": 2,
        "taskSeqNo": 8,
        "endTime": 7,
        "startTime": 10,
        "workItemList": [
          {
            "state": "string",
            "command": "string",
            "outputStr": "string",
            "endTime": 8,
            "startTime": 10,
            "timeTaken": 1
          },
          {
            "state": "string",
            "command": "string",
            "outputStr": "string",
            "endTime": 2,
            "startTime": 5,
            "timeTaken": 6
          },
          {
            "state": "string",
            "command": "string",
            "outputStr": "string",
            "endTime": 1,
            "startTime": 7,
            "timeTaken": 10
          }
        ],
        "timeTaken": 4,
        "name": "string"
      },
      {
        "state": "string",
        "type": "string",
        "currWorkItemIdx": 4,
        "taskSeqNo": 6,
        "endTime": 9,
        "startTime": 4,
        "workItemList": [
          {
            "state": "string",
            "command": "string",
            "outputStr": "string",
            "endTime": 3,
            "startTime": 2,
            "timeTaken": 6
          }
        ],
        "timeTaken": 2,
        "name": "string"
      },
      {
        "state": "string",
        "type": "string",
        "currWorkItemIdx": 8,
        "taskSeqNo": 5,
        "endTime": 6,
        "startTime": 5,
        "workItemList": [
          {
            "state": "string",
            "command": "string",
            "outputStr": "string",
            "endTime": 2,
            "startTime": 5,
            "timeTaken": 2
          }
        ],
        "timeTaken": 2,
        "name": "string"
      }
    ],
    "addToInventory": true,
    "instanceType": "string",
    "endTime": 9,
    "execTime": 5,
    "startTime": 3,
    "useState": "string",
    "configId": "string",
    "name": "string",
    "version": 2,
    "tenantId": "string"
  },
  "workflow": {
    "_id": "string",
    "state": "string",
    "type": "string",
    "description": "string",
    "lastupdateOn": 3,
    "imageId": "string",
    "currTaskIdx": 2,
    "addedOn": 7,
    "tasks": [
      {
        "state": "string",
        "type": "string",
        "currWorkItemIdx": 5,
        "taskSeqNo": 6,
        "endTime": 9,
        "startTime": 6,
        "workItemList": [
          {
            "state": "string",
            "command": "string",
            "outputStr": "string",
            "endTime": 1,
            "startTime": 5,
            "timeTaken": 6
          },
          {
            "state": "string",
            "command": "string",
            "outputStr": "string",
            "endTime": 6,
            "startTime": 4,
            "timeTaken": 1
          },
          {
            "state": "string",
            "command": "string",
            "outputStr": "string",
            "endTime": 2,
            "startTime": 8,
            "timeTaken": 5
          },
          {
            "state": "string",
            "command": "string",
            "outputStr": "string",
            "endTime": 5,
            "startTime": 3,
            "timeTaken": 9
          },
          {
            "state": "string",
            "command": "string",
            "outputStr": "string",
            "endTime": 8,
            "startTime": 8,
            "timeTaken": 5
          }
        ],
        "timeTaken": 1,
        "name": "string"
      },
      {
        "state": "string",
        "type": "string",
        "currWorkItemIdx": 3,
        "taskSeqNo": 1,
        "endTime": 8,
        "startTime": 10,
        "workItemList": [
          {
            "state": "string",
            "command": "string",
            "outputStr": "string",
            "endTime": 4,
            "startTime": 6,
            "timeTaken": 9
          },
          {
            "state": "string",
            "command": "string",
            "outputStr": "string",
            "endTime": 3,
            "startTime": 1,
            "timeTaken": 2
          },
          {
            "state": "string",
            "command": "string",
            "outputStr": "string",
            "endTime": 4,
            "startTime": 5,
            "timeTaken": 5
          },
          {
            "state": "string",
            "command": "string",
            "outputStr": "string",
            "endTime": 3,
            "startTime": 4,
            "timeTaken": 4
          },
          {
            "state": "string",
            "command": "string",
            "outputStr": "string",
            "endTime": 7,
            "startTime": 4,
            "timeTaken": 4
          },
          {
            "state": "string",
            "command": "string",
            "outputStr": "string",
            "endTime": 7,
            "startTime": 3,
            "timeTaken": 3
          },
          {
            "state": "string",
            "command": "string",
            "outputStr": "string",
            "endTime": 4,
            "startTime": 10,
            "timeTaken": 10
          },
          {
            "state": "string",
            "command": "string",
            "outputStr": "string",
            "endTime": 1,
            "startTime": 9,
            "timeTaken": 6
          },
          {
            "state": "string",
            "command": "string",
            "outputStr": "string",
            "endTime": 10,
            "startTime": 2,
            "timeTaken": 8
          }
        ],
        "timeTaken": 5,
        "name": "string"
      },
      {
        "state": "string",
        "type": "string",
        "currWorkItemIdx": 1,
        "taskSeqNo": 4,
        "endTime": 4,
        "startTime": 7,
        "workItemList": [
          {
            "state": "string",
            "command": "string",
            "outputStr": "string",
            "endTime": 7,
            "startTime": 2,
            "timeTaken": 9
          },
          {
            "state": "string",
            "command": "string",
            "outputStr": "string",
            "endTime": 1,
            "startTime": 1,
            "timeTaken": 10
          },
          {
            "state": "string",
            "command": "string",
            "outputStr": "string",
            "endTime": 8,
            "startTime": 5,
            "timeTaken": 9
          },
          {
            "state": "string",
            "command": "string",
            "outputStr": "string",
            "endTime": 5,
            "startTime": 1,
            "timeTaken": 10
          },
          {
            "state": "string",
            "command": "string",
            "outputStr": "string",
            "endTime": 10,
            "startTime": 4,
            "timeTaken": 3
          },
          {
            "state": "string",
            "command": "string",
            "outputStr": "string",
            "endTime": 6,
            "startTime": 3,
            "timeTaken": 3
          },
          {
            "state": "string",
            "command": "string",
            "outputStr": "string",
            "endTime": 5,
            "startTime": 1,
            "timeTaken": 7
          },
          {
            "state": "string",
            "command": "string",
            "outputStr": "string",
            "endTime": 3,
            "startTime": 6,
            "timeTaken": 3
          },
          {
            "state": "string",
            "command": "string",
            "outputStr": "string",
            "endTime": 8,
            "startTime": 10,
            "timeTaken": 2
          }
        ],
        "timeTaken": 6,
        "name": "string"
      },
      {
        "state": "string",
        "type": "string",
        "currWorkItemIdx": 9,
        "taskSeqNo": 1,
        "endTime": 9,
        "startTime": 7,
        "workItemList": [
          {
            "state": "string",
            "command": "string",
            "outputStr": "string",
            "endTime": 2,
            "startTime": 6,
            "timeTaken": 6
          },
          {
            "state": "string",
            "command": "string",
            "outputStr": "string",
            "endTime": 5,
            "startTime": 4,
            "timeTaken": 5
          },
          {
            "state": "string",
            "command": "string",
            "outputStr": "string",
            "endTime": 4,
            "startTime": 6,
            "timeTaken": 2
          },
          {
            "state": "string",
            "command": "string",
            "outputStr": "string",
            "endTime": 5,
            "startTime": 4,
            "timeTaken": 10
          },
          {
            "state": "string",
            "command": "string",
            "outputStr": "string",
            "endTime": 9,
            "startTime": 6,
            "timeTaken": 5
          },
          {
            "state": "string",
            "command": "string",
            "outputStr": "string",
            "endTime": 7,
            "startTime": 7,
            "timeTaken": 2
          },
          {
            "state": "string",
            "command": "string",
            "outputStr": "string",
            "endTime": 4,
            "startTime": 8,
            "timeTaken": 9
          },
          {
            "state": "string",
            "command": "string",
            "outputStr": "string",
            "endTime": 3,
            "startTime": 10,
            "timeTaken": 6
          },
          {
            "state": "string",
            "command": "string",
            "outputStr": "string",
            "endTime": 8,
            "startTime": 4,
            "timeTaken": 3
          }
        ],
        "timeTaken": 1,
        "name": "string"
      },
      {
        "state": "string",
        "type": "string",
        "currWorkItemIdx": 1,
        "taskSeqNo": 10,
        "endTime": 10,
        "startTime": 5,
        "workItemList": [
          {
            "state": "string",
            "command": "string",
            "outputStr": "string",
            "endTime": 4,
            "startTime": 5,
            "timeTaken": 5
          },
          {
            "state": "string",
            "command": "string",
            "outputStr": "string",
            "endTime": 2,
            "startTime": 1,
            "timeTaken": 10
          },
          {
            "state": "string",
            "command": "string",
            "outputStr": "string",
            "endTime": 6,
            "startTime": 2,
            "timeTaken": 3
          },
          {
            "state": "string",
            "command": "string",
            "outputStr": "string",
            "endTime": 10,
            "startTime": 8,
            "timeTaken": 6
          },
          {
            "state": "string",
            "command": "string",
            "outputStr": "string",
            "endTime": 6,
            "startTime": 3,
            "timeTaken": 10
          },
          {
            "state": "string",
            "command": "string",
            "outputStr": "string",
            "endTime": 6,
            "startTime": 8,
            "timeTaken": 2
          },
          {
            "state": "string",
            "command": "string",
            "outputStr": "string",
            "endTime": 4,
            "startTime": 10,
            "timeTaken": 6
          },
          {
            "state": "string",
            "command": "string",
            "outputStr": "string",
            "endTime": 6,
            "startTime": 9,
            "timeTaken": 1
          },
          {
            "state": "string",
            "command": "string",
            "outputStr": "string",
            "endTime": 3,
            "startTime": 4,
            "timeTaken": 9
          }
        ],
        "timeTaken": 3,
        "name": "string"
      }
    ],
    "addToInventory": false,
    "instanceType": "string",
    "endTime": 9,
    "execTime": 2,
    "startTime": 10,
    "useState": "string",
    "configId": "string",
    "name": "string",
    "version": 1,
    "tenantId": "string"
  },
  "runSummaryList": [
    {
      "details": "string",
      "historyTaskInfo": {
        "type": "string",
        "workItemList": [
          {
            "state": "string",
            "command": "string",
            "outputStr": "string",
            "endTime": 4,
            "startTime": 2,
            "timeTaken": 5
          },
          {
            "state": "string",
            "command": "string",
            "outputStr": "string",
            "endTime": 10,
            "startTime": 8,
            "timeTaken": 10
          },
          {
            "state": "string",
            "command": "string",
            "outputStr": "string",
            "endTime": 4,
            "startTime": 7,
            "timeTaken": 3
          },
          {
            "state": "string",
            "command": "string",
            "outputStr": "string",
            "endTime": 9,
            "startTime": 9,
            "timeTaken": 8
          },
          {
            "state": "string",
            "command": "string",
            "outputStr": "string",
            "endTime": 6,
            "startTime": 5,
            "timeTaken": 3
          },
          {
            "state": "string",
            "command": "string",
            "outputStr": "string",
            "endTime": 10,
            "startTime": 9,
            "timeTaken": 9
          },
          {
            "state": "string",
            "command": "string",
            "outputStr": "string",
            "endTime": 4,
            "startTime": 3,
            "timeTaken": 4
          }
        ],
        "timeTaken": 9,
        "addnDetails": [
          {
            "key": "string",
            "value": "string"
          },
          {
            "key": "string",
            "value": "string"
          },
          {
            "key": "string",
            "value": "string"
          },
          {
            "key": "string",
            "value": "string"
          },
          {
            "key": "string",
            "value": "string"
          },
          {
            "key": "string",
            "value": "string"
          },
          {
            "key": "string",
            "value": "string"
          }
        ],
        "name": "string"
      },
      "errorFlag": true,
      "timestamp": 4
    },
    {
      "details": "string",
      "historyTaskInfo": {
        "type": "string",
        "workItemList": [
          {
            "state": "string",
            "command": "string",
            "outputStr": "string",
            "endTime": 7,
            "startTime": 2,
            "timeTaken": 10
          },
          {
            "state": "string",
            "command": "string",
            "outputStr": "string",
            "endTime": 4,
            "startTime": 10,
            "timeTaken": 9
          },
          {
            "state": "string",
            "command": "string",
            "outputStr": "string",
            "endTime": 10,
            "startTime": 4,
            "timeTaken": 6
          },
          {
            "state": "string",
            "command": "string",
            "outputStr": "string",
            "endTime": 10,
            "startTime": 6,
            "timeTaken": 7
          },
          {
            "state": "string",
            "command": "string",
            "outputStr": "string",
            "endTime": 5,
            "startTime": 2,
            "timeTaken": 7
          }
        ],
        "timeTaken": 4,
        "addnDetails": [
          {
            "key": "string",
            "value": "string"
          },
          {
            "key": "string",
            "value": "string"
          },
          {
            "key": "string",
            "value": "string"
          },
          {
            "key": "string",
            "value": "string"
          },
          {
            "key": "string",
            "value": "string"
          },
          {
            "key": "string",
            "value": "string"
          },
          {
            "key": "string",
            "value": "string"
          }
        ],
        "name": "string"
      },
      "errorFlag": true,
      "timestamp": 3
    },
    {
      "details": "string",
      "historyTaskInfo": {
        "type": "string",
        "workItemList": [
          {
            "state": "string",
            "command": "string",
            "outputStr": "string",
            "endTime": 7,
            "startTime": 5,
            "timeTaken": 4
          },
          {
            "state": "string",
            "command": "string",
            "outputStr": "string",
            "endTime": 9,
            "startTime": 3,
            "timeTaken": 5
          },
          {
            "state": "string",
            "command": "string",
            "outputStr": "string",
            "endTime": 3,
            "startTime": 9,
            "timeTaken": 6
          },
          {
            "state": "string",
            "command": "string",
            "outputStr": "string",
            "endTime": 7,
            "startTime": 6,
            "timeTaken": 2
          },
          {
            "state": "string",
            "command": "string",
            "outputStr": "string",
            "endTime": 5,
            "startTime": 4,
            "timeTaken": 9
          },
          {
            "state": "string",
            "command": "string",
            "outputStr": "string",
            "endTime": 1,
            "startTime": 4,
            "timeTaken": 5
          },
          {
            "state": "string",
            "command": "string",
            "outputStr": "string",
            "endTime": 3,
            "startTime": 8,
            "timeTaken": 4
          },
          {
            "state": "string",
            "command": "string",
            "outputStr": "string",
            "endTime": 8,
            "startTime": 3,
            "timeTaken": 9
          },
          {
            "state": "string",
            "command": "string",
            "outputStr": "string",
            "endTime": 4,
            "startTime": 3,
            "timeTaken": 5
          },
          {
            "state": "string",
            "command": "string",
            "outputStr": "string",
            "endTime": 10,
            "startTime": 3,
            "timeTaken": 2
          }
        ],
        "timeTaken": 8,
        "addnDetails": [
          {
            "key": "string",
            "value": "string"
          },
          {
            "key": "string",
            "value": "string"
          },
          {
            "key": "string",
            "value": "string"
          },
          {
            "key": "string",
            "value": "string"
          },
          {
            "key": "string",
            "value": "string"
          }
        ],
        "name": "string"
      },
      "errorFlag": false,
      "timestamp": 4
    }
  ],
  "workflowParameters": {
    "topOfStackSerialNumber": "string",
    "licenseLevel": "string",
    "licenseType": "string",
    "configList": [
      {
        "configParameters": [
          {
            "key": "string",
            "value": "string"
          },
          {
            "key": "string",
            "value": "string"
          },
          {
            "key": "string",
            "value": "string"
          },
          {
            "key": "string",
            "value": "string"
          },
          {
            "key": "string",
            "value": "string"
          },
          {
            "key": "string",
            "value": "string"
          },
          {
            "key": "string",
            "value": "string"
          },
          {
            "key": "string",
            "value": "string"
          },
          {
            "key": "string",
            "value": "string"
          }
        ],
        "configId": "string"
      }
    ]
  },
  "dayZeroConfig": {
    "config": "string"
  },
  "dayZeroConfigPreview": {},
  "version": 7,
  "tenantId": "string"
}