{
  "actions": [
    {
      "name": "getServicePoliciesUsingGET1",
      "protocol": "REST",
      "method": "GET",
      "entitypath": "{base_path}/{version}/fabrics/{pathv1}/service-nodes/{pathv2}/policies?{query}",
      "requestSchema": "schema.json",
      "responseSchema": "schema.json",
      "timeout": 0,
      "sendEmpty": false,
      "sendGetBody": false,
      "requestDatatype": "JSON",
      "responseDatatype": "JSON",
      "headers": {},
      "responseObjects": [
        {
          "type": "default",
          "key": "",
          "mockFile": "mockdatafiles/getServicePoliciesUsingGET1-default.json"
        }
      ]
    },
    {
      "name": "addServicePolicyUsingPOST",
      "protocol": "REST",
      "method": "POST",
      "entitypath": "{base_path}/{version}/fabrics/{pathv1}/service-nodes/{pathv2}/policies?{query}",
      "requestSchema": "schema.json",
      "responseSchema": "schema.json",
      "timeout": 0,
      "sendEmpty": false,
      "requestDatatype": "JSON",
      "responseDatatype": "JSON",
      "headers": {},
      "responseObjects": [
        {
          "type": "default",
          "key": "",
          "mockFile": "mockdatafiles/addServicePolicyUsingPOST-default.json"
        }
      ]
    },
    {
      "name": "deleteServicePolicyUsingDELETE2",
      "protocol": "REST",
      "method": "DELETE",
      "entitypath": "{base_path}/{version}/fabrics/{pathv1}/service-nodes/{pathv2}/policies?{query}",
      "requestSchema": "schema.json",
      "responseSchema": "schema.json",
      "timeout": 0,
      "sendEmpty": false,
      "requestDatatype": "JSON",
      "responseDatatype": "JSON",
      "headers": {},
      "responseObjects": [
        {
          "type": "default",
          "key": "",
          "mockFile": ""
        }
      ]
    },
    {
      "name": "getServicePoliciesUsingGET",
      "protocol": "REST",
      "method": "GET",
      "entitypath": "{base_path}/{version}/fabrics/{pathv1}/service-nodes/{pathv2}/policies/{pathv3}?{query}",
      "requestSchema": "schema.json",
      "responseSchema": "schema.json",
      "timeout": 0,
      "sendEmpty": false,
      "sendGetBody": false,
      "requestDatatype": "JSON",
      "responseDatatype": "JSON",
      "headers": {},
      "responseObjects": [
        {
          "type": "default",
          "key": "",
          "mockFile": "mockdatafiles/getServicePoliciesUsingGET-default.json"
        }
      ]
    },
    {
      "name": "deleteServicePolicyUsingDELETE1",
      "protocol": "REST",
      "method": "DELETE",
      "entitypath": "{base_path}/{version}/fabrics/{pathv1}/service-nodes/{pathv2}/policies/{pathv3}?{query}",
      "requestSchema": "schema.json",
      "responseSchema": "schema.json",
      "timeout": 0,
      "sendEmpty": false,
      "requestDatatype": "JSON",
      "responseDatatype": "JSON",
      "headers": {},
      "responseObjects": [
        {
          "type": "default",
          "key": "",
          "mockFile": ""
        }
      ]
    },
    {
      "name": "attachPoliciesUsingPOST",
      "protocol": "REST",
      "method": "POST",
      "entitypath": "{base_path}/{version}/fabrics/{pathv1}/service-nodes/{pathv2}/policies/{pathv3}/attachments?{query}",
      "requestSchema": "schema.json",
      "responseSchema": "schema.json",
      "timeout": 0,
      "sendEmpty": false,
      "requestDatatype": "JSON",
      "responseDatatype": "JSON",
      "headers": {},
      "responseObjects": [
        {
          "type": "default",
          "key": "",
          "mockFile": ""
        }
      ]
    },
    {
      "name": "detachPoliciesUsingDELETE",
      "protocol": "REST",
      "method": "DELETE",
      "entitypath": "{base_path}/{version}/fabrics/{pathv1}/service-nodes/{pathv2}/policies/{pathv3}/attachments?{query}",
      "requestSchema": "schema.json",
      "responseSchema": "schema.json",
      "timeout": 0,
      "sendEmpty": false,
      "requestDatatype": "JSON",
      "responseDatatype": "JSON",
      "headers": {},
      "responseObjects": [
        {
          "type": "default",
          "key": "",
          "mockFile": ""
        }
      ]
    },
    {
      "name": "deployPoliciesUsingPOST",
      "protocol": "REST",
      "method": "POST",
      "entitypath": "{base_path}/{version}/fabrics/{pathv1}/service-nodes/{pathv2}/policies/{pathv3}/deployments?{query}",
      "requestSchema": "schema.json",
      "responseSchema": "schema.json",
      "timeout": 0,
      "sendEmpty": false,
      "requestDatatype": "JSON",
      "responseDatatype": "JSON",
      "headers": {},
      "responseObjects": [
        {
          "type": "default",
          "key": "",
          "mockFile": ""
        }
      ]
    },
    {
      "name": "getServicePolicyUsingGET",
      "protocol": "REST",
      "method": "GET",
      "entitypath": "{base_path}/{version}/fabrics/{pathv1}/service-nodes/{pathv2}/policies/{pathv3}/{pathv4}?{query}",
      "requestSchema": "schema.json",
      "responseSchema": "schema.json",
      "timeout": 0,
      "sendEmpty": false,
      "sendGetBody": false,
      "requestDatatype": "JSON",
      "responseDatatype": "JSON",
      "headers": {},
      "responseObjects": [
        {
          "type": "default",
          "key": "",
          "mockFile": "mockdatafiles/getServicePolicyUsingGET-default.json"
        }
      ]
    },
    {
      "name": "updateServicePolicyUsingPUT",
      "protocol": "REST",
      "method": "PUT",
      "entitypath": "{base_path}/{version}/fabrics/{pathv1}/service-nodes/{pathv2}/policies/{pathv3}/{pathv4}?{query}",
      "requestSchema": "schema.json",
      "responseSchema": "schema.json",
      "timeout": 0,
      "sendEmpty": false,
      "requestDatatype": "JSON",
      "responseDatatype": "JSON",
      "headers": {},
      "responseObjects": [
        {
          "type": "default",
          "key": "",
          "mockFile": "mockdatafiles/updateServicePolicyUsingPUT-default.json"
        }
      ]
    },
    {
      "name": "deleteServicePolicyUsingDELETE",
      "protocol": "REST",
      "method": "DELETE",
      "entitypath": "{base_path}/{version}/fabrics/{pathv1}/service-nodes/{pathv2}/policies/{pathv3}/{pathv4}?{query}",
      "requestSchema": "schema.json",
      "responseSchema": "schema.json",
      "timeout": 0,
      "sendEmpty": false,
      "requestDatatype": "JSON",
      "responseDatatype": "JSON",
      "headers": {},
      "responseObjects": [
        {
          "type": "default",
          "key": "",
          "mockFile": ""
        }
      ]
    },
    {
      "name": "getPolicyAttachmentsUsingGET",
      "protocol": "REST",
      "method": "GET",
      "entitypath": "{base_path}/{version}/fabrics/{pathv1}/service-nodes/{pathv2}/policies/{pathv3}/{pathv4}/attachments?{query}",
      "requestSchema": "schema.json",
      "responseSchema": "schema.json",
      "timeout": 0,
      "sendEmpty": false,
      "sendGetBody": false,
      "requestDatatype": "JSON",
      "responseDatatype": "JSON",
      "headers": {},
      "responseObjects": [
        {
          "type": "default",
          "key": "",
          "mockFile": "mockdatafiles/getPolicyAttachmentsUsingGET-default.json"
        }
      ]
    },
    {
      "name": "attachPolicyUsingPOST",
      "protocol": "REST",
      "method": "POST",
      "entitypath": "{base_path}/{version}/fabrics/{pathv1}/service-nodes/{pathv2}/policies/{pathv3}/{pathv4}/attachments?{query}",
      "requestSchema": "schema.json",
      "responseSchema": "schema.json",
      "timeout": 0,
      "sendEmpty": false,
      "requestDatatype": "JSON",
      "responseDatatype": "JSON",
      "headers": {},
      "responseObjects": [
        {
          "type": "default",
          "key": "",
          "mockFile": ""
        }
      ]
    },
    {
      "name": "detachPolicyUsingDELETE",
      "protocol": "REST",
      "method": "DELETE",
      "entitypath": "{base_path}/{version}/fabrics/{pathv1}/service-nodes/{pathv2}/policies/{pathv3}/{pathv4}/attachments?{query}",
      "requestSchema": "schema.json",
      "responseSchema": "schema.json",
      "timeout": 0,
      "sendEmpty": false,
      "requestDatatype": "JSON",
      "responseDatatype": "JSON",
      "headers": {},
      "responseObjects": [
        {
          "type": "default",
          "key": "",
          "mockFile": ""
        }
      ]
    },
    {
      "name": "deployPolicyUsingPOST",
      "protocol": "REST",
      "method": "POST",
      "entitypath": "{base_path}/{version}/fabrics/{pathv1}/service-nodes/{pathv2}/policies/{pathv3}/{pathv4}/deployments?{query}",
      "requestSchema": "schema.json",
      "responseSchema": "schema.json",
      "timeout": 0,
      "sendEmpty": false,
      "requestDatatype": "JSON",
      "responseDatatype": "JSON",
      "headers": {},
      "responseObjects": [
        {
          "type": "default",
          "key": "",
          "mockFile": ""
        }
      ]
    },
    {
      "name": "getPBRStatsUsingGET",
      "protocol": "REST",
      "method": "GET",
      "entitypath": "{base_path}/{version}/fabrics/{pathv1}/service-nodes/{pathv2}/{pathv3}/policies/{pathv4}/{pathv5}/stats?{query}",
      "requestSchema": "schema.json",
      "responseSchema": "schema.json",
      "timeout": 0,
      "sendEmpty": false,
      "sendGetBody": false,
      "requestDatatype": "JSON",
      "responseDatatype": "JSON",
      "headers": {},
      "responseObjects": [
        {
          "type": "default",
          "key": "",
          "mockFile": ""
        }
      ]
    },
    {
      "name": "clearPBRStatsUsingDELETE",
      "protocol": "REST",
      "method": "DELETE",
      "entitypath": "{base_path}/{version}/fabrics/{pathv1}/service-nodes/{pathv2}/{pathv3}/policies/{pathv4}/{pathv5}/stats?{query}",
      "requestSchema": "schema.json",
      "responseSchema": "schema.json",
      "timeout": 0,
      "sendEmpty": false,
      "requestDatatype": "JSON",
      "responseDatatype": "JSON",
      "headers": {},
      "responseObjects": [
        {
          "type": "default",
          "key": "",
          "mockFile": ""
        }
      ]
    },
    {
      "name": "getServicePoliciesForSwitchUsingGET",
      "protocol": "REST",
      "method": "GET",
      "entitypath": "{base_path}/{version}/policies?{query}",
      "requestSchema": "schema.json",
      "responseSchema": "schema.json",
      "timeout": 0,
      "sendEmpty": false,
      "sendGetBody": false,
      "requestDatatype": "JSON",
      "responseDatatype": "JSON",
      "headers": {},
      "responseObjects": [
        {
          "type": "default",
          "key": "",
          "mockFile": "mockdatafiles/getServicePoliciesForSwitchUsingGET-default.json"
        }
      ]
    }
  ]
}