[
  {
    "fabricName": "attachedEasyFabric",
    "resourceName": "serviceNetwork1",
    "resourceType": "VRF",
    "switchAttaches": [
      {
        "attachState": "DEPLOYED",
        "lanAttached": false,
        "portNames": "Ethernet1/52",
        "switchIp": "123.23.23.23",
        "switchName": "switchABC",
        "switchRole": "leaf",
        "switchSerialNumber": "switchSerialNumber",
        "vlanId": 1000
      },
      {
        "attachState": "DEPLOYED",
        "lanAttached": false,
        "portNames": "Ethernet1/52",
        "switchIp": "123.23.23.23",
        "switchName": "switchABC",
        "switchRole": "leaf",
        "switchSerialNumber": "switchSerialNumber",
        "vlanId": 1000
      },
      {
        "attachState": "DEPLOYED",
        "lanAttached": true,
        "portNames": "Ethernet1/52",
        "switchIp": "123.23.23.23",
        "switchName": "switchABC",
        "switchRole": "leaf",
        "switchSerialNumber": "switchSerialNumber",
        "vlanId": 1000
      },
      {
        "attachState": "DEPLOYED",
        "lanAttached": false,
        "portNames": "Ethernet1/52",
        "switchIp": "123.23.23.23",
        "switchName": "switchABC",
        "switchRole": "leaf",
        "switchSerialNumber": "switchSerialNumber",
        "vlanId": 1000
      },
      {
        "attachState": "DEPLOYED",
        "lanAttached": true,
        "portNames": "Ethernet1/52",
        "switchIp": "123.23.23.23",
        "switchName": "switchABC",
        "switchRole": "leaf",
        "switchSerialNumber": "switchSerialNumber",
        "vlanId": 1000
      },
      {
        "attachState": "DEPLOYED",
        "lanAttached": false,
        "portNames": "Ethernet1/52",
        "switchIp": "123.23.23.23",
        "switchName": "switchABC",
        "switchRole": "leaf",
        "switchSerialNumber": "switchSerialNumber",
        "vlanId": 1000
      }
    ]
  },
  {
    "fabricName": "attachedEasyFabric",
    "resourceName": "serviceNetwork1",
    "resourceType": "Network",
    "switchAttaches": [
      {
        "attachState": "DEPLOYED",
        "lanAttached": false,
        "portNames": "Ethernet1/52",
        "switchIp": "123.23.23.23",
        "switchName": "switchABC",
        "switchRole": "leaf",
        "switchSerialNumber": "switchSerialNumber",
        "vlanId": 1000
      },
      {
        "attachState": "DEPLOYED",
        "lanAttached": true,
        "portNames": "Ethernet1/52",
        "switchIp": "123.23.23.23",
        "switchName": "switchABC",
        "switchRole": "leaf",
        "switchSerialNumber": "switchSerialNumber",
        "vlanId": 1000
      },
      {
        "attachState": "DEPLOYED",
        "lanAttached": false,
        "portNames": "Ethernet1/52",
        "switchIp": "123.23.23.23",
        "switchName": "switchABC",
        "switchRole": "leaf",
        "switchSerialNumber": "switchSerialNumber",
        "vlanId": 1000
      },
      {
        "attachState": "DEPLOYED",
        "lanAttached": false,
        "portNames": "Ethernet1/52",
        "switchIp": "123.23.23.23",
        "switchName": "switchABC",
        "switchRole": "leaf",
        "switchSerialNumber": "switchSerialNumber",
        "vlanId": 1000
      },
      {
        "attachState": "DEPLOYED",
        "lanAttached": true,
        "portNames": "Ethernet1/52",
        "switchIp": "123.23.23.23",
        "switchName": "switchABC",
        "switchRole": "leaf",
        "switchSerialNumber": "switchSerialNumber",
        "vlanId": 1000
      },
      {
        "attachState": "DEPLOYED",
        "lanAttached": false,
        "portNames": "Ethernet1/52",
        "switchIp": "123.23.23.23",
        "switchName": "switchABC",
        "switchRole": "leaf",
        "switchSerialNumber": "switchSerialNumber",
        "vlanId": 1000
      }
    ]
  },
  {
    "fabricName": "attachedEasyFabric",
    "resourceName": "serviceNetwork1",
    "resourceType": "Network",
    "switchAttaches": [
      {
        "attachState": "DEPLOYED",
        "lanAttached": false,
        "portNames": "Ethernet1/52",
        "switchIp": "123.23.23.23",
        "switchName": "switchABC",
        "switchRole": "leaf",
        "switchSerialNumber": "switchSerialNumber",
        "vlanId": 1000
      },
      {
        "attachState": "DEPLOYED",
        "lanAttached": false,
        "portNames": "Ethernet1/52",
        "switchIp": "123.23.23.23",
        "switchName": "switchABC",
        "switchRole": "leaf",
        "switchSerialNumber": "switchSerialNumber",
        "vlanId": 1000
      },
      {
        "attachState": "DEPLOYED",
        "lanAttached": true,
        "portNames": "Ethernet1/52",
        "switchIp": "123.23.23.23",
        "switchName": "switchABC",
        "switchRole": "leaf",
        "switchSerialNumber": "switchSerialNumber",
        "vlanId": 1000
      }
    ]
  },
  {
    "fabricName": "attachedEasyFabric",
    "resourceName": "serviceNetwork1",
    "resourceType": "VRF",
    "switchAttaches": [
      {
        "attachState": "DEPLOYED",
        "lanAttached": false,
        "portNames": "Ethernet1/52",
        "switchIp": "123.23.23.23",
        "switchName": "switchABC",
        "switchRole": "leaf",
        "switchSerialNumber": "switchSerialNumber",
        "vlanId": 1000
      },
      {
        "attachState": "DEPLOYED",
        "lanAttached": false,
        "portNames": "Ethernet1/52",
        "switchIp": "123.23.23.23",
        "switchName": "switchABC",
        "switchRole": "leaf",
        "switchSerialNumber": "switchSerialNumber",
        "vlanId": 1000
      },
      {
        "attachState": "DEPLOYED",
        "lanAttached": true,
        "portNames": "Ethernet1/52",
        "switchIp": "123.23.23.23",
        "switchName": "switchABC",
        "switchRole": "leaf",
        "switchSerialNumber": "switchSerialNumber",
        "vlanId": 1000
      },
      {
        "attachState": "DEPLOYED",
        "lanAttached": true,
        "portNames": "Ethernet1/52",
        "switchIp": "123.23.23.23",
        "switchName": "switchABC",
        "switchRole": "leaf",
        "switchSerialNumber": "switchSerialNumber",
        "vlanId": 1000
      },
      {
        "attachState": "DEPLOYED",
        "lanAttached": false,
        "portNames": "Ethernet1/52",
        "switchIp": "123.23.23.23",
        "switchName": "switchABC",
        "switchRole": "leaf",
        "switchSerialNumber": "switchSerialNumber",
        "vlanId": 1000
      }
    ]
  }
]