{
  "actions": [
    {
      "name": "createBulkNetwork",
      "protocol": "REST",
      "method": "POST",
      "entitypath": "{base_path}/{version}/top-down/bulk-create/networks?{query}",
      "requestSchema": "schema.json",
      "responseSchema": "schema.json",
      "timeout": 0,
      "sendEmpty": false,
      "requestDatatype": "JSON",
      "responseDatatype": "JSON",
      "headers": {},
      "responseObjects": [
        {
          "type": "default",
          "key": "",
          "mockFile": ""
        }
      ]
    },
    {
      "name": "createBulkImportNetwork",
      "protocol": "REST",
      "method": "POST",
      "entitypath": "{base_path}/{version}/top-down/bulk-import/networks?{query}",
      "requestSchema": "schema.json",
      "responseSchema": "schema.json",
      "timeout": 0,
      "sendEmpty": false,
      "requestDatatype": "PLAIN",
      "responseDatatype": "JSON",
      "headers": {},
      "responseObjects": [
        {
          "type": "default",
          "key": "",
          "mockFile": ""
        }
      ]
    },
    {
      "name": "listNetworks",
      "protocol": "REST",
      "method": "GET",
      "entitypath": "{base_path}/{version}/top-down/fabrics/{pathv1}/networks?{query}",
      "requestSchema": "schema.json",
      "responseSchema": "schema.json",
      "timeout": 0,
      "sendEmpty": false,
      "sendGetBody": false,
      "requestDatatype": "JSON",
      "responseDatatype": "JSON",
      "headers": {},
      "responseObjects": [
        {
          "type": "default",
          "key": "",
          "mockFile": ""
        }
      ]
    },
    {
      "name": "createNetwork",
      "protocol": "REST",
      "method": "POST",
      "entitypath": "{base_path}/{version}/top-down/fabrics/{pathv1}/networks?{query}",
      "requestSchema": "schema.json",
      "responseSchema": "schema.json",
      "timeout": 0,
      "sendEmpty": false,
      "requestDatatype": "JSON",
      "responseDatatype": "JSON",
      "headers": {},
      "responseObjects": [
        {
          "type": "default",
          "key": "",
          "mockFile": ""
        }
      ]
    },
    {
      "name": "getNetworkAttachDetails",
      "protocol": "REST",
      "method": "GET",
      "entitypath": "{base_path}/{version}/top-down/fabrics/{pathv1}/networks/attachments?{query}",
      "requestSchema": "schema.json",
      "responseSchema": "schema.json",
      "timeout": 0,
      "sendEmpty": false,
      "sendGetBody": false,
      "requestDatatype": "JSON",
      "responseDatatype": "JSON",
      "headers": {},
      "responseObjects": [
        {
          "type": "default",
          "key": "",
          "mockFile": ""
        }
      ]
    },
    {
      "name": "attachNetworks",
      "protocol": "REST",
      "method": "POST",
      "entitypath": "{base_path}/{version}/top-down/fabrics/{pathv1}/networks/attachments?{query}",
      "requestSchema": "schema.json",
      "responseSchema": "schema.json",
      "timeout": 0,
      "sendEmpty": false,
      "requestDatatype": "JSON",
      "responseDatatype": "JSON",
      "headers": {},
      "responseObjects": [
        {
          "type": "default",
          "key": "",
          "mockFile": ""
        }
      ]
    },
    {
      "name": "postdeployNetworks",
      "protocol": "REST",
      "method": "POST",
      "entitypath": "{base_path}/{version}/top-down/fabrics/{pathv1}/networks/deployments?{query}",
      "requestSchema": "schema.json",
      "responseSchema": "schema.json",
      "timeout": 0,
      "sendEmpty": false,
      "requestDatatype": "JSON",
      "responseDatatype": "JSON",
      "headers": {},
      "responseObjects": [
        {
          "type": "default",
          "key": "",
          "mockFile": ""
        }
      ]
    },
    {
      "name": "previewNetworks",
      "protocol": "REST",
      "method": "GET",
      "entitypath": "{base_path}/{version}/top-down/fabrics/{pathv1}/networks/preview?{query}",
      "requestSchema": "schema.json",
      "responseSchema": "schema.json",
      "timeout": 0,
      "sendEmpty": false,
      "sendGetBody": false,
      "requestDatatype": "JSON",
      "responseDatatype": "JSON",
      "headers": {},
      "responseObjects": [
        {
          "type": "default",
          "key": "",
          "mockFile": ""
        }
      ]
    },
    {
      "name": "getAllPortsAndStatus",
      "protocol": "REST",
      "method": "GET",
      "entitypath": "{base_path}/{version}/top-down/fabrics/{pathv1}/networks/switches?{query}",
      "requestSchema": "schema.json",
      "responseSchema": "schema.json",
      "timeout": 0,
      "sendEmpty": false,
      "sendGetBody": false,
      "requestDatatype": "JSON",
      "responseDatatype": "JSON",
      "headers": {},
      "responseObjects": [
        {
          "type": "default",
          "key": "",
          "mockFile": ""
        }
      ]
    },
    {
      "name": "getSwitchDeploymentHistory",
      "protocol": "REST",
      "method": "GET",
      "entitypath": "{base_path}/{version}/top-down/fabrics/{pathv1}/networks/switches/history?{query}",
      "requestSchema": "schema.json",
      "responseSchema": "schema.json",
      "timeout": 0,
      "sendEmpty": false,
      "sendGetBody": false,
      "requestDatatype": "JSON",
      "responseDatatype": "JSON",
      "headers": {},
      "responseObjects": [
        {
          "type": "default",
          "key": "",
          "mockFile": ""
        }
      ]
    },
    {
      "name": "getNetwork",
      "protocol": "REST",
      "method": "GET",
      "entitypath": "{base_path}/{version}/top-down/fabrics/{pathv1}/networks/{pathv2}?{query}",
      "requestSchema": "schema.json",
      "responseSchema": "schema.json",
      "timeout": 0,
      "sendEmpty": false,
      "sendGetBody": false,
      "requestDatatype": "JSON",
      "responseDatatype": "JSON",
      "headers": {},
      "responseObjects": [
        {
          "type": "default",
          "key": "",
          "mockFile": ""
        }
      ]
    },
    {
      "name": "updateNetwork",
      "protocol": "REST",
      "method": "PUT",
      "entitypath": "{base_path}/{version}/top-down/fabrics/{pathv1}/networks/{pathv2}?{query}",
      "requestSchema": "schema.json",
      "responseSchema": "schema.json",
      "timeout": 0,
      "sendEmpty": false,
      "requestDatatype": "JSON",
      "responseDatatype": "JSON",
      "headers": {},
      "responseObjects": [
        {
          "type": "default",
          "key": "",
          "mockFile": ""
        }
      ]
    },
    {
      "name": "deleteNetwork",
      "protocol": "REST",
      "method": "DELETE",
      "entitypath": "{base_path}/{version}/top-down/fabrics/{pathv1}/networks/{pathv2}?{query}",
      "requestSchema": "schema.json",
      "responseSchema": "schema.json",
      "timeout": 0,
      "sendEmpty": false,
      "requestDatatype": "JSON",
      "responseDatatype": "JSON",
      "headers": {},
      "responseObjects": [
        {
          "type": "default",
          "key": "",
          "mockFile": ""
        }
      ]
    },
    {
      "name": "getSingleNetworkAttachDetails",
      "protocol": "REST",
      "method": "GET",
      "entitypath": "{base_path}/{version}/top-down/fabrics/{pathv1}/networks/{pathv2}/attachments?{query}",
      "requestSchema": "schema.json",
      "responseSchema": "schema.json",
      "timeout": 0,
      "sendEmpty": false,
      "sendGetBody": false,
      "requestDatatype": "JSON",
      "responseDatatype": "JSON",
      "headers": {},
      "responseObjects": [
        {
          "type": "default",
          "key": "",
          "mockFile": ""
        }
      ]
    },
    {
      "name": "attachNetwork",
      "protocol": "REST",
      "method": "POST",
      "entitypath": "{base_path}/{version}/top-down/fabrics/{pathv1}/networks/{pathv2}/attachments?{query}",
      "requestSchema": "schema.json",
      "responseSchema": "schema.json",
      "timeout": 0,
      "sendEmpty": false,
      "requestDatatype": "JSON",
      "responseDatatype": "JSON",
      "headers": {},
      "responseObjects": [
        {
          "type": "default",
          "key": "",
          "mockFile": ""
        }
      ]
    },
    {
      "name": "deployNetwork",
      "protocol": "REST",
      "method": "POST",
      "entitypath": "{base_path}/{version}/top-down/fabrics/{pathv1}/networks/{pathv2}/deploy?{query}",
      "requestSchema": "schema.json",
      "responseSchema": "schema.json",
      "timeout": 0,
      "sendEmpty": false,
      "requestDatatype": "JSON",
      "responseDatatype": "JSON",
      "headers": {},
      "responseObjects": [
        {
          "type": "default",
          "key": "",
          "mockFile": ""
        }
      ]
    },
    {
      "name": "previewNetwork",
      "protocol": "REST",
      "method": "GET",
      "entitypath": "{base_path}/{version}/top-down/fabrics/{pathv1}/networks/{pathv2}/preview?{query}",
      "requestSchema": "schema.json",
      "responseSchema": "schema.json",
      "timeout": 0,
      "sendEmpty": false,
      "sendGetBody": false,
      "requestDatatype": "JSON",
      "responseDatatype": "JSON",
      "headers": {},
      "responseObjects": [
        {
          "type": "default",
          "key": "",
          "mockFile": ""
        }
      ]
    },
    {
      "name": "networkStatusDetails",
      "protocol": "REST",
      "method": "GET",
      "entitypath": "{base_path}/{version}/top-down/fabrics/{pathv1}/networks/{pathv2}/status?{query}",
      "requestSchema": "schema.json",
      "responseSchema": "schema.json",
      "timeout": 0,
      "sendEmpty": false,
      "sendGetBody": false,
      "requestDatatype": "JSON",
      "responseDatatype": "JSON",
      "headers": {},
      "responseObjects": [
        {
          "type": "default",
          "key": "",
          "mockFile": ""
        }
      ]
    },
    {
      "name": "getSingleSwitchDeploymentHistory",
      "protocol": "REST",
      "method": "GET",
      "entitypath": "{base_path}/{version}/top-down/fabrics/{pathv1}/networks/{pathv2}/switches/{pathv3}/history?{query}",
      "requestSchema": "schema.json",
      "responseSchema": "schema.json",
      "timeout": 0,
      "sendEmpty": false,
      "sendGetBody": false,
      "requestDatatype": "JSON",
      "responseDatatype": "JSON",
      "headers": {},
      "responseObjects": [
        {
          "type": "default",
          "key": "",
          "mockFile": ""
        }
      ]
    },
    {
      "name": "getAllPortsAndStatusForSingle",
      "protocol": "REST",
      "method": "GET",
      "entitypath": "{base_path}/{version}/top-down/fabrics/{pathv1}/networks/{pathv2}/switches/{pathv3}/ports?{query}",
      "requestSchema": "schema.json",
      "responseSchema": "schema.json",
      "timeout": 0,
      "sendEmpty": false,
      "sendGetBody": false,
      "requestDatatype": "JSON",
      "responseDatatype": "JSON",
      "headers": {},
      "responseObjects": [
        {
          "type": "default",
          "key": "",
          "mockFile": ""
        }
      ]
    },
    {
      "name": "deleteServiceNetwork",
      "protocol": "REST",
      "method": "DELETE",
      "entitypath": "{base_path}/{version}/top-down/fabrics/{pathv1}/servicenetworks/{pathv2}?{query}",
      "requestSchema": "schema.json",
      "responseSchema": "schema.json",
      "timeout": 0,
      "sendEmpty": false,
      "requestDatatype": "JSON",
      "responseDatatype": "JSON",
      "headers": {},
      "responseObjects": [
        {
          "type": "default",
          "key": "",
          "mockFile": ""
        }
      ]
    }
  ]
}