{
  "actions": [
    {
      "name": "getAPICPhysicalInterfaces",
      "protocol": "REST",
      "method": "GET",
      "entitypath": "{base_path}/{version}/api/node/class/cnwPhysIf.xml?{query}",
      "requestSchema": "schema.json",
      "responseSchema": "schema.json",
      "timeout": 0,
      "sendEmpty": false,
      "sendGetBody": false,
      "requestDatatype": "JSON",
      "responseDatatype": "JSON",
      "headers": {},
      "responseObjects": [
        {
          "type": "default",
          "key": "",
          "mockFile": ""
        }
      ]
    },
    {
      "name": "getAPICAggregateInterfaces",
      "protocol": "REST",
      "method": "GET",
      "entitypath": "{base_path}/{version}/api/node/class/cnwAggrIf.xml?{query}",
      "requestSchema": "schema.json",
      "responseSchema": "schema.json",
      "timeout": 0,
      "sendEmpty": false,
      "sendGetBody": false,
      "requestDatatype": "JSON",
      "responseDatatype": "JSON",
      "headers": {},
      "responseObjects": [
        {
          "type": "default",
          "key": "",
          "mockFile": ""
        }
      ]
    },
    {
      "name": "getAPICLayer3ManagementInterfaces",
      "protocol": "REST",
      "method": "GET",
      "entitypath": "{base_path}/{version}/api/node/class/l3Inst.xml?{query}",
      "requestSchema": "schema.json",
      "responseSchema": "schema.json",
      "timeout": 0,
      "sendEmpty": false,
      "sendGetBody": false,
      "requestDatatype": "JSON",
      "responseDatatype": "JSON",
      "headers": {},
      "responseObjects": [
        {
          "type": "default",
          "key": "",
          "mockFile": ""
        }
      ]
    },
    {
      "name": "getAPICPhysicalInterfacesJSON",
      "protocol": "REST",
      "method": "GET",
      "entitypath": "{base_path}/{version}/api/node/class/cnwPhysIf.json?{query}",
      "requestSchema": "schema.json",
      "responseSchema": "schema.json",
      "timeout": 0,
      "sendEmpty": false,
      "sendGetBody": false,
      "requestDatatype": "JSON",
      "responseDatatype": "JSON",
      "headers": {},
      "responseObjects": [
        {
          "type": "default",
          "key": "",
          "mockFile": ""
        }
      ]
    },
    {
      "name": "getAPICAggregateInterfacesJSON",
      "protocol": "REST",
      "method": "GET",
      "entitypath": "{base_path}/{version}/api/node/class/cnwAggrIf.json?{query}",
      "requestSchema": "schema.json",
      "responseSchema": "schema.json",
      "timeout": 0,
      "sendEmpty": false,
      "sendGetBody": false,
      "requestDatatype": "JSON",
      "responseDatatype": "JSON",
      "headers": {},
      "responseObjects": [
        {
          "type": "default",
          "key": "",
          "mockFile": ""
        }
      ]
    },
    {
      "name": "getAPICLayer3ManagementInterfacesJSON",
      "protocol": "REST",
      "method": "GET",
      "entitypath": "{base_path}/{version}/api/node/class/l3Inst.json?{query}",
      "requestSchema": "schema.json",
      "responseSchema": "schema.json",
      "timeout": 0,
      "sendEmpty": false,
      "sendGetBody": false,
      "requestDatatype": "JSON",
      "responseDatatype": "JSON",
      "headers": {},
      "responseObjects": [
        {
          "type": "default",
          "key": "",
          "mockFile": ""
        }
      ]
    }
  ]
}