{
    "actions": [
      {
        "name": "getEndpointGroupsJSON",
        "protocol": "REST",
        "method": "GET",
        "entitypath": "{base_path}/{version}/api/class/fvAEPg.json?{query}",
        "requestSchema": "schema.json",
        "responseSchema": "schema.json",
        "timeout": 0,
        "sendEmpty": false,
        "sendGetBody": false,
        "requestDatatype": "JSON",
        "responseDatatype": "JSON",
        "headers": {},
        "responseObjects": [
          {
            "type": "default",
            "key": "",
            "mockFile": ""
          }
        ]
      },
      {
        "name": "getEndpointGroupDetailsJSON",
        "protocol": "REST",
        "method": "GET",
        "entitypath": "{base_path}/{version}/api/node/class/fvAEPg.json?{query}",
        "requestSchema": "schema.json",
        "responseSchema": "schema.json",
        "timeout": 0,
        "sendEmpty": false,
        "sendGetBody": false,
        "requestDatatype": "JSON",
        "responseDatatype": "JSON",
        "headers": {},
        "responseObjects": [
          {
            "type": "default",
            "key": "",
            "mockFile": ""
          }
        ]
      }
    ]
  }