{
  "actions": [
    {
      "name": "getTenantXHealthScore",
      "protocol": "REST",
      "method": "GET",
      "entitypath": "{base_path}/{version}/api/node/mo/uni/{pathv1}.xml?{query}",
      "requestSchema": "schema.json",
      "responseSchema": "schema.json",
      "timeout": 0,
      "sendEmpty": false,
      "sendGetBody": false,
      "requestDatatype": "JSON",
      "responseDatatype": "JSON",
      "headers": {},
      "responseObjects": [
        {
          "type": "default",
          "key": "",
          "mockFile": ""
        }
      ]
    },
    {
      "name": "getTenantXStatistics",
      "protocol": "REST",
      "method": "GET",
      "entitypath": "{base_path}/{version}/api/node/mo/uni/{pathv1}?{query}",
      "requestSchema": "schema.json",
      "responseSchema": "schema.json",
      "timeout": 0,
      "sendEmpty": false,
      "sendGetBody": false,
      "requestDatatype": "JSON",
      "responseDatatype": "JSON",
      "headers": {},
      "responseObjects": [
        {
          "type": "default",
          "key": "",
          "mockFile": ""
        }
      ]
    },
    {
      "name": "getFaultsforLeaf",
      "protocol": "REST",
      "method": "GET",
      "entitypath": "{base_path}/{version}/api/node/mo/topology/{pathv1}/{pathv2}.xml?{query}",
      "requestSchema": "schema.json",
      "responseSchema": "schema.json",
      "timeout": 0,
      "sendEmpty": false,
      "sendGetBody": false,
      "requestDatatype": "JSON",
      "responseDatatype": "JSON",
      "headers": {},
      "responseObjects": [
        {
          "type": "default",
          "key": "",
          "mockFile": ""
        }
      ]
    },
    {
      "name": "getLeafInterfaceStats",
      "protocol": "REST",
      "method": "GET",
      "entitypath": "{base_path}/{version}/api/node/mo/topology/{pathv1}/{pathv2}/sys/{pathv3}/HDeqptIngrTotal5min-0.json?{query}",
      "requestSchema": "schema.json",
      "responseSchema": "schema.json",
      "timeout": 0,
      "sendEmpty": false,
      "sendGetBody": false,
      "requestDatatype": "JSON",
      "responseDatatype": "JSON",
      "headers": {},
      "responseObjects": [
        {
          "type": "default",
          "key": "",
          "mockFile": ""
        }
      ]
    },
    {
      "name": "ePGThroughputStats",
      "protocol": "REST",
      "method": "GET",
      "entitypath": "{base_path}/{version}/api/node/mo/uni/{pathv1}/ap-Two-Server-ANP/epg-Server1-epg.xml?{query}",
      "requestSchema": "schema.json",
      "responseSchema": "schema.json",
      "timeout": 0,
      "sendEmpty": false,
      "sendGetBody": false,
      "requestDatatype": "JSON",
      "responseDatatype": "JSON",
      "headers": {},
      "responseObjects": [
        {
          "type": "default",
          "key": "",
          "mockFile": ""
        }
      ]
    },
    {
      "name": "getLLDPNeighbors",
      "protocol": "REST",
      "method": "GET",
      "entitypath": "{base_path}/{version}/api/node/mo/topology/{pathv1}/{pathv2}/sys/lldp/inst/{pathv3}.json?{query}",
      "requestSchema": "schema.json",
      "responseSchema": "schema.json",
      "timeout": 0,
      "sendEmpty": false,
      "sendGetBody": false,
      "requestDatatype": "JSON",
      "responseDatatype": "JSON",
      "headers": {},
      "responseObjects": [
        {
          "type": "default",
          "key": "",
          "mockFile": ""
        }
      ]
    },
    {
      "name": "getTenantXHealthScoreJSON",
      "protocol": "REST",
      "method": "GET",
      "entitypath": "{base_path}/{version}/api/node/mo/uni/{pathv1}.json?{query}",
      "requestSchema": "schema.json",
      "responseSchema": "schema.json",
      "timeout": 0,
      "sendEmpty": false,
      "sendGetBody": false,
      "requestDatatype": "JSON",
      "responseDatatype": "JSON",
      "headers": {},
      "responseObjects": [
        {
          "type": "default",
          "key": "",
          "mockFile": ""
        }
      ]
    },
    {
      "name": "getFaultsforLeafJSON",
      "protocol": "REST",
      "method": "GET",
      "entitypath": "{base_path}/{version}/api/node/mo/topology/{pathv1}/{pathv2}.json?{query}",
      "requestSchema": "schema.json",
      "responseSchema": "schema.json",
      "timeout": 0,
      "sendEmpty": false,
      "sendGetBody": false,
      "requestDatatype": "JSON",
      "responseDatatype": "JSON",
      "headers": {},
      "responseObjects": [
        {
          "type": "default",
          "key": "",
          "mockFile": ""
        }
      ]
    },
    {
      "name": "getLeafInterfaceStatsJSON",
      "protocol": "REST",
      "method": "GET",
      "entitypath": "{base_path}/{version}/api/node/mo/topology/{pathv1}/{pathv2}/sys/{pathv3}/HDeqptIngrTotal5min-0.json?{query}",
      "requestSchema": "schema.json",
      "responseSchema": "schema.json",
      "timeout": 0,
      "sendEmpty": false,
      "sendGetBody": false,
      "requestDatatype": "JSON",
      "responseDatatype": "JSON",
      "headers": {},
      "responseObjects": [
        {
          "type": "default",
          "key": "",
          "mockFile": ""
        }
      ]
    },
    {
      "name": "ePGThroughputStatsJSON",
      "protocol": "REST",
      "method": "GET",
      "entitypath": "{base_path}/{version}/api/node/mo/uni/{pathv1}/ap-Two-Server-ANP/epg-Server1-epg.json?{query}",
      "requestSchema": "schema.json",
      "responseSchema": "schema.json",
      "timeout": 0,
      "sendEmpty": false,
      "sendGetBody": false,
      "requestDatatype": "JSON",
      "responseDatatype": "JSON",
      "headers": {},
      "responseObjects": [
        {
          "type": "default",
          "key": "",
          "mockFile": ""
        }
      ]
    },
    {
      "name": "getLLDPNeighborsJSON",
      "protocol": "REST",
      "method": "GET",
      "entitypath": "{base_path}/{version}/api/node/mo/topology/{pathv1}/{pathv2}/sys/lldp/inst/{pathv3}.json?{query}",
      "requestSchema": "schema.json",
      "responseSchema": "schema.json",
      "timeout": 0,
      "sendEmpty": false,
      "sendGetBody": false,
      "requestDatatype": "JSON",
      "responseDatatype": "JSON",
      "headers": {},
      "responseObjects": [
        {
          "type": "default",
          "key": "",
          "mockFile": ""
        }
      ]
    }
  ]
}