{
  "actions": [
    {
      "name": "getTpesV6",
      "protocol": "REST",
      "method": "GET",
      "entitypath": "{base_path}/{version}/nsi/api/v6/tpes?{query}",
      "requestSchema": "schema.json",
      "responseSchema": "schema.json",
      "timeout": 0,
      "sendEmpty": false,
      "sendGetBody": false,
      "requestDatatype": "JSON",
      "responseDatatype": "JSON",
      "headers": {},
      "responseObjects": [
        {
          "type": "default",
          "key": "",
          "mockFile": ""
        }
      ]
    },
    {
      "name": "postNsiApiV6Tpes",
      "protocol": "REST",
      "method": "POST",
      "entitypath": "{base_path}/{version}/nsi/api/v6/tpes?{query}",
      "requestSchema": "schema.json",
      "responseSchema": "schema.json",
      "timeout": 0,
      "sendEmpty": false,
      "requestDatatype": "JSON",
      "responseDatatype": "JSON",
      "headers": {},
      "responseObjects": [
        {
          "type": "default",
          "key": "",
          "mockFile": ""
        }
      ]
    },
    {
      "name": "postNsiApiV6TpesTrailtrace",
      "protocol": "REST",
      "method": "POST",
      "entitypath": "{base_path}/{version}/nsi/api/v6/tpes/trailtrace?{query}",
      "requestSchema": "schema.json",
      "responseSchema": "schema.json",
      "timeout": 0,
      "sendEmpty": false,
      "requestDatatype": "JSON",
      "responseDatatype": "JSON",
      "headers": {},
      "responseObjects": [
        {
          "type": "default",
          "key": "",
          "mockFile": ""
        }
      ]
    },
    {
      "name": "putNsiApiV6TpesTpeIdSuppressionPort",
      "protocol": "REST",
      "method": "PUT",
      "entitypath": "{base_path}/{version}/nsi/api/v6/tpes/{pathv1}/suppressionPort?{query}",
      "requestSchema": "schema.json",
      "responseSchema": "schema.json",
      "timeout": 0,
      "sendEmpty": false,
      "requestDatatype": "PLAIN",
      "responseDatatype": "JSON",
      "headers": {},
      "responseObjects": [
        {
          "type": "default",
          "key": "",
          "mockFile": ""
        }
      ]
    }
  ]
}