{
  "actions": [
    {
      "name": "getTapiCoreContextPhysicalContextDevice",
      "protocol": "REST",
      "method": "GET",
      "entitypath": "{base_path}/{version}/tapi/core/context/physical-context/device/?{query}",
      "requestSchema": "schema.json",
      "responseSchema": "schema.json",
      "timeout": 0,
      "sendEmpty": false,
      "sendGetBody": false,
      "requestDatatype": "JSON",
      "responseDatatype": "JSON",
      "headers": {
        "Accept": "application/json"
      },
      "responseObjects": [
        {
          "type": "default",
          "key": "",
          "mockFile": ""
        }
      ]
    },
    {
      "name": "getTapiDataContextPhysicalContextPhysicalSpan",
      "protocol": "REST",
      "method": "GET",
      "entitypath": "{base_path}/{version}/tapi/data/context/physical-context/physical-span/?{query}",
      "requestSchema": "schema.json",
      "responseSchema": "schema.json",
      "timeout": 0,
      "sendEmpty": false,
      "sendGetBody": false,
      "requestDatatype": "JSON",
      "responseDatatype": "JSON",
      "headers": {
        "Accept": "application/yang-data+json"
      },
      "responseObjects": [
        {
          "type": "default",
          "key": "",
          "mockFile": ""
        }
      ]
    },
    {
      "name": "getTapiDataTapiCommonContextTapiEquipmentPhysicalContextPhysicalSpan",
      "protocol": "REST",
      "method": "GET",
      "entitypath": "{base_path}/{version}/tapi/data/tapi-common:context/tapi-equipment:physical-context/physical-span/?{query}",
      "requestSchema": "schema.json",
      "responseSchema": "schema.json",
      "timeout": 0,
      "sendEmpty": false,
      "sendGetBody": false,
      "requestDatatype": "JSON",
      "responseDatatype": "JSON",
      "headers": {
        "Accept": "application/yang-data+json"
      },
      "responseObjects": [
        {
          "type": "default",
          "key": "",
          "mockFile": ""
        }
      ]
    },
    {
      "name": "getTapiDataContextPhysicalContextPhysicalSpanUuid",
      "protocol": "REST",
      "method": "GET",
      "entitypath": "{base_path}/{version}/tapi/data/context/physical-context/{pathv1}?{query}",
      "requestSchema": "schema.json",
      "responseSchema": "schema.json",
      "timeout": 0,
      "sendEmpty": false,
      "sendGetBody": false,
      "requestDatatype": "JSON",
      "responseDatatype": "JSON",
      "headers": {
        "Accept": "application/yang-data+json"
      },
      "responseObjects": [
        {
          "type": "default",
          "key": "",
          "mockFile": ""
        }
      ]
    },
    {
      "name": "getTapiDataTapiCommonContextTapiEquipmentPhysicalContextPhysicalSpanUuid",
      "protocol": "REST",
      "method": "GET",
      "entitypath": "{base_path}/{version}/tapi/data/tapi-common:context/tapi-equipment:physical-context/{pathv1}?{query}",
      "requestSchema": "schema.json",
      "responseSchema": "schema.json",
      "timeout": 0,
      "sendEmpty": false,
      "sendGetBody": false,
      "requestDatatype": "JSON",
      "responseDatatype": "JSON",
      "headers": {
        "Accept": "application/yang-data+json"
      },
      "responseObjects": [
        {
          "type": "default",
          "key": "",
          "mockFile": ""
        }
      ]
    },
    {
      "name": "getTapiDataContextPhysicalContextDevice",
      "protocol": "REST",
      "method": "GET",
      "entitypath": "{base_path}/{version}/tapi/data/context/physical-context/device/?{query}",
      "requestSchema": "schema.json",
      "responseSchema": "schema.json",
      "timeout": 0,
      "sendEmpty": false,
      "sendGetBody": false,
      "requestDatatype": "JSON",
      "responseDatatype": "JSON",
      "headers": {
        "Accept": "application/yang-data+json"
      },
      "responseObjects": [
        {
          "type": "default",
          "key": "",
          "mockFile": ""
        }
      ]
    },
    {
      "name": "getTapiDataTapiCommonContextTapiEquipmentPhysicalContextDevice",
      "protocol": "REST",
      "method": "GET",
      "entitypath": "{base_path}/{version}/tapi/data/tapi-common:context/tapi-equipment:physical-context/device/?{query}",
      "requestSchema": "schema.json",
      "responseSchema": "schema.json",
      "timeout": 0,
      "sendEmpty": false,
      "sendGetBody": false,
      "requestDatatype": "JSON",
      "responseDatatype": "JSON",
      "headers": {
        "Accept": "application/yang-data+json"
      },
      "responseObjects": [
        {
          "type": "default",
          "key": "",
          "mockFile": ""
        }
      ]
    },
    {
      "name": "getTapiDataContextPhysicalContextDeviceUuid",
      "protocol": "REST",
      "method": "GET",
      "entitypath": "{base_path}/{version}/tapi/data/context/physical-context/{pathv1}?{query}",
      "requestSchema": "schema.json",
      "responseSchema": "schema.json",
      "timeout": 0,
      "sendEmpty": false,
      "sendGetBody": false,
      "requestDatatype": "JSON",
      "responseDatatype": "JSON",
      "headers": {
        "Accept": "application/yang-data+json"
      },
      "responseObjects": [
        {
          "type": "default",
          "key": "",
          "mockFile": ""
        }
      ]
    },
    {
      "name": "getTapiDataTapiCommonContextTapiEquipmentPhysicalContextDeviceUuid",
      "protocol": "REST",
      "method": "GET",
      "entitypath": "{base_path}/{version}/tapi/data/tapi-common:context/tapi-equipment:physical-context/{pathv1}?{query}",
      "requestSchema": "schema.json",
      "responseSchema": "schema.json",
      "timeout": 0,
      "sendEmpty": false,
      "sendGetBody": false,
      "requestDatatype": "JSON",
      "responseDatatype": "JSON",
      "headers": {
        "Accept": "application/yang-data+json"
      },
      "responseObjects": [
        {
          "type": "default",
          "key": "",
          "mockFile": ""
        }
      ]
    },
    {
      "name": "getTapiCoreContextPhysicalContextEquipment",
      "protocol": "REST",
      "method": "GET",
      "entitypath": "{base_path}/{version}/tapi/core/context/physical-context/equipment/?{query}",
      "requestSchema": "schema.json",
      "responseSchema": "schema.json",
      "timeout": 0,
      "sendEmpty": false,
      "sendGetBody": false,
      "requestDatatype": "JSON",
      "responseDatatype": "JSON",
      "headers": {
        "Accept": "application/json"
      },
      "responseObjects": [
        {
          "type": "default",
          "key": "",
          "mockFile": ""
        }
      ]
    },
    {
      "name": "getTapiDataContextPhysicalContextEquipment",
      "protocol": "REST",
      "method": "GET",
      "entitypath": "{base_path}/{version}/tapi/data/context/physical-context/equipment/?{query}",
      "requestSchema": "schema.json",
      "responseSchema": "schema.json",
      "timeout": 0,
      "sendEmpty": false,
      "sendGetBody": false,
      "requestDatatype": "JSON",
      "responseDatatype": "JSON",
      "headers": {
        "Accept": "application/yang-data+json"
      },
      "responseObjects": [
        {
          "type": "default",
          "key": "",
          "mockFile": ""
        }
      ]
    },
    {
      "name": "getTapiDataTapiCommonContextTapiEquipmentPhysicalContextEquipment",
      "protocol": "REST",
      "method": "GET",
      "entitypath": "{base_path}/{version}/tapi/data/tapi-common:context/tapi-equipment:physical-context/equipment/?{query}",
      "requestSchema": "schema.json",
      "responseSchema": "schema.json",
      "timeout": 0,
      "sendEmpty": false,
      "sendGetBody": false,
      "requestDatatype": "JSON",
      "responseDatatype": "JSON",
      "headers": {
        "Accept": "application/yang-data+json"
      },
      "responseObjects": [
        {
          "type": "default",
          "key": "",
          "mockFile": ""
        }
      ]
    },
    {
      "name": "getTapiDataContextPhysicalContextEquipmentEquipmentUuid",
      "protocol": "REST",
      "method": "GET",
      "entitypath": "{base_path}/{version}/tapi/data/context/physical-context/{pathv1}?{query}",
      "requestSchema": "schema.json",
      "responseSchema": "schema.json",
      "timeout": 0,
      "sendEmpty": false,
      "sendGetBody": false,
      "requestDatatype": "JSON",
      "responseDatatype": "JSON",
      "headers": {
        "Accept": "application/yang-data+json"
      },
      "responseObjects": [
        {
          "type": "default",
          "key": "",
          "mockFile": ""
        }
      ]
    },
    {
      "name": "getTapiDataTapiCommonContextTapiEquipmentPhysicalContextEquipmentEquipmentUuid",
      "protocol": "REST",
      "method": "GET",
      "entitypath": "{base_path}/{version}/tapi/data/tapi-common:context/tapi-equipment:physical-context/{pathv1}?{query}",
      "requestSchema": "schema.json",
      "responseSchema": "schema.json",
      "timeout": 0,
      "sendEmpty": false,
      "sendGetBody": false,
      "requestDatatype": "JSON",
      "responseDatatype": "JSON",
      "headers": {
        "Accept": "application/yang-data+json"
      },
      "responseObjects": [
        {
          "type": "default",
          "key": "",
          "mockFile": ""
        }
      ]
    },
    {
      "name": "getTapiDataContextPhysicalContextDeviceUuidEquipmentEquipmentUuid",
      "protocol": "REST",
      "method": "GET",
      "entitypath": "{base_path}/{version}/tapi/data/context/physical-context/{pathv1}/{pathv2}?{query}",
      "requestSchema": "schema.json",
      "responseSchema": "schema.json",
      "timeout": 0,
      "sendEmpty": false,
      "sendGetBody": false,
      "requestDatatype": "JSON",
      "responseDatatype": "JSON",
      "headers": {
        "Accept": "application/yang-data+json"
      },
      "responseObjects": [
        {
          "type": "default",
          "key": "",
          "mockFile": ""
        }
      ]
    },
    {
      "name": "getTapiCoreContextPhysicalContextEquipmentholder",
      "protocol": "REST",
      "method": "GET",
      "entitypath": "{base_path}/{version}/tapi/core/context/physical-context/equipmentholder/?{query}",
      "requestSchema": "schema.json",
      "responseSchema": "schema.json",
      "timeout": 0,
      "sendEmpty": false,
      "sendGetBody": false,
      "requestDatatype": "JSON",
      "responseDatatype": "JSON",
      "headers": {
        "Accept": "application/json"
      },
      "responseObjects": [
        {
          "type": "default",
          "key": "",
          "mockFile": ""
        }
      ]
    },
    {
      "name": "getTapiDataContextPhysicalContextEquipmentholder",
      "protocol": "REST",
      "method": "GET",
      "entitypath": "{base_path}/{version}/tapi/data/context/physical-context/equipmentholder/?{query}",
      "requestSchema": "schema.json",
      "responseSchema": "schema.json",
      "timeout": 0,
      "sendEmpty": false,
      "sendGetBody": false,
      "requestDatatype": "JSON",
      "responseDatatype": "JSON",
      "headers": {
        "Accept": "application/yang-data+json"
      },
      "responseObjects": [
        {
          "type": "default",
          "key": "",
          "mockFile": ""
        }
      ]
    },
    {
      "name": "getTapiDataTapiCommonContextTapiEquipmentPhysicalContextEquipmentholder",
      "protocol": "REST",
      "method": "GET",
      "entitypath": "{base_path}/{version}/tapi/data/tapi-common:context/tapi-equipment:physical-context/equipmentholder/?{query}",
      "requestSchema": "schema.json",
      "responseSchema": "schema.json",
      "timeout": 0,
      "sendEmpty": false,
      "sendGetBody": false,
      "requestDatatype": "JSON",
      "responseDatatype": "JSON",
      "headers": {
        "Accept": "application/yang-data+json"
      },
      "responseObjects": [
        {
          "type": "default",
          "key": "",
          "mockFile": ""
        }
      ]
    },
    {
      "name": "getTapiDataContextPhysicalContextEquipmentholderEquipmentholderUuid",
      "protocol": "REST",
      "method": "GET",
      "entitypath": "{base_path}/{version}/tapi/data/context/physical-context/{pathv1}?{query}",
      "requestSchema": "schema.json",
      "responseSchema": "schema.json",
      "timeout": 0,
      "sendEmpty": false,
      "sendGetBody": false,
      "requestDatatype": "JSON",
      "responseDatatype": "JSON",
      "headers": {
        "Accept": "application/yang-data+json"
      },
      "responseObjects": [
        {
          "type": "default",
          "key": "",
          "mockFile": ""
        }
      ]
    },
    {
      "name": "getTapiDataTapiCommonContextTapiEquipmentPhysicalContextEquipmentholderEquipmentholderUuid",
      "protocol": "REST",
      "method": "GET",
      "entitypath": "{base_path}/{version}/tapi/data/tapi-common:context/tapi-equipment:physical-context/{pathv1}?{query}",
      "requestSchema": "schema.json",
      "responseSchema": "schema.json",
      "timeout": 0,
      "sendEmpty": false,
      "sendGetBody": false,
      "requestDatatype": "JSON",
      "responseDatatype": "JSON",
      "headers": {
        "Accept": "application/yang-data+json"
      },
      "responseObjects": [
        {
          "type": "default",
          "key": "",
          "mockFile": ""
        }
      ]
    }
  ]
}