{
  "actions": [
    {
      "name": "getReportScheduleForReportType",
      "protocol": "REST",
      "method": "GET",
      "entitypath": "{base_path}/{version}/reporting/api/v1/schedule?{query}",
      "requestSchema": "schema.json",
      "responseSchema": "schema.json",
      "timeout": 0,
      "sendEmpty": false,
      "sendGetBody": false,
      "requestDatatype": "JSON",
      "responseDatatype": "JSON",
      "headers": {},
      "responseObjects": [
        {
          "type": "default",
          "key": "",
          "mockFile": "mockdatafiles/getReportScheduleForReportType-default.json"
        }
      ]
    },
    {
      "name": "createReportSchedule",
      "protocol": "REST",
      "method": "POST",
      "entitypath": "{base_path}/{version}/reporting/api/v1/schedule/create?{query}",
      "requestSchema": "schema.json",
      "responseSchema": "schema.json",
      "timeout": 0,
      "sendEmpty": false,
      "requestDatatype": "JSON",
      "responseDatatype": "JSON",
      "headers": {},
      "responseObjects": [
        {
          "type": "default",
          "key": "",
          "mockFile": ""
        }
      ]
    },
    {
      "name": "deleteReportScheduleForResourceId",
      "protocol": "REST",
      "method": "DELETE",
      "entitypath": "{base_path}/{version}/reporting/api/v1/schedule/delete/{pathv1}?{query}",
      "requestSchema": "schema.json",
      "responseSchema": "schema.json",
      "timeout": 0,
      "sendEmpty": false,
      "requestDatatype": "JSON",
      "responseDatatype": "JSON",
      "headers": {},
      "responseObjects": [
        {
          "type": "default",
          "key": "",
          "mockFile": ""
        }
      ]
    },
    {
      "name": "getReportScheduleOnResourceId",
      "protocol": "REST",
      "method": "GET",
      "entitypath": "{base_path}/{version}/reporting/api/v1/schedule/{pathv1}?{query}",
      "requestSchema": "schema.json",
      "responseSchema": "schema.json",
      "timeout": 0,
      "sendEmpty": false,
      "sendGetBody": false,
      "requestDatatype": "JSON",
      "responseDatatype": "JSON",
      "headers": {},
      "responseObjects": [
        {
          "type": "default",
          "key": "",
          "mockFile": ""
        }
      ]
    }
  ]
}