{
  "$id": "schema.json",
  "type": "object",
  "schema": "http://json-schema.org/draft-07/schema#",
  "translate": true,
  "dynamicfields": true,
  "properties": {
    "ph_request_type": {
      "type": "string",
      "description": "type of request (internal to adapter)",
      "default": "usergroupsList",
      "enum": [
        "usergroupsList",
        "usergroupsCreate",
        "usergroupsRead",
        "usergroupsUpdate",
        "usergroupsPartialUpdate",
        "usergroupsDelete",
        "usergroupsAddParents",
        "usergroupsAddRoles",
        "usergroupsAddUsers",
        "usergroupsRemoveParents",
        "usergroupsRemoveRoles",
        "usergroupsRemoveUsers"
      ],
      "external_name": "ph_request_type"
    },
    "clientInactivityTime": {
      "type": "number",
      "description": "timeout in seconds of inactivity",
      "parse": false,
      "encode": false,
      "encrypt": {
        "type": "AES",
        "key": ""
      },
      "external_name": "client_inactivity_time"
    },
    "tokenExpirationTime": {
      "type": "number",
      "description": "token expires in timeout seconds from created time",
      "parse": false,
      "encode": false,
      "encrypt": {
        "type": "AES",
        "key": ""
      },
      "external_name": "token_expiration_time"
    },
    "dormancyDays": {
      "type": "number",
      "description": "number of days before an account can become dormant",
      "parse": false,
      "encode": false,
      "encrypt": {
        "type": "AES",
        "key": ""
      },
      "external_name": "dormancy_days"
    },
    "concurrentSessionMax": {
      "type": "number",
      "description": "The maximum number of concurrent sessions. (0=infinity)",
      "parse": false,
      "encode": false,
      "encrypt": {
        "type": "AES",
        "key": ""
      },
      "external_name": "concurrent_session_max"
    }
  },
  "definitions": {}
}