{
  "$id": "schema.json",
  "type": "object",
  "schema": "http://json-schema.org/draft-07/schema#",
  "translate": true,
  "dynamicfields": true,
  "properties": {
    "ph_request_type": {
      "type": "string",
      "description": "type of request (internal to adapter)",
      "default": "getTapiDataTapiCommonContextTapiConnectivityConnectivityContextConnectivityService",
      "enum": [
        "getTapiDataTapiCommonContextTapiConnectivityConnectivityContextConnectivityService",
        "getTapiDataTapiCommonContextTapiConnectivityConnectivityContextConnection"
      ],
      "external_name": "ph_request_type"
    },
    "pageNumber": {
      "type": "number",
      "description": "(Optional) The page to return",
      "parse": false,
      "encode": false,
      "encrypt": {
        "type": "AES",
        "key": ""
      },
      "external_name": "page[number]"
    },
    "pageSize": {
      "type": "number",
      "description": "(Optional) The size of a returned page",
      "parse": false,
      "encode": false,
      "encrypt": {
        "type": "AES",
        "key": ""
      },
      "external_name": "page[size]"
    }
  },
  "definitions": {}
}