{
  "actions": [
    {
      "name": "getTotalRecordsCount",
      "protocol": "REST",
      "method": "GET",
      "entitypath": "{base_path}/{version}/nsa/api/v1/alarms/alarmRecordsCounts?{query}",
      "requestSchema": "schema.json",
      "responseSchema": "schema.json",
      "timeout": 0,
      "sendEmpty": false,
      "sendGetBody": false,
      "requestDatatype": "JSON",
      "responseDatatype": "JSON",
      "headers": {},
      "responseObjects": [
        {
          "type": "default",
          "key": "",
          "mockFile": ""
        }
      ]
    },
    {
      "name": "getDeviceTypes",
      "protocol": "REST",
      "method": "GET",
      "entitypath": "{base_path}/{version}/nsa/api/v1/alarms/device-types?{query}",
      "requestSchema": "schema.json",
      "responseSchema": "schema.json",
      "timeout": 0,
      "sendEmpty": false,
      "sendGetBody": false,
      "requestDatatype": "JSON",
      "responseDatatype": "JSON",
      "headers": {},
      "responseObjects": [
        {
          "type": "default",
          "key": "",
          "mockFile": ""
        }
      ]
    },
    {
      "name": "getDeviceAttributes",
      "protocol": "REST",
      "method": "GET",
      "entitypath": "{base_path}/{version}/nsa/api/v1/alarms/deviceAttributes/{pathv1}?{query}",
      "requestSchema": "schema.json",
      "responseSchema": "schema.json",
      "timeout": 0,
      "sendEmpty": false,
      "sendGetBody": false,
      "requestDatatype": "JSON",
      "responseDatatype": "JSON",
      "headers": {},
      "responseObjects": [
        {
          "type": "default",
          "key": "",
          "mockFile": ""
        }
      ]
    },
    {
      "name": "removeOldHistoricalAlarms",
      "protocol": "REST",
      "method": "DELETE",
      "entitypath": "{base_path}/{version}/nsa/api/v1/alarms/historicalAlarms/{pathv1}?{query}",
      "requestSchema": "schema.json",
      "responseSchema": "schema.json",
      "timeout": 0,
      "sendEmpty": false,
      "requestDatatype": "JSON",
      "responseDatatype": "JSON",
      "headers": {},
      "responseObjects": [
        {
          "type": "default",
          "key": "",
          "mockFile": ""
        }
      ]
    },
    {
      "name": "getHistoricalChangePartition",
      "protocol": "REST",
      "method": "GET",
      "entitypath": "{base_path}/{version}/nsa/api/v1/alarms/historicalChangePartition?{query}",
      "requestSchema": "schema.json",
      "responseSchema": "schema.json",
      "timeout": 0,
      "sendEmpty": false,
      "sendGetBody": false,
      "requestDatatype": "JSON",
      "responseDatatype": "JSON",
      "headers": {},
      "responseObjects": [
        {
          "type": "default",
          "key": "",
          "mockFile": ""
        }
      ]
    },
    {
      "name": "getHistoricalDataRetentionDays",
      "protocol": "REST",
      "method": "GET",
      "entitypath": "{base_path}/{version}/nsa/api/v1/alarms/historicalDataRetentionDays?{query}",
      "requestSchema": "schema.json",
      "responseSchema": "schema.json",
      "timeout": 0,
      "sendEmpty": false,
      "sendGetBody": false,
      "requestDatatype": "JSON",
      "responseDatatype": "JSON",
      "headers": {},
      "responseObjects": [
        {
          "type": "default",
          "key": "",
          "mockFile": ""
        }
      ]
    },
    {
      "name": "setHistoricalDataRetentionDays",
      "protocol": "REST",
      "method": "PUT",
      "entitypath": "{base_path}/{version}/nsa/api/v1/alarms/historicalDataRetentionDays/{pathv1}?{query}",
      "requestSchema": "schema.json",
      "responseSchema": "schema.json",
      "timeout": 0,
      "sendEmpty": false,
      "requestDatatype": "JSON",
      "responseDatatype": "JSON",
      "headers": {},
      "responseObjects": [
        {
          "type": "default",
          "key": "",
          "mockFile": ""
        }
      ]
    },
    {
      "name": "acknowledgeAlarmV1",
      "protocol": "REST",
      "method": "POST",
      "entitypath": "{base_path}/{version}/nsa/api/v1/alarms/{pathv1}/acknowledge?{query}",
      "requestSchema": "schema.json",
      "responseSchema": "schema.json",
      "timeout": 0,
      "sendEmpty": false,
      "requestDatatype": "JSON",
      "responseDatatype": "JSON",
      "headers": {},
      "responseObjects": [
        {
          "type": "default",
          "key": "",
          "mockFile": ""
        }
      ]
    },
    {
      "name": "forceClearAlarmV1",
      "protocol": "REST",
      "method": "POST",
      "entitypath": "{base_path}/{version}/nsa/api/v1/alarms/{pathv1}/force-clear?{query}",
      "requestSchema": "schema.json",
      "responseSchema": "schema.json",
      "timeout": 0,
      "sendEmpty": false,
      "requestDatatype": "JSON",
      "responseDatatype": "JSON",
      "headers": {},
      "responseObjects": [
        {
          "type": "default",
          "key": "",
          "mockFile": ""
        }
      ]
    },
    {
      "name": "manualClearAlarmV1",
      "protocol": "REST",
      "method": "POST",
      "entitypath": "{base_path}/{version}/nsa/api/v1/alarms/{pathv1}/manual-clear?{query}",
      "requestSchema": "schema.json",
      "responseSchema": "schema.json",
      "timeout": 0,
      "sendEmpty": false,
      "requestDatatype": "JSON",
      "responseDatatype": "JSON",
      "headers": {},
      "responseObjects": [
        {
          "type": "default",
          "key": "",
          "mockFile": ""
        }
      ]
    },
    {
      "name": "unacknowledgeAlarmV1",
      "protocol": "REST",
      "method": "POST",
      "entitypath": "{base_path}/{version}/nsa/api/v1/alarms/{pathv1}/unacknowledge?{query}",
      "requestSchema": "schema.json",
      "responseSchema": "schema.json",
      "timeout": 0,
      "sendEmpty": false,
      "requestDatatype": "JSON",
      "responseDatatype": "JSON",
      "headers": {},
      "responseObjects": [
        {
          "type": "default",
          "key": "",
          "mockFile": ""
        }
      ]
    }
  ]
}