[
  {
    "id": "string",
    "label": "string",
    "description": "string",
    "resourceTypeId": "string",
    "productId": "string",
    "domainId": "string",
    "orderId": "string",
    "tenantId": "string",
    "shared": true,
    "sharingPermissionId": "string",
    "subDomainId": "string",
    "properties": {
      "obj": [
        {
          "_1": "string",
          "_2": {}
        },
        {
          "_1": "string",
          "_2": {}
        }
      ]
    },
    "providerResourceId": "string",
    "discovered": false,
    "differences": [
      {
        "tag": 6,
        "functionType": "STAMP",
        "vlanId": "string",
        "etherType": "ET_88E7"
      },
      {
        "tag": 6,
        "functionType": "POP",
        "vlanId": "string",
        "etherType": "ET_9100"
      },
      {
        "tag": 8,
        "functionType": "POP",
        "vlanId": "string",
        "etherType": "ET_9101"
      },
      {
        "tag": 6,
        "functionType": "STAMP",
        "vlanId": "string",
        "etherType": "ET_88A8"
      },
      {
        "tag": 7,
        "functionType": "PUSH",
        "vlanId": "string",
        "etherType": "ET_8100"
      },
      {
        "tag": 3,
        "functionType": "PUSH",
        "vlanId": "string",
        "etherType": "ET_9101"
      },
      {
        "tag": 3,
        "functionType": "POP",
        "vlanId": "string",
        "etherType": "ET_8100"
      },
      {
        "tag": 5,
        "functionType": "PUSH",
        "vlanId": "string",
        "etherType": "ET_88A8"
      }
    ],
    "desiredOrchState": "terminated",
    "nativeState": "string",
    "orchState": "inactive",
    "reason": "string",
    "tags": {},
    "providerData": {
      "obj": [
        {
          "_1": "string",
          "_2": {}
        }
      ]
    },
    "updatedAt": "string",
    "createdAt": "string",
    "revision": 5,
    "autoClean": false,
    "updateState": "failed",
    "updateReason": "string",
    "updateCount": 5
  },
  {
    "id": "string",
    "label": "string",
    "description": "string",
    "resourceTypeId": "string",
    "productId": "string",
    "domainId": "string",
    "orderId": "string",
    "tenantId": "string",
    "shared": true,
    "sharingPermissionId": "string",
    "subDomainId": "string",
    "properties": {
      "obj": [
        {
          "_1": "string",
          "_2": {}
        },
        {
          "_1": "string",
          "_2": {}
        },
        {
          "_1": "string",
          "_2": {}
        },
        {
          "_1": "string",
          "_2": {}
        },
        {
          "_1": "string",
          "_2": {}
        },
        {
          "_1": "string",
          "_2": {}
        },
        {
          "_1": "string",
          "_2": {}
        },
        {
          "_1": "string",
          "_2": {}
        }
      ]
    },
    "providerResourceId": "string",
    "discovered": true,
    "differences": [
      {
        "tag": 5,
        "functionType": "STAMP",
        "vlanId": "string",
        "etherType": "ET_9101"
      },
      {
        "tag": 5,
        "functionType": "POP",
        "vlanId": "string",
        "etherType": "ET_8100"
      },
      {
        "tag": 2,
        "functionType": "POP",
        "vlanId": "string",
        "etherType": "ET_9101"
      },
      {
        "tag": 8,
        "functionType": "PUSH",
        "vlanId": "string",
        "etherType": "ET_9100"
      },
      {
        "tag": 8,
        "functionType": "PUSH",
        "vlanId": "string",
        "etherType": "ET_88A8"
      },
      {
        "tag": 8,
        "functionType": "PUSH",
        "vlanId": "string",
        "etherType": "ET_9101"
      }
    ],
    "desiredOrchState": "assembled",
    "nativeState": "string",
    "orchState": "activating",
    "reason": "string",
    "tags": {},
    "providerData": {
      "obj": [
        {
          "_1": "string",
          "_2": {}
        },
        {
          "_1": "string",
          "_2": {}
        },
        {
          "_1": "string",
          "_2": {}
        },
        {
          "_1": "string",
          "_2": {}
        },
        {
          "_1": "string",
          "_2": {}
        },
        {
          "_1": "string",
          "_2": {}
        },
        {
          "_1": "string",
          "_2": {}
        },
        {
          "_1": "string",
          "_2": {}
        },
        {
          "_1": "string",
          "_2": {}
        }
      ]
    },
    "updatedAt": "string",
    "createdAt": "string",
    "revision": 6,
    "autoClean": true,
    "updateState": "failed",
    "updateReason": "string",
    "updateCount": 6
  },
  {
    "id": "string",
    "label": "string",
    "description": "string",
    "resourceTypeId": "string",
    "productId": "string",
    "domainId": "string",
    "orderId": "string",
    "tenantId": "string",
    "shared": false,
    "sharingPermissionId": "string",
    "subDomainId": "string",
    "properties": {
      "obj": [
        {
          "_1": "string",
          "_2": {}
        },
        {
          "_1": "string",
          "_2": {}
        },
        {
          "_1": "string",
          "_2": {}
        },
        {
          "_1": "string",
          "_2": {}
        },
        {
          "_1": "string",
          "_2": {}
        },
        {
          "_1": "string",
          "_2": {}
        }
      ]
    },
    "providerResourceId": "string",
    "discovered": false,
    "differences": [
      {
        "tag": 2,
        "functionType": "STAMP",
        "vlanId": "string",
        "etherType": "ET_88E7"
      },
      {
        "tag": 8,
        "functionType": "STAMP",
        "vlanId": "string",
        "etherType": "ET_9101"
      },
      {
        "tag": 5,
        "functionType": "POP",
        "vlanId": "string",
        "etherType": "ET_8100"
      },
      {
        "tag": 6,
        "functionType": "POP",
        "vlanId": "string",
        "etherType": "ET_9101"
      },
      {
        "tag": 6,
        "functionType": "POP",
        "vlanId": "string",
        "etherType": "ET_9100"
      },
      {
        "tag": 10,
        "functionType": "STAMP",
        "vlanId": "string",
        "etherType": "ET_8100"
      },
      {
        "tag": 10,
        "functionType": "STAMP",
        "vlanId": "string",
        "etherType": "ET_88E7"
      },
      {
        "tag": 2,
        "functionType": "POP",
        "vlanId": "string",
        "etherType": "ET_88E7"
      }
    ],
    "desiredOrchState": "active",
    "nativeState": "string",
    "orchState": "activating",
    "reason": "string",
    "tags": {},
    "providerData": {
      "obj": [
        {
          "_1": "string",
          "_2": {}
        },
        {
          "_1": "string",
          "_2": {}
        },
        {
          "_1": "string",
          "_2": {}
        },
        {
          "_1": "string",
          "_2": {}
        },
        {
          "_1": "string",
          "_2": {}
        },
        {
          "_1": "string",
          "_2": {}
        }
      ]
    },
    "updatedAt": "string",
    "createdAt": "string",
    "revision": 2,
    "autoClean": true,
    "updateState": "failed",
    "updateReason": "string",
    "updateCount": 9
  },
  {
    "id": "string",
    "label": "string",
    "description": "string",
    "resourceTypeId": "string",
    "productId": "string",
    "domainId": "string",
    "orderId": "string",
    "tenantId": "string",
    "shared": false,
    "sharingPermissionId": "string",
    "subDomainId": "string",
    "properties": {
      "obj": [
        {
          "_1": "string",
          "_2": {}
        },
        {
          "_1": "string",
          "_2": {}
        },
        {
          "_1": "string",
          "_2": {}
        },
        {
          "_1": "string",
          "_2": {}
        },
        {
          "_1": "string",
          "_2": {}
        },
        {
          "_1": "string",
          "_2": {}
        },
        {
          "_1": "string",
          "_2": {}
        }
      ]
    },
    "providerResourceId": "string",
    "discovered": true,
    "differences": [
      {
        "tag": 10,
        "functionType": "STAMP",
        "vlanId": "string",
        "etherType": "ET_9100"
      },
      {
        "tag": 4,
        "functionType": "PUSH",
        "vlanId": "string",
        "etherType": "ET_8100"
      },
      {
        "tag": 9,
        "functionType": "POP",
        "vlanId": "string",
        "etherType": "ET_9101"
      }
    ],
    "desiredOrchState": "assembled",
    "nativeState": "string",
    "orchState": "promoting",
    "reason": "string",
    "tags": {},
    "providerData": {
      "obj": [
        {
          "_1": "string",
          "_2": {}
        },
        {
          "_1": "string",
          "_2": {}
        },
        {
          "_1": "string",
          "_2": {}
        },
        {
          "_1": "string",
          "_2": {}
        },
        {
          "_1": "string",
          "_2": {}
        }
      ]
    },
    "updatedAt": "string",
    "createdAt": "string",
    "revision": 10,
    "autoClean": false,
    "updateState": "failed",
    "updateReason": "string",
    "updateCount": 8
  }
]