{
  "data": [
    {
      "scan_id": "string",
      "status": "string",
      "ne_name": "string",
      "start_time": "string",
      "run_by": "string",
      "facility_aid": "string",
      "is_baseline": "string",
      "nc_id": "string",
      "completed_time": "string",
      "rptr_sys_family": "string"
    },
    {
      "scan_id": "string",
      "status": "string",
      "ne_name": "string",
      "start_time": "string",
      "run_by": "string",
      "facility_aid": "string",
      "is_baseline": "string",
      "nc_id": "string",
      "completed_time": "string",
      "rptr_sys_family": "string"
    }
  ]
}