{
  "$id": "schema.json",
  "type": "object",
  "schema": "http://json-schema.org/draft-07/schema#",
  "translate": true,
  "dynamicfields": true,
  "properties": {
    "ph_request_type": {
      "type": "string",
      "description": "type of request (internal to adapter)",
      "default": "postSubmarineApiV1SrsExport",
      "enum": [
        "postSubmarineApiV1SrsExport"
      ],
      "external_name": "ph_request_type"
    },
    "exportAll": {
      "type": "boolean",
      "description": "If true all scans will be Exported",
      "parse": false,
      "encode": false,
      "encrypt": {
        "type": "AES",
        "key": ""
      },
      "external_name": "export_all"
    }
  },
  "definitions": {}
}