[
  {
    "Id": "string",
    "Name": "string",
    "CompletionDate": "string",
    "ExpirationDate": "string",
    "State": 3,
    "Description": "string",
    "StatusMessage": "string",
    "IntentId": "string",
    "ProjectListId": "string",
    "ProjectType": 2,
    "IsArchived": true,
    "CommittedDate": "string",
    "DeployedEquipment": 4,
    "TotalEquipment": 1
  },
  {
    "Id": "string",
    "Name": "string",
    "CompletionDate": "string",
    "ExpirationDate": "string",
    "State": 1,
    "Description": "string",
    "StatusMessage": "string",
    "IntentId": "string",
    "ProjectListId": "string",
    "ProjectType": 2,
    "IsArchived": true,
    "CommittedDate": "string",
    "DeployedEquipment": 3,
    "TotalEquipment": 7
  },
  {
    "Id": "string",
    "Name": "string",
    "CompletionDate": "string",
    "ExpirationDate": "string",
    "State": 9,
    "Description": "string",
    "StatusMessage": "string",
    "IntentId": "string",
    "ProjectListId": "string",
    "ProjectType": 1,
    "IsArchived": true,
    "CommittedDate": "string",
    "DeployedEquipment": 6,
    "TotalEquipment": 5
  }
]