{
  "$id": "schema.json",
  "type": "object",
  "schema": "http://json-schema.org/draft-07/schema#",
  "translate": true,
  "dynamicfields": true,
  "properties": {
    "ph_request_type": {
      "type": "string",
      "description": "type of request (internal to adapter)",
      "default": "getNetworkConstructsV6",
      "enum": [
        "getNetworkConstructsV6"
      ],
      "external_name": "ph_request_type"
    },
    "networkConstructExpectationsEquipmentIntentId": {
      "type": "string",
      "description": "(Optional) The equipment intent Id",
      "parse": false,
      "encode": false,
      "encrypt": {
        "type": "AES",
        "key": ""
      },
      "external_name": "networkConstructExpectations\\.equipmentIntent\\.id"
    },
    "networkConstructExpectationsServiceIntentId": {
      "type": "string",
      "description": "(Optional) The service intent Id",
      "parse": false,
      "encode": false,
      "encrypt": {
        "type": "AES",
        "key": ""
      },
      "external_name": "networkConstructExpectations\\.serviceIntent\\.id"
    }
  },
  "definitions": {}
}