{
  "actions": [
    {
      "name": "getTpesV5",
      "protocol": "REST",
      "method": "GET",
      "entitypath": "{base_path}/{version}/nsi/api/v5/tpes?{query}",
      "requestSchema": "schema.json",
      "responseSchema": "schema.json",
      "timeout": 0,
      "sendEmpty": false,
      "sendGetBody": false,
      "requestDatatype": "JSON",
      "responseDatatype": "JSON",
      "headers": {},
      "responseObjects": [
        {
          "type": "default",
          "key": "",
          "mockFile": ""
        }
      ]
    },
    {
      "name": "postNsiApiV5Tpes",
      "protocol": "REST",
      "method": "POST",
      "entitypath": "{base_path}/{version}/nsi/api/v5/tpes?{query}",
      "requestSchema": "schema.json",
      "responseSchema": "schema.json",
      "timeout": 0,
      "sendEmpty": false,
      "requestDatatype": "JSON",
      "responseDatatype": "JSON",
      "headers": {},
      "responseObjects": [
        {
          "type": "default",
          "key": "",
          "mockFile": ""
        }
      ]
    },
    {
      "name": "putNsiApiV5TpesTpeId",
      "protocol": "REST",
      "method": "PUT",
      "entitypath": "{base_path}/{version}/nsi/api/v5/tpes/{pathv1}?{query}",
      "requestSchema": "schema.json",
      "responseSchema": "schema.json",
      "timeout": 0,
      "sendEmpty": false,
      "requestDatatype": "JSON",
      "responseDatatype": "JSON",
      "headers": {},
      "responseObjects": [
        {
          "type": "default",
          "key": "",
          "mockFile": ""
        }
      ]
    }
  ]
}