[
  {
    "solutionName": "string",
    "solutionSnapshot": "string",
    "state": "string",
    "executionTime": "string"
  },
  {
    "solutionName": "string",
    "solutionSnapshot": "string",
    "state": "string",
    "executionTime": "string"
  },
  {
    "solutionName": "string",
    "solutionSnapshot": "string",
    "state": "string",
    "executionTime": "string"
  },
  {
    "solutionName": "string",
    "solutionSnapshot": "string",
    "state": "string",
    "executionTime": "string"
  }
]