{
  "actions": [
    {
      "name": "getProjectmanagementApiV2ProjectLists",
      "protocol": "REST",
      "method": "GET",
      "entitypath": "{base_path}/{version}/projectmanagement/api/v2/ProjectLists?{query}",
      "requestSchema": "schema.json",
      "responseSchema": "schema.json",
      "timeout": 0,
      "sendEmpty": false,
      "sendGetBody": false,
      "requestDatatype": "JSON",
      "responseDatatype": "JSON",
      "headers": {},
      "responseObjects": [
        {
          "type": "default",
          "key": "",
          "mockFile": ""
        }
      ]
    },
    {
      "name": "postProjectmanagementApiV2ProjectLists",
      "protocol": "REST",
      "method": "POST",
      "entitypath": "{base_path}/{version}/projectmanagement/api/v2/ProjectLists?{query}",
      "requestSchema": "schema.json",
      "responseSchema": "schema.json",
      "timeout": 0,
      "sendEmpty": false,
      "requestDatatype": "JSON",
      "responseDatatype": "JSON",
      "headers": {},
      "responseObjects": [
        {
          "type": "default",
          "key": "",
          "mockFile": ""
        }
      ]
    },
    {
      "name": "getProjectmanagementApiV2ProjectListsId",
      "protocol": "REST",
      "method": "GET",
      "entitypath": "{base_path}/{version}/projectmanagement/api/v2/ProjectLists/{pathv1}?{query}",
      "requestSchema": "schema.json",
      "responseSchema": "schema.json",
      "timeout": 0,
      "sendEmpty": false,
      "sendGetBody": false,
      "requestDatatype": "JSON",
      "responseDatatype": "JSON",
      "headers": {},
      "responseObjects": [
        {
          "type": "default",
          "key": "",
          "mockFile": ""
        }
      ]
    },
    {
      "name": "postProjectmanagementApiV2ProjectListsProjectListIdAddProject",
      "protocol": "REST",
      "method": "POST",
      "entitypath": "{base_path}/{version}/projectmanagement/api/v2/ProjectLists/{pathv1}/addProject?{query}",
      "requestSchema": "schema.json",
      "responseSchema": "schema.json",
      "timeout": 0,
      "sendEmpty": false,
      "requestDatatype": "JSON",
      "responseDatatype": "JSON",
      "headers": {},
      "responseObjects": [
        {
          "type": "default",
          "key": "",
          "mockFile": ""
        }
      ]
    },
    {
      "name": "postProjectmanagementApiV2ProjectListsNameProjectListNameAddProject",
      "protocol": "REST",
      "method": "POST",
      "entitypath": "{base_path}/{version}/projectmanagement/api/v2/ProjectLists/name/{pathv1}/addProject?{query}",
      "requestSchema": "schema.json",
      "responseSchema": "schema.json",
      "timeout": 0,
      "sendEmpty": false,
      "requestDatatype": "JSON",
      "responseDatatype": "JSON",
      "headers": {},
      "responseObjects": [
        {
          "type": "default",
          "key": "",
          "mockFile": ""
        }
      ]
    },
    {
      "name": "deleteProjectmanagementApiV2ProjectListsProjectListId",
      "protocol": "REST",
      "method": "DELETE",
      "entitypath": "{base_path}/{version}/projectmanagement/api/v2/ProjectLists/{pathv1}?{query}",
      "requestSchema": "schema.json",
      "responseSchema": "schema.json",
      "timeout": 0,
      "sendEmpty": false,
      "requestDatatype": "JSON",
      "responseDatatype": "JSON",
      "headers": {},
      "responseObjects": [
        {
          "type": "default",
          "key": "",
          "mockFile": ""
        }
      ]
    },
    {
      "name": "deleteProjectmanagementApiV2ProjectListsNameProjectListName",
      "protocol": "REST",
      "method": "DELETE",
      "entitypath": "{base_path}/{version}/projectmanagement/api/v2/ProjectLists/name/{pathv1}?{query}",
      "requestSchema": "schema.json",
      "responseSchema": "schema.json",
      "timeout": 0,
      "sendEmpty": false,
      "requestDatatype": "JSON",
      "responseDatatype": "JSON",
      "headers": {},
      "responseObjects": [
        {
          "type": "default",
          "key": "",
          "mockFile": ""
        }
      ]
    }
  ]
}