{
  "data": [
    {},
    {},
    {},
    {}
  ],
  "results": {
    "success": [
      "string",
      "string"
    ],
    "failure": [
      "string",
      "string",
      "string",
      "string"
    ]
  }
}