{
  "$id": "schema.json",
  "type": "object",
  "schema": "http://json-schema.org/draft-07/schema#",
  "translate": true,
  "dynamicfields": true,
  "properties": {
    "ph_request_type": {
      "type": "string",
      "description": "type of request (internal to adapter)",
      "default": "getFile",
      "enum": [
        "getFile",
        "headGetFile",
        "listAreas",
        "headListAreas",
        "countAreas",
        "headCountAreas",
        "listRecentChanges",
        "headListRecentChanges",
        "getArea",
        "headGetArea",
        "listPullRequests",
        "headListPullRequests",
        "createPullRequest",
        "countPullRequests",
        "headCountPullRequests",
        "getPullRequest",
        "headGetPullRequest",
        "getFileBytes",
        "headGetFileBytes",
        "listAreaUpgrades",
        "headListAreaUpgrades",
        "createAreaUpgrade",
        "countAreaUpgrades",
        "headCountAreaUpgrades",
        "getAreaUpgrade",
        "headGetAreaUpgrade",
        "listFiles",
        "headListFiles"
      ],
      "external_name": "ph_request_type"
    },
    "pathParam": {
      "type": "string",
      "description": "The OS path to the file asset.  Forward slashes in the path may be directly included or URL encoded. Other URL unfriendly characters need to be URL encoded.",
      "parse": false,
      "encode": false,
      "encrypt": {
        "type": "AES",
        "key": ""
      },
      "external_name": "path"
    }
  },
  "definitions": {}
}