{
  "actions": [
    {
      "name": "getManagementSessions",
      "protocol": "REST",
      "method": "GET",
      "entitypath": "{base_path}/{version}/discovery/api/v3/managementSessions?{query}",
      "requestSchema": "schema.json",
      "responseSchema": "schema.json",
      "timeout": 0,
      "sendEmpty": false,
      "sendGetBody": false,
      "requestDatatype": "JSON",
      "responseDatatype": "JSON",
      "headers": {},
      "responseObjects": [
        {
          "type": "default",
          "key": "",
          "mockFile": ""
        }
      ]
    },
    {
      "name": "postDiscoveryApiV3ManagementSessions",
      "protocol": "REST",
      "method": "POST",
      "entitypath": "{base_path}/{version}/discovery/api/v3/managementSessions?{query}",
      "requestSchema": "schema.json",
      "responseSchema": "schema.json",
      "timeout": 0,
      "sendEmpty": false,
      "requestDatatype": "JSON",
      "responseDatatype": "JSON",
      "headers": {},
      "responseObjects": [
        {
          "type": "default",
          "key": "",
          "mockFile": ""
        }
      ]
    },
    {
      "name": "getManagementSessionBySessionId",
      "protocol": "REST",
      "method": "GET",
      "entitypath": "{base_path}/{version}/discovery/api/v3/managementSessions/{pathv1}?{query}",
      "requestSchema": "schema.json",
      "responseSchema": "schema.json",
      "timeout": 0,
      "sendEmpty": false,
      "sendGetBody": false,
      "requestDatatype": "JSON",
      "responseDatatype": "JSON",
      "headers": {},
      "responseObjects": [
        {
          "type": "default",
          "key": "",
          "mockFile": ""
        }
      ]
    },
    {
      "name": "deleteDiscoveryApiV3ManagementSessionsSessionId",
      "protocol": "REST",
      "method": "DELETE",
      "entitypath": "{base_path}/{version}/discovery/api/v3/managementSessions/{pathv1}?{query}",
      "requestSchema": "schema.json",
      "responseSchema": "schema.json",
      "timeout": 0,
      "sendEmpty": false,
      "requestDatatype": "JSON",
      "responseDatatype": "JSON",
      "headers": {},
      "responseObjects": [
        {
          "type": "default",
          "key": "",
          "mockFile": ""
        }
      ]
    },
    {
      "name": "putEnroll",
      "protocol": "REST",
      "method": "PUT",
      "entitypath": "{base_path}/{version}/discovery/api/v3/managementSessions/{pathv1}/discoveryState?{query}",
      "requestSchema": "schema.json",
      "responseSchema": "schema.json",
      "timeout": 0,
      "sendEmpty": false,
      "requestDatatype": "JSON",
      "responseDatatype": "JSON",
      "headers": {},
      "responseObjects": [
        {
          "type": "default",
          "key": "",
          "mockFile": ""
        }
      ]
    },
    {
      "name": "putEnrollIP",
      "protocol": "REST",
      "method": "PUT",
      "entitypath": "{base_path}/{version}/discovery/api/v3/managementSessions/{pathv1}/ipAddress?{query}",
      "requestSchema": "schema.json",
      "responseSchema": "schema.json",
      "timeout": 0,
      "sendEmpty": false,
      "requestDatatype": "JSON",
      "responseDatatype": "JSON",
      "headers": {},
      "responseObjects": [
        {
          "type": "default",
          "key": "",
          "mockFile": ""
        }
      ]
    },
    {
      "name": "putEnrollNeProfile",
      "protocol": "REST",
      "method": "PUT",
      "entitypath": "{base_path}/{version}/discovery/api/v3/managementSessions/{pathv1}/neProfile?{query}",
      "requestSchema": "schema.json",
      "responseSchema": "schema.json",
      "timeout": 0,
      "sendEmpty": false,
      "requestDatatype": "JSON",
      "responseDatatype": "JSON",
      "headers": {},
      "responseObjects": [
        {
          "type": "default",
          "key": "",
          "mockFile": ""
        }
      ]
    }
  ]
}