{
  "data": {
    "projectName": "string",
    "relatedProjects": [
      "string"
    ],
    "nodes": [
      {
        "nodeType": "string",
        "nodeName": "string",
        "shelves": [
          {
            "shelfId": "string",
            "scripts": [
              {
                "release": "string",
                "sequenceId": "string",
                "deviceType": "string",
                "scriptId": "string",
                "commands": [
                  {
                    "commandType": "string",
                    "command": "string"
                  },
                  {
                    "commandType": "string",
                    "command": "string"
                  },
                  {
                    "commandType": "string",
                    "command": "string"
                  },
                  {
                    "commandType": "string",
                    "command": "string"
                  },
                  {
                    "commandType": "string",
                    "command": "string"
                  },
                  {
                    "commandType": "string",
                    "command": "string"
                  }
                ]
              },
              {
                "release": "string",
                "sequenceId": "string",
                "deviceType": "string",
                "scriptId": "string",
                "commands": [
                  {
                    "commandType": "string",
                    "command": "string"
                  },
                  {
                    "commandType": "string",
                    "command": "string"
                  },
                  {
                    "commandType": "string",
                    "command": "string"
                  }
                ]
              }
            ]
          },
          {
            "shelfId": "string",
            "scripts": [
              {
                "release": "string",
                "sequenceId": "string",
                "deviceType": "string",
                "scriptId": "string",
                "commands": [
                  {
                    "commandType": "string",
                    "command": "string"
                  },
                  {
                    "commandType": "string",
                    "command": "string"
                  },
                  {
                    "commandType": "string",
                    "command": "string"
                  }
                ]
              },
              {
                "release": "string",
                "sequenceId": "string",
                "deviceType": "string",
                "scriptId": "string",
                "commands": [
                  {
                    "commandType": "string",
                    "command": "string"
                  },
                  {
                    "commandType": "string",
                    "command": "string"
                  },
                  {
                    "commandType": "string",
                    "command": "string"
                  }
                ]
              }
            ]
          },
          {
            "shelfId": "string",
            "scripts": [
              {
                "release": "string",
                "sequenceId": "string",
                "deviceType": "string",
                "scriptId": "string",
                "commands": [
                  {
                    "commandType": "string",
                    "command": "string"
                  }
                ]
              }
            ]
          },
          {
            "shelfId": "string",
            "scripts": [
              {
                "release": "string",
                "sequenceId": "string",
                "deviceType": "string",
                "scriptId": "string",
                "commands": [
                  {
                    "commandType": "string",
                    "command": "string"
                  },
                  {
                    "commandType": "string",
                    "command": "string"
                  }
                ]
              },
              {
                "release": "string",
                "sequenceId": "string",
                "deviceType": "string",
                "scriptId": "string",
                "commands": [
                  {
                    "commandType": "string",
                    "command": "string"
                  },
                  {
                    "commandType": "string",
                    "command": "string"
                  },
                  {
                    "commandType": "string",
                    "command": "string"
                  },
                  {
                    "commandType": "string",
                    "command": "string"
                  },
                  {
                    "commandType": "string",
                    "command": "string"
                  },
                  {
                    "commandType": "string",
                    "command": "string"
                  },
                  {
                    "commandType": "string",
                    "command": "string"
                  },
                  {
                    "commandType": "string",
                    "command": "string"
                  }
                ]
              },
              {
                "release": "string",
                "sequenceId": "string",
                "deviceType": "string",
                "scriptId": "string",
                "commands": [
                  {
                    "commandType": "string",
                    "command": "string"
                  },
                  {
                    "commandType": "string",
                    "command": "string"
                  },
                  {
                    "commandType": "string",
                    "command": "string"
                  },
                  {
                    "commandType": "string",
                    "command": "string"
                  },
                  {
                    "commandType": "string",
                    "command": "string"
                  },
                  {
                    "commandType": "string",
                    "command": "string"
                  },
                  {
                    "commandType": "string",
                    "command": "string"
                  },
                  {
                    "commandType": "string",
                    "command": "string"
                  }
                ]
              },
              {
                "release": "string",
                "sequenceId": "string",
                "deviceType": "string",
                "scriptId": "string",
                "commands": [
                  {
                    "commandType": "string",
                    "command": "string"
                  },
                  {
                    "commandType": "string",
                    "command": "string"
                  },
                  {
                    "commandType": "string",
                    "command": "string"
                  },
                  {
                    "commandType": "string",
                    "command": "string"
                  },
                  {
                    "commandType": "string",
                    "command": "string"
                  },
                  {
                    "commandType": "string",
                    "command": "string"
                  },
                  {
                    "commandType": "string",
                    "command": "string"
                  }
                ]
              },
              {
                "release": "string",
                "sequenceId": "string",
                "deviceType": "string",
                "scriptId": "string",
                "commands": [
                  {
                    "commandType": "string",
                    "command": "string"
                  },
                  {
                    "commandType": "string",
                    "command": "string"
                  },
                  {
                    "commandType": "string",
                    "command": "string"
                  },
                  {
                    "commandType": "string",
                    "command": "string"
                  },
                  {
                    "commandType": "string",
                    "command": "string"
                  },
                  {
                    "commandType": "string",
                    "command": "string"
                  },
                  {
                    "commandType": "string",
                    "command": "string"
                  },
                  {
                    "commandType": "string",
                    "command": "string"
                  },
                  {
                    "commandType": "string",
                    "command": "string"
                  },
                  {
                    "commandType": "string",
                    "command": "string"
                  }
                ]
              }
            ]
          },
          {
            "shelfId": "string",
            "scripts": [
              {
                "release": "string",
                "sequenceId": "string",
                "deviceType": "string",
                "scriptId": "string",
                "commands": [
                  {
                    "commandType": "string",
                    "command": "string"
                  },
                  {
                    "commandType": "string",
                    "command": "string"
                  },
                  {
                    "commandType": "string",
                    "command": "string"
                  },
                  {
                    "commandType": "string",
                    "command": "string"
                  },
                  {
                    "commandType": "string",
                    "command": "string"
                  },
                  {
                    "commandType": "string",
                    "command": "string"
                  },
                  {
                    "commandType": "string",
                    "command": "string"
                  },
                  {
                    "commandType": "string",
                    "command": "string"
                  },
                  {
                    "commandType": "string",
                    "command": "string"
                  }
                ]
              },
              {
                "release": "string",
                "sequenceId": "string",
                "deviceType": "string",
                "scriptId": "string",
                "commands": [
                  {
                    "commandType": "string",
                    "command": "string"
                  },
                  {
                    "commandType": "string",
                    "command": "string"
                  },
                  {
                    "commandType": "string",
                    "command": "string"
                  },
                  {
                    "commandType": "string",
                    "command": "string"
                  },
                  {
                    "commandType": "string",
                    "command": "string"
                  },
                  {
                    "commandType": "string",
                    "command": "string"
                  },
                  {
                    "commandType": "string",
                    "command": "string"
                  },
                  {
                    "commandType": "string",
                    "command": "string"
                  },
                  {
                    "commandType": "string",
                    "command": "string"
                  }
                ]
              },
              {
                "release": "string",
                "sequenceId": "string",
                "deviceType": "string",
                "scriptId": "string",
                "commands": [
                  {
                    "commandType": "string",
                    "command": "string"
                  },
                  {
                    "commandType": "string",
                    "command": "string"
                  }
                ]
              },
              {
                "release": "string",
                "sequenceId": "string",
                "deviceType": "string",
                "scriptId": "string",
                "commands": [
                  {
                    "commandType": "string",
                    "command": "string"
                  },
                  {
                    "commandType": "string",
                    "command": "string"
                  },
                  {
                    "commandType": "string",
                    "command": "string"
                  },
                  {
                    "commandType": "string",
                    "command": "string"
                  },
                  {
                    "commandType": "string",
                    "command": "string"
                  },
                  {
                    "commandType": "string",
                    "command": "string"
                  },
                  {
                    "commandType": "string",
                    "command": "string"
                  },
                  {
                    "commandType": "string",
                    "command": "string"
                  },
                  {
                    "commandType": "string",
                    "command": "string"
                  },
                  {
                    "commandType": "string",
                    "command": "string"
                  }
                ]
              },
              {
                "release": "string",
                "sequenceId": "string",
                "deviceType": "string",
                "scriptId": "string",
                "commands": [
                  {
                    "commandType": "string",
                    "command": "string"
                  },
                  {
                    "commandType": "string",
                    "command": "string"
                  },
                  {
                    "commandType": "string",
                    "command": "string"
                  },
                  {
                    "commandType": "string",
                    "command": "string"
                  },
                  {
                    "commandType": "string",
                    "command": "string"
                  },
                  {
                    "commandType": "string",
                    "command": "string"
                  },
                  {
                    "commandType": "string",
                    "command": "string"
                  },
                  {
                    "commandType": "string",
                    "command": "string"
                  },
                  {
                    "commandType": "string",
                    "command": "string"
                  }
                ]
              },
              {
                "release": "string",
                "sequenceId": "string",
                "deviceType": "string",
                "scriptId": "string",
                "commands": [
                  {
                    "commandType": "string",
                    "command": "string"
                  },
                  {
                    "commandType": "string",
                    "command": "string"
                  },
                  {
                    "commandType": "string",
                    "command": "string"
                  }
                ]
              },
              {
                "release": "string",
                "sequenceId": "string",
                "deviceType": "string",
                "scriptId": "string",
                "commands": [
                  {
                    "commandType": "string",
                    "command": "string"
                  },
                  {
                    "commandType": "string",
                    "command": "string"
                  }
                ]
              },
              {
                "release": "string",
                "sequenceId": "string",
                "deviceType": "string",
                "scriptId": "string",
                "commands": [
                  {
                    "commandType": "string",
                    "command": "string"
                  }
                ]
              }
            ]
          },
          {
            "shelfId": "string",
            "scripts": [
              {
                "release": "string",
                "sequenceId": "string",
                "deviceType": "string",
                "scriptId": "string",
                "commands": [
                  {
                    "commandType": "string",
                    "command": "string"
                  },
                  {
                    "commandType": "string",
                    "command": "string"
                  },
                  {
                    "commandType": "string",
                    "command": "string"
                  },
                  {
                    "commandType": "string",
                    "command": "string"
                  },
                  {
                    "commandType": "string",
                    "command": "string"
                  },
                  {
                    "commandType": "string",
                    "command": "string"
                  }
                ]
              },
              {
                "release": "string",
                "sequenceId": "string",
                "deviceType": "string",
                "scriptId": "string",
                "commands": [
                  {
                    "commandType": "string",
                    "command": "string"
                  },
                  {
                    "commandType": "string",
                    "command": "string"
                  },
                  {
                    "commandType": "string",
                    "command": "string"
                  },
                  {
                    "commandType": "string",
                    "command": "string"
                  },
                  {
                    "commandType": "string",
                    "command": "string"
                  },
                  {
                    "commandType": "string",
                    "command": "string"
                  },
                  {
                    "commandType": "string",
                    "command": "string"
                  },
                  {
                    "commandType": "string",
                    "command": "string"
                  },
                  {
                    "commandType": "string",
                    "command": "string"
                  },
                  {
                    "commandType": "string",
                    "command": "string"
                  }
                ]
              },
              {
                "release": "string",
                "sequenceId": "string",
                "deviceType": "string",
                "scriptId": "string",
                "commands": [
                  {
                    "commandType": "string",
                    "command": "string"
                  },
                  {
                    "commandType": "string",
                    "command": "string"
                  },
                  {
                    "commandType": "string",
                    "command": "string"
                  },
                  {
                    "commandType": "string",
                    "command": "string"
                  },
                  {
                    "commandType": "string",
                    "command": "string"
                  },
                  {
                    "commandType": "string",
                    "command": "string"
                  },
                  {
                    "commandType": "string",
                    "command": "string"
                  },
                  {
                    "commandType": "string",
                    "command": "string"
                  },
                  {
                    "commandType": "string",
                    "command": "string"
                  },
                  {
                    "commandType": "string",
                    "command": "string"
                  }
                ]
              },
              {
                "release": "string",
                "sequenceId": "string",
                "deviceType": "string",
                "scriptId": "string",
                "commands": [
                  {
                    "commandType": "string",
                    "command": "string"
                  }
                ]
              },
              {
                "release": "string",
                "sequenceId": "string",
                "deviceType": "string",
                "scriptId": "string",
                "commands": [
                  {
                    "commandType": "string",
                    "command": "string"
                  },
                  {
                    "commandType": "string",
                    "command": "string"
                  },
                  {
                    "commandType": "string",
                    "command": "string"
                  },
                  {
                    "commandType": "string",
                    "command": "string"
                  },
                  {
                    "commandType": "string",
                    "command": "string"
                  },
                  {
                    "commandType": "string",
                    "command": "string"
                  },
                  {
                    "commandType": "string",
                    "command": "string"
                  },
                  {
                    "commandType": "string",
                    "command": "string"
                  }
                ]
              },
              {
                "release": "string",
                "sequenceId": "string",
                "deviceType": "string",
                "scriptId": "string",
                "commands": [
                  {
                    "commandType": "string",
                    "command": "string"
                  },
                  {
                    "commandType": "string",
                    "command": "string"
                  },
                  {
                    "commandType": "string",
                    "command": "string"
                  },
                  {
                    "commandType": "string",
                    "command": "string"
                  },
                  {
                    "commandType": "string",
                    "command": "string"
                  }
                ]
              },
              {
                "release": "string",
                "sequenceId": "string",
                "deviceType": "string",
                "scriptId": "string",
                "commands": [
                  {
                    "commandType": "string",
                    "command": "string"
                  },
                  {
                    "commandType": "string",
                    "command": "string"
                  },
                  {
                    "commandType": "string",
                    "command": "string"
                  },
                  {
                    "commandType": "string",
                    "command": "string"
                  },
                  {
                    "commandType": "string",
                    "command": "string"
                  },
                  {
                    "commandType": "string",
                    "command": "string"
                  },
                  {
                    "commandType": "string",
                    "command": "string"
                  },
                  {
                    "commandType": "string",
                    "command": "string"
                  }
                ]
              },
              {
                "release": "string",
                "sequenceId": "string",
                "deviceType": "string",
                "scriptId": "string",
                "commands": [
                  {
                    "commandType": "string",
                    "command": "string"
                  },
                  {
                    "commandType": "string",
                    "command": "string"
                  },
                  {
                    "commandType": "string",
                    "command": "string"
                  },
                  {
                    "commandType": "string",
                    "command": "string"
                  },
                  {
                    "commandType": "string",
                    "command": "string"
                  },
                  {
                    "commandType": "string",
                    "command": "string"
                  },
                  {
                    "commandType": "string",
                    "command": "string"
                  },
                  {
                    "commandType": "string",
                    "command": "string"
                  }
                ]
              }
            ]
          },
          {
            "shelfId": "string",
            "scripts": [
              {
                "release": "string",
                "sequenceId": "string",
                "deviceType": "string",
                "scriptId": "string",
                "commands": [
                  {
                    "commandType": "string",
                    "command": "string"
                  },
                  {
                    "commandType": "string",
                    "command": "string"
                  },
                  {
                    "commandType": "string",
                    "command": "string"
                  },
                  {
                    "commandType": "string",
                    "command": "string"
                  }
                ]
              },
              {
                "release": "string",
                "sequenceId": "string",
                "deviceType": "string",
                "scriptId": "string",
                "commands": [
                  {
                    "commandType": "string",
                    "command": "string"
                  },
                  {
                    "commandType": "string",
                    "command": "string"
                  }
                ]
              },
              {
                "release": "string",
                "sequenceId": "string",
                "deviceType": "string",
                "scriptId": "string",
                "commands": [
                  {
                    "commandType": "string",
                    "command": "string"
                  },
                  {
                    "commandType": "string",
                    "command": "string"
                  },
                  {
                    "commandType": "string",
                    "command": "string"
                  }
                ]
              }
            ]
          },
          {
            "shelfId": "string",
            "scripts": [
              {
                "release": "string",
                "sequenceId": "string",
                "deviceType": "string",
                "scriptId": "string",
                "commands": [
                  {
                    "commandType": "string",
                    "command": "string"
                  }
                ]
              },
              {
                "release": "string",
                "sequenceId": "string",
                "deviceType": "string",
                "scriptId": "string",
                "commands": [
                  {
                    "commandType": "string",
                    "command": "string"
                  },
                  {
                    "commandType": "string",
                    "command": "string"
                  },
                  {
                    "commandType": "string",
                    "command": "string"
                  },
                  {
                    "commandType": "string",
                    "command": "string"
                  },
                  {
                    "commandType": "string",
                    "command": "string"
                  },
                  {
                    "commandType": "string",
                    "command": "string"
                  },
                  {
                    "commandType": "string",
                    "command": "string"
                  }
                ]
              },
              {
                "release": "string",
                "sequenceId": "string",
                "deviceType": "string",
                "scriptId": "string",
                "commands": [
                  {
                    "commandType": "string",
                    "command": "string"
                  }
                ]
              }
            ]
          }
        ]
      },
      {
        "nodeType": "string",
        "nodeName": "string",
        "shelves": [
          {
            "shelfId": "string",
            "scripts": [
              {
                "release": "string",
                "sequenceId": "string",
                "deviceType": "string",
                "scriptId": "string",
                "commands": [
                  {
                    "commandType": "string",
                    "command": "string"
                  },
                  {
                    "commandType": "string",
                    "command": "string"
                  },
                  {
                    "commandType": "string",
                    "command": "string"
                  },
                  {
                    "commandType": "string",
                    "command": "string"
                  },
                  {
                    "commandType": "string",
                    "command": "string"
                  },
                  {
                    "commandType": "string",
                    "command": "string"
                  },
                  {
                    "commandType": "string",
                    "command": "string"
                  },
                  {
                    "commandType": "string",
                    "command": "string"
                  },
                  {
                    "commandType": "string",
                    "command": "string"
                  }
                ]
              },
              {
                "release": "string",
                "sequenceId": "string",
                "deviceType": "string",
                "scriptId": "string",
                "commands": [
                  {
                    "commandType": "string",
                    "command": "string"
                  }
                ]
              },
              {
                "release": "string",
                "sequenceId": "string",
                "deviceType": "string",
                "scriptId": "string",
                "commands": [
                  {
                    "commandType": "string",
                    "command": "string"
                  },
                  {
                    "commandType": "string",
                    "command": "string"
                  },
                  {
                    "commandType": "string",
                    "command": "string"
                  },
                  {
                    "commandType": "string",
                    "command": "string"
                  },
                  {
                    "commandType": "string",
                    "command": "string"
                  },
                  {
                    "commandType": "string",
                    "command": "string"
                  }
                ]
              },
              {
                "release": "string",
                "sequenceId": "string",
                "deviceType": "string",
                "scriptId": "string",
                "commands": [
                  {
                    "commandType": "string",
                    "command": "string"
                  },
                  {
                    "commandType": "string",
                    "command": "string"
                  },
                  {
                    "commandType": "string",
                    "command": "string"
                  },
                  {
                    "commandType": "string",
                    "command": "string"
                  },
                  {
                    "commandType": "string",
                    "command": "string"
                  }
                ]
              },
              {
                "release": "string",
                "sequenceId": "string",
                "deviceType": "string",
                "scriptId": "string",
                "commands": [
                  {
                    "commandType": "string",
                    "command": "string"
                  },
                  {
                    "commandType": "string",
                    "command": "string"
                  },
                  {
                    "commandType": "string",
                    "command": "string"
                  }
                ]
              },
              {
                "release": "string",
                "sequenceId": "string",
                "deviceType": "string",
                "scriptId": "string",
                "commands": [
                  {
                    "commandType": "string",
                    "command": "string"
                  },
                  {
                    "commandType": "string",
                    "command": "string"
                  }
                ]
              }
            ]
          },
          {
            "shelfId": "string",
            "scripts": [
              {
                "release": "string",
                "sequenceId": "string",
                "deviceType": "string",
                "scriptId": "string",
                "commands": [
                  {
                    "commandType": "string",
                    "command": "string"
                  },
                  {
                    "commandType": "string",
                    "command": "string"
                  },
                  {
                    "commandType": "string",
                    "command": "string"
                  },
                  {
                    "commandType": "string",
                    "command": "string"
                  },
                  {
                    "commandType": "string",
                    "command": "string"
                  },
                  {
                    "commandType": "string",
                    "command": "string"
                  }
                ]
              }
            ]
          },
          {
            "shelfId": "string",
            "scripts": [
              {
                "release": "string",
                "sequenceId": "string",
                "deviceType": "string",
                "scriptId": "string",
                "commands": [
                  {
                    "commandType": "string",
                    "command": "string"
                  },
                  {
                    "commandType": "string",
                    "command": "string"
                  },
                  {
                    "commandType": "string",
                    "command": "string"
                  }
                ]
              },
              {
                "release": "string",
                "sequenceId": "string",
                "deviceType": "string",
                "scriptId": "string",
                "commands": [
                  {
                    "commandType": "string",
                    "command": "string"
                  },
                  {
                    "commandType": "string",
                    "command": "string"
                  },
                  {
                    "commandType": "string",
                    "command": "string"
                  },
                  {
                    "commandType": "string",
                    "command": "string"
                  },
                  {
                    "commandType": "string",
                    "command": "string"
                  },
                  {
                    "commandType": "string",
                    "command": "string"
                  },
                  {
                    "commandType": "string",
                    "command": "string"
                  },
                  {
                    "commandType": "string",
                    "command": "string"
                  },
                  {
                    "commandType": "string",
                    "command": "string"
                  }
                ]
              },
              {
                "release": "string",
                "sequenceId": "string",
                "deviceType": "string",
                "scriptId": "string",
                "commands": [
                  {
                    "commandType": "string",
                    "command": "string"
                  },
                  {
                    "commandType": "string",
                    "command": "string"
                  },
                  {
                    "commandType": "string",
                    "command": "string"
                  }
                ]
              }
            ]
          }
        ]
      },
      {
        "nodeType": "string",
        "nodeName": "string",
        "shelves": [
          {
            "shelfId": "string",
            "scripts": [
              {
                "release": "string",
                "sequenceId": "string",
                "deviceType": "string",
                "scriptId": "string",
                "commands": [
                  {
                    "commandType": "string",
                    "command": "string"
                  },
                  {
                    "commandType": "string",
                    "command": "string"
                  },
                  {
                    "commandType": "string",
                    "command": "string"
                  },
                  {
                    "commandType": "string",
                    "command": "string"
                  },
                  {
                    "commandType": "string",
                    "command": "string"
                  },
                  {
                    "commandType": "string",
                    "command": "string"
                  },
                  {
                    "commandType": "string",
                    "command": "string"
                  },
                  {
                    "commandType": "string",
                    "command": "string"
                  },
                  {
                    "commandType": "string",
                    "command": "string"
                  },
                  {
                    "commandType": "string",
                    "command": "string"
                  }
                ]
              },
              {
                "release": "string",
                "sequenceId": "string",
                "deviceType": "string",
                "scriptId": "string",
                "commands": [
                  {
                    "commandType": "string",
                    "command": "string"
                  },
                  {
                    "commandType": "string",
                    "command": "string"
                  },
                  {
                    "commandType": "string",
                    "command": "string"
                  },
                  {
                    "commandType": "string",
                    "command": "string"
                  }
                ]
              }
            ]
          }
        ]
      }
    ]
  }
}