{
  "$id": "schema.json",
  "type": "object",
  "schema": "http://json-schema.org/draft-07/schema#",
  "translate": false,
  "dynamicfields": true,
  "properties": {
    "ph_request_type": {
      "type": "string",
      "description": "type of request (internal to adapter)",
      "default": "getEquipmenttopologyplanningApiV1GlobalConfigurationData",
      "enum": [
        "getEquipmenttopologyplanningApiV1GlobalConfigurationData",
        "putEquipmenttopologyplanningApiV1GlobalConfigurationData",
        "getEquipmenttopologyplanningApiV1GlobalConfigurationDataItemKey",
        "putEquipmenttopologyplanningApiV1GlobalConfigurationDataHeatDissipationLimitThreshold1HeatDissipationLimitThreshold1Value",
        "putEquipmenttopologyplanningApiV1GlobalConfigurationDataHeatDissipationLimitThreshold2HeatDissipationLimitThreshold2Value",
        "putEquipmenttopologyplanningApiV1GlobalConfigurationDataSingleILASiteLabelSingleILASiteLabelValue",
        "putEquipmenttopologyplanningApiV1GlobalConfigurationDataDualILASiteLabelDualILASiteLabelValue",
        "putEquipmenttopologyplanningApiV1GlobalConfigurationDataDgeWithSingleILASiteLabelDgeWithSingleILASiteLabelValue",
        "putEquipmenttopologyplanningApiV1GlobalConfigurationDataDgeWithAtoZDualILAZtoASingleILASiteLabelDgeWithAtoZDualILAZtoASingleILASiteLabelValue",
        "putEquipmenttopologyplanningApiV1GlobalConfigurationDataDgeWithAtoZSingleILAZtoADualILASiteLabelDgeWithAtoZSingleILAZtoADualILASiteLabelValue",
        "putEquipmenttopologyplanningApiV1GlobalConfigurationDataDgeWithDualILASiteLabelDgeWithDualILASiteLabelValue",
        "putEquipmenttopologyplanningApiV1GlobalConfigurationDataDefaultProfilePreferencesValueDefaultProfilePreferencesValue"
      ],
      "external_name": "ph_request_type"
    }
  },
  "definitions": {}
}