{
  "actions": [
    {
      "name": "getTopicState",
      "protocol": "REST",
      "method": "GET",
      "entitypath": "{base_path}/{version}/kafka-rest/api/v1/monitor/{pathv1}?{query}",
      "requestSchema": "schema.json",
      "responseSchema": "schema.json",
      "timeout": 0,
      "sendEmpty": false,
      "sendGetBody": false,
      "requestDatatype": "JSON",
      "responseDatatype": "JSON",
      "headers": {},
      "responseObjects": [
        {
          "type": "default",
          "key": "",
          "mockFile": ""
        }
      ]
    },
    {
      "name": "getTopicConsumer",
      "protocol": "REST",
      "method": "GET",
      "entitypath": "{base_path}/{version}/kafka-rest/api/v1/monitor/{pathv1}/{pathv2}?{query}",
      "requestSchema": "schema.json",
      "responseSchema": "schema.json",
      "timeout": 0,
      "sendEmpty": false,
      "sendGetBody": false,
      "requestDatatype": "JSON",
      "responseDatatype": "JSON",
      "headers": {},
      "responseObjects": [
        {
          "type": "default",
          "key": "",
          "mockFile": ""
        }
      ]
    },
    {
      "name": "getTopicConsumerProcessState",
      "protocol": "REST",
      "method": "GET",
      "entitypath": "{base_path}/{version}/kafka-rest/api/v1/monitor/process-state/{pathv1}/{pathv2}?{query}",
      "requestSchema": "schema.json",
      "responseSchema": "schema.json",
      "timeout": 0,
      "sendEmpty": false,
      "sendGetBody": false,
      "requestDatatype": "JSON",
      "responseDatatype": "JSON",
      "headers": {},
      "responseObjects": [
        {
          "type": "default",
          "key": "",
          "mockFile": ""
        }
      ]
    }
  ]
}