{
  "$id": "schema.json",
  "type": "object",
  "schema": "http://json-schema.org/draft-07/schema#",
  "translate": true,
  "dynamicfields": true,
  "properties": {
    "ph_request_type": {
      "type": "string",
      "description": "type of request (internal to adapter)",
      "default": "getLekhaApiV1",
      "enum": [
        "getLekhaApiV1",
        "deleteLekhaApiV1"
      ],
      "external_name": "ph_request_type"
    },
    "lastDays": {
      "type": "number",
      "description": "Specify number of days for which audit logs to be deleted. When this parameter is provided &#39;from&#39; and &#39;to&#39; params are not required.",
      "parse": false,
      "encode": false,
      "encrypt": {
        "type": "AES",
        "key": ""
      },
      "external_name": "last_days"
    }
  },
  "definitions": {}
}