{
  "reservedIPdata": [
    {
      "type": "string",
      "projectId": "string",
      "ospfArea": "string",
      "shelfNumber": "string",
      "tid": "string",
      "projectName": "string",
      "IP": "string"
    },
    {
      "type": "string",
      "projectId": "string",
      "ospfArea": "string",
      "shelfNumber": "string",
      "tid": "string",
      "projectName": "string",
      "IP": "string"
    },
    {
      "type": "string",
      "projectId": "string",
      "ospfArea": "string",
      "shelfNumber": "string",
      "tid": "string",
      "projectName": "string",
      "IP": "string"
    },
    {
      "type": "string",
      "projectId": "string",
      "ospfArea": "string",
      "shelfNumber": "string",
      "tid": "string",
      "projectName": "string",
      "IP": "string"
    },
    {
      "type": "string",
      "projectId": "string",
      "ospfArea": "string",
      "shelfNumber": "string",
      "tid": "string",
      "projectName": "string",
      "IP": "string"
    },
    {
      "type": "string",
      "projectId": "string",
      "ospfArea": "string",
      "shelfNumber": "string",
      "tid": "string",
      "projectName": "string",
      "IP": "string"
    },
    {
      "type": "string",
      "projectId": "string",
      "ospfArea": "string",
      "shelfNumber": "string",
      "tid": "string",
      "projectName": "string",
      "IP": "string"
    }
  ]
}