{
  "$id": "schema.json",
  "type": "object",
  "schema": "http://json-schema.org/draft-07/schema#",
  "translate": false,
  "dynamicfields": true,
  "properties": {
    "ph_request_type": {
      "type": "string",
      "description": "type of request (internal to adapter)",
      "default": "listResourceProviders",
      "enum": [
        "listResourceProviders",
        "headListResourceProviders",
        "createResourceProvider",
        "countResourceProviders",
        "headCountResourceProviders",
        "getResourceProvider",
        "headGetResourceProvider",
        "updateResourceProvider",
        "deleteResourceProvider",
        "patchResourceProvider",
        "listDomainsByRp",
        "headListDomainsByRp"
      ],
      "external_name": "ph_request_type"
    }
  },
  "definitions": {}
}