{
  "$id": "schema.json",
  "type": "object",
  "schema": "http://json-schema.org/draft-07/schema#",
  "translate": true,
  "dynamicfields": true,
  "properties": {
    "ph_request_type": {
      "type": "string",
      "description": "type of request (internal to adapter)",
      "default": "getTapiCoreContextPhysicalContextDevice",
      "enum": [
        "getTapiCoreContextPhysicalContextDevice",
        "getTapiDataContextPhysicalContextPhysicalSpan",
        "getTapiDataTapiCommonContextTapiEquipmentPhysicalContextPhysicalSpan",
        "getTapiDataContextPhysicalContextPhysicalSpanUuid",
        "getTapiDataTapiCommonContextTapiEquipmentPhysicalContextPhysicalSpanUuid",
        "getTapiDataContextPhysicalContextDevice",
        "getTapiDataTapiCommonContextTapiEquipmentPhysicalContextDevice",
        "getTapiDataContextPhysicalContextDeviceUuid",
        "getTapiDataTapiCommonContextTapiEquipmentPhysicalContextDeviceUuid",
        "getTapiCoreContextPhysicalContextEquipment",
        "getTapiDataContextPhysicalContextEquipment",
        "getTapiDataTapiCommonContextTapiEquipmentPhysicalContextEquipment",
        "getTapiDataContextPhysicalContextEquipmentEquipmentUuid",
        "getTapiDataTapiCommonContextTapiEquipmentPhysicalContextEquipmentEquipmentUuid",
        "getTapiDataContextPhysicalContextDeviceUuidEquipmentEquipmentUuid",
        "getTapiCoreContextPhysicalContextEquipmentholder",
        "getTapiDataContextPhysicalContextEquipmentholder",
        "getTapiDataTapiCommonContextTapiEquipmentPhysicalContextEquipmentholder",
        "getTapiDataContextPhysicalContextEquipmentholderEquipmentholderUuid",
        "getTapiDataTapiCommonContextTapiEquipmentPhysicalContextEquipmentholderEquipmentholderUuid"
      ],
      "external_name": "ph_request_type"
    },
    "pageNumber": {
      "type": "number",
      "description": "(Optional) The page to return",
      "parse": false,
      "encode": false,
      "encrypt": {
        "type": "AES",
        "key": ""
      },
      "external_name": "page[number]"
    },
    "pageSize": {
      "type": "number",
      "description": "(Optional) The size of a returned page",
      "parse": false,
      "encode": false,
      "encrypt": {
        "type": "AES",
        "key": ""
      },
      "external_name": "page[size]"
    },
    "equipmentUuid": {
      "type": "string",
      "description": "Id of equipment",
      "parse": false,
      "encode": false,
      "encrypt": {
        "type": "AES",
        "key": ""
      },
      "external_name": "equipment-uuid"
    },
    "equipmentholderUuid": {
      "type": "string",
      "description": "Id of contained-holder",
      "parse": false,
      "encode": false,
      "encrypt": {
        "type": "AES",
        "key": ""
      },
      "external_name": "equipmentholder-uuid"
    }
  },
  "definitions": {}
}