[
  {
    "reportType": "string",
    "scheduleMetaData": [
      {
        "resourceId": "string",
        "reportType": "string",
        "startDateTime": "string"
      },
      {
        "resourceId": "string",
        "reportType": "string",
        "startDateTime": "string"
      },
      {
        "resourceId": "string",
        "reportType": "string",
        "startDateTime": "string"
      },
      {
        "resourceId": "string",
        "reportType": "string",
        "startDateTime": "string"
      }
    ]
  },
  {
    "reportType": "string",
    "scheduleMetaData": [
      {
        "resourceId": "string",
        "reportType": "string",
        "startDateTime": "string"
      },
      {
        "resourceId": "string",
        "reportType": "string",
        "startDateTime": "string"
      },
      {
        "resourceId": "string",
        "reportType": "string",
        "startDateTime": "string"
      },
      {
        "resourceId": "string",
        "reportType": "string",
        "startDateTime": "string"
      },
      {
        "resourceId": "string",
        "reportType": "string",
        "startDateTime": "string"
      },
      {
        "resourceId": "string",
        "reportType": "string",
        "startDateTime": "string"
      }
    ]
  },
  {
    "reportType": "string",
    "scheduleMetaData": [
      {
        "resourceId": "string",
        "reportType": "string",
        "startDateTime": "string"
      },
      {
        "resourceId": "string",
        "reportType": "string",
        "startDateTime": "string"
      },
      {
        "resourceId": "string",
        "reportType": "string",
        "startDateTime": "string"
      },
      {
        "resourceId": "string",
        "reportType": "string",
        "startDateTime": "string"
      },
      {
        "resourceId": "string",
        "reportType": "string",
        "startDateTime": "string"
      },
      {
        "resourceId": "string",
        "reportType": "string",
        "startDateTime": "string"
      },
      {
        "resourceId": "string",
        "reportType": "string",
        "startDateTime": "string"
      },
      {
        "resourceId": "string",
        "reportType": "string",
        "startDateTime": "string"
      },
      {
        "resourceId": "string",
        "reportType": "string",
        "startDateTime": "string"
      }
    ]
  },
  {
    "reportType": "string",
    "scheduleMetaData": [
      {
        "resourceId": "string",
        "reportType": "string",
        "startDateTime": "string"
      },
      {
        "resourceId": "string",
        "reportType": "string",
        "startDateTime": "string"
      }
    ]
  }
]