{
  "$id": "schema.json",
  "type": "object",
  "schema": "http://json-schema.org/draft-07/schema#",
  "translate": true,
  "dynamicfields": true,
  "properties": {
    "ph_request_type": {
      "type": "string",
      "description": "type of request (internal to adapter)",
      "default": "getEquipmentStaticSpecs",
      "enum": [
        "getEquipmentStaticSpecs",
        "getEquipmentStaticSpec"
      ],
      "external_name": "ph_request_type"
    },
    "networkConstructId": {
      "type": "string",
      "description": "Network Construct identifier",
      "parse": false,
      "encode": false,
      "encrypt": {
        "type": "AES",
        "key": ""
      },
      "external_name": "networkConstruct\\.id"
    },
    "equipmentId": {
      "type": "string",
      "description": "Equipment identifier",
      "parse": false,
      "encode": false,
      "encrypt": {
        "type": "AES",
        "key": ""
      },
      "external_name": "equipment\\.id"
    },
    "attributesCctPackageCctState": {
      "type": "string",
      "description": "(Optional) Cct State. The allowed values are : IN_PROGRESS, DELETED, COMPLETE, FAILED",
      "parse": false,
      "encode": false,
      "encrypt": {
        "type": "AES",
        "key": ""
      },
      "external_name": "attributes\\.cctPackage\\.cctState"
    }
  },
  "definitions": {}
}