{
  "actions": [
    {
      "name": "getProjectmanagementApiV1ProjectLists",
      "protocol": "REST",
      "method": "GET",
      "entitypath": "{base_path}/{version}/projectmanagement/api/v1/ProjectLists?{query}",
      "requestSchema": "schema.json",
      "responseSchema": "schema.json",
      "timeout": 0,
      "sendEmpty": false,
      "sendGetBody": false,
      "requestDatatype": "JSON",
      "responseDatatype": "JSON",
      "headers": {},
      "responseObjects": [
        {
          "type": "default",
          "key": "",
          "mockFile": ""
        }
      ]
    },
    {
      "name": "postProjectmanagementApiV1ProjectLists",
      "protocol": "REST",
      "method": "POST",
      "entitypath": "{base_path}/{version}/projectmanagement/api/v1/ProjectLists?{query}",
      "requestSchema": "schema.json",
      "responseSchema": "schema.json",
      "timeout": 0,
      "sendEmpty": false,
      "requestDatatype": "JSON",
      "responseDatatype": "JSON",
      "headers": {},
      "responseObjects": [
        {
          "type": "default",
          "key": "",
          "mockFile": ""
        }
      ]
    },
    {
      "name": "getProjectmanagementApiV1ProjectListsId",
      "protocol": "REST",
      "method": "GET",
      "entitypath": "{base_path}/{version}/projectmanagement/api/v1/ProjectLists/{pathv1}?{query}",
      "requestSchema": "schema.json",
      "responseSchema": "schema.json",
      "timeout": 0,
      "sendEmpty": false,
      "sendGetBody": false,
      "requestDatatype": "JSON",
      "responseDatatype": "JSON",
      "headers": {},
      "responseObjects": [
        {
          "type": "default",
          "key": "",
          "mockFile": ""
        }
      ]
    },
    {
      "name": "postProjectmanagementApiV1ProjectListsProjectListIdAddProject",
      "protocol": "REST",
      "method": "POST",
      "entitypath": "{base_path}/{version}/projectmanagement/api/v1/ProjectLists/{pathv1}/addProject?{query}",
      "requestSchema": "schema.json",
      "responseSchema": "schema.json",
      "timeout": 0,
      "sendEmpty": false,
      "requestDatatype": "JSON",
      "responseDatatype": "JSON",
      "headers": {},
      "responseObjects": [
        {
          "type": "default",
          "key": "",
          "mockFile": ""
        }
      ]
    },
    {
      "name": "postProjectmanagementApiV1ProjectListsNameProjectListNameAddProject",
      "protocol": "REST",
      "method": "POST",
      "entitypath": "{base_path}/{version}/projectmanagement/api/v1/ProjectLists/name/{pathv1}/addProject?{query}",
      "requestSchema": "schema.json",
      "responseSchema": "schema.json",
      "timeout": 0,
      "sendEmpty": false,
      "requestDatatype": "JSON",
      "responseDatatype": "JSON",
      "headers": {},
      "responseObjects": [
        {
          "type": "default",
          "key": "",
          "mockFile": ""
        }
      ]
    },
    {
      "name": "deleteProjectmanagementApiV1ProjectListsProjectListId",
      "protocol": "REST",
      "method": "DELETE",
      "entitypath": "{base_path}/{version}/projectmanagement/api/v1/ProjectLists/{pathv1}?{query}",
      "requestSchema": "schema.json",
      "responseSchema": "schema.json",
      "timeout": 0,
      "sendEmpty": false,
      "requestDatatype": "JSON",
      "responseDatatype": "JSON",
      "headers": {},
      "responseObjects": [
        {
          "type": "default",
          "key": "",
          "mockFile": ""
        }
      ]
    },
    {
      "name": "deleteProjectmanagementApiV1ProjectListsNameProjectListName",
      "protocol": "REST",
      "method": "DELETE",
      "entitypath": "{base_path}/{version}/projectmanagement/api/v1/ProjectLists/name/{pathv1}?{query}",
      "requestSchema": "schema.json",
      "responseSchema": "schema.json",
      "timeout": 0,
      "sendEmpty": false,
      "requestDatatype": "JSON",
      "responseDatatype": "JSON",
      "headers": {},
      "responseObjects": [
        {
          "type": "default",
          "key": "",
          "mockFile": ""
        }
      ]
    }
  ]
}