[
  {
    "name": "string",
    "path": "string"
  },
  {
    "name": "string",
    "path": "string"
  },
  {
    "name": "string",
    "path": "string"
  },
  {
    "name": "string",
    "path": "string"
  }
]