{
  "$id": "schema.json",
  "type": "object",
  "schema": "http://json-schema.org/draft-07/schema#",
  "translate": true,
  "dynamicfields": true,
  "properties": {
    "ph_request_type": {
      "type": "string",
      "description": "type of request (internal to adapter)",
      "default": "getAlarmSyncStates",
      "enum": [
        "getAlarmSyncStates",
        "resetRequestIdsForServerId",
        "acknowledgeAlarm",
        "annotateAlarm",
        "forceClearAlarm",
        "manualClearAlarm",
        "removeAnnotation",
        "unacknowledgeAlarm"
      ],
      "external_name": "ph_request_type"
    },
    "id": {
      "type": "string",
      "description": "Identifier of the alarm to be marked as _unacknowledged_.",
      "parse": false,
      "encode": false,
      "encrypt": {
        "type": "AES",
        "key": ""
      },
      "external_name": "Id"
    }
  },
  "definitions": {}
}