{
  "actions": [
    {
      "name": "postViabilityApiV1ViableRoutesViabilityData",
      "protocol": "REST",
      "method": "POST",
      "entitypath": "{base_path}/{version}/viability/api/v1/ViableRoutes/ViabilityData?{query}",
      "requestSchema": "schema.json",
      "responseSchema": "schema.json",
      "timeout": 0,
      "sendEmpty": false,
      "requestDatatype": "JSON",
      "responseDatatype": "JSON",
      "headers": {},
      "responseObjects": [
        {
          "type": "default",
          "key": "",
          "mockFile": ""
        }
      ]
    },
    {
      "name": "getViabilityApiV1ViableRoutesViabilityData",
      "protocol": "REST",
      "method": "GET",
      "entitypath": "{base_path}/{version}/viability/api/v1/ViableRoutes/ViabilityData?{query}",
      "requestSchema": "schema.json",
      "responseSchema": "schema.json",
      "timeout": 0,
      "sendEmpty": false,
      "sendGetBody": false,
      "requestDatatype": "JSON",
      "responseDatatype": "JSON",
      "headers": {},
      "responseObjects": [
        {
          "type": "default",
          "key": "",
          "mockFile": ""
        }
      ]
    },
    {
      "name": "putViabilityApiV1ViableRoutesViabilityData",
      "protocol": "REST",
      "method": "PUT",
      "entitypath": "{base_path}/{version}/viability/api/v1/ViableRoutes/ViabilityData?{query}",
      "requestSchema": "schema.json",
      "responseSchema": "schema.json",
      "timeout": 0,
      "sendEmpty": false,
      "requestDatatype": "JSON",
      "responseDatatype": "JSON",
      "headers": {},
      "responseObjects": [
        {
          "type": "default",
          "key": "",
          "mockFile": ""
        }
      ]
    },
    {
      "name": "postViabilityApiV1ViableRoutesViabilityDataFile",
      "protocol": "REST",
      "method": "POST",
      "entitypath": "{base_path}/{version}/viability/api/v1/ViableRoutes/ViabilityData/file?{query}",
      "requestSchema": "schema.json",
      "responseSchema": "schema.json",
      "timeout": 0,
      "sendEmpty": false,
      "requestDatatype": "FORM",
      "responseDatatype": "JSON",
      "headers": {},
      "responseObjects": [
        {
          "type": "default",
          "key": "",
          "mockFile": ""
        }
      ]
    },
    {
      "name": "getViabilityApiV1ViableRoutesViabilityDataFile",
      "protocol": "REST",
      "method": "GET",
      "entitypath": "{base_path}/{version}/viability/api/v1/ViableRoutes/ViabilityData/file?{query}",
      "requestSchema": "schema.json",
      "responseSchema": "schema.json",
      "timeout": 0,
      "sendEmpty": false,
      "sendGetBody": false,
      "requestDatatype": "JSON",
      "responseDatatype": "JSON",
      "headers": {},
      "responseObjects": [
        {
          "type": "default",
          "key": "",
          "mockFile": ""
        }
      ]
    }
  ]
}