{
  "actions": [
    {
      "name": "getCommissioningApiV1DeploymentData",
      "protocol": "REST",
      "method": "GET",
      "entitypath": "{base_path}/{version}/commissioning/api/v1/deploymentData/?{query}",
      "requestSchema": "schema.json",
      "responseSchema": "schema.json",
      "timeout": 0,
      "sendEmpty": false,
      "sendGetBody": false,
      "requestDatatype": "JSON",
      "responseDatatype": "JSON",
      "headers": {},
      "responseObjects": [
        {
          "type": "default",
          "key": "",
          "mockFile": "mockdatafiles/getCommissioningApiV1DeploymentData-default.json"
        }
      ]
    },
    {
      "name": "postCommissioningApiV1DeploymentData",
      "protocol": "REST",
      "method": "POST",
      "entitypath": "{base_path}/{version}/commissioning/api/v1/deploymentData/?{query}",
      "requestSchema": "schema.json",
      "responseSchema": "schema.json",
      "timeout": 0,
      "sendEmpty": false,
      "requestDatatype": "JSON",
      "responseDatatype": "JSON",
      "headers": {},
      "responseObjects": [
        {
          "type": "default",
          "key": "",
          "mockFile": "mockdatafiles/postCommissioningApiV1DeploymentData-default.json"
        }
      ]
    }
  ]
}