{
  "$id": "schema.json",
  "type": "object",
  "schema": "http://json-schema.org/draft-07/schema#",
  "translate": false,
  "dynamicfields": true,
  "properties": {
    "ph_request_type": {
      "type": "string",
      "description": "type of request (internal to adapter)",
      "default": "listUnclaimedJobs",
      "enum": [
        "listUnclaimedJobs",
        "headListUnclaimedJobs",
        "countClaimedJobs",
        "headCountClaimedJobs",
        "listClaimedJobs",
        "headListClaimedJobs",
        "getJob",
        "headGetJob",
        "claimJob",
        "checkJobOnly",
        "headCheckJobOnly",
        "checkJobModify",
        "putJobProgress",
        "putJobResult",
        "putJobSuspended"
      ],
      "external_name": "ph_request_type"
    }
  },
  "definitions": {}
}