[
  {
    "reportType": "string",
    "reportMetaData": [
      {
        "resourceId": "string",
        "reportType": "string",
        "reportGenerationTime": "string",
        "reportStatus": "string",
        "reportContentType": "string",
        "reportGenerationMode": "string"
      },
      {
        "resourceId": "string",
        "reportType": "string",
        "reportGenerationTime": "string",
        "reportStatus": "string",
        "reportContentType": "string",
        "reportGenerationMode": "string"
      },
      {
        "resourceId": "string",
        "reportType": "string",
        "reportGenerationTime": "string",
        "reportStatus": "string",
        "reportContentType": "string",
        "reportGenerationMode": "string"
      },
      {
        "resourceId": "string",
        "reportType": "string",
        "reportGenerationTime": "string",
        "reportStatus": "string",
        "reportContentType": "string",
        "reportGenerationMode": "string"
      },
      {
        "resourceId": "string",
        "reportType": "string",
        "reportGenerationTime": "string",
        "reportStatus": "string",
        "reportContentType": "string",
        "reportGenerationMode": "string"
      },
      {
        "resourceId": "string",
        "reportType": "string",
        "reportGenerationTime": "string",
        "reportStatus": "string",
        "reportContentType": "string",
        "reportGenerationMode": "string"
      },
      {
        "resourceId": "string",
        "reportType": "string",
        "reportGenerationTime": "string",
        "reportStatus": "string",
        "reportContentType": "string",
        "reportGenerationMode": "string"
      },
      {
        "resourceId": "string",
        "reportType": "string",
        "reportGenerationTime": "string",
        "reportStatus": "string",
        "reportContentType": "string",
        "reportGenerationMode": "string"
      },
      {
        "resourceId": "string",
        "reportType": "string",
        "reportGenerationTime": "string",
        "reportStatus": "string",
        "reportContentType": "string",
        "reportGenerationMode": "string"
      },
      {
        "resourceId": "string",
        "reportType": "string",
        "reportGenerationTime": "string",
        "reportStatus": "string",
        "reportContentType": "string",
        "reportGenerationMode": "string"
      }
    ]
  },
  {
    "reportType": "string",
    "reportMetaData": [
      {
        "resourceId": "string",
        "reportType": "string",
        "reportGenerationTime": "string",
        "reportStatus": "string",
        "reportContentType": "string",
        "reportGenerationMode": "string"
      },
      {
        "resourceId": "string",
        "reportType": "string",
        "reportGenerationTime": "string",
        "reportStatus": "string",
        "reportContentType": "string",
        "reportGenerationMode": "string"
      },
      {
        "resourceId": "string",
        "reportType": "string",
        "reportGenerationTime": "string",
        "reportStatus": "string",
        "reportContentType": "string",
        "reportGenerationMode": "string"
      },
      {
        "resourceId": "string",
        "reportType": "string",
        "reportGenerationTime": "string",
        "reportStatus": "string",
        "reportContentType": "string",
        "reportGenerationMode": "string"
      },
      {
        "resourceId": "string",
        "reportType": "string",
        "reportGenerationTime": "string",
        "reportStatus": "string",
        "reportContentType": "string",
        "reportGenerationMode": "string"
      },
      {
        "resourceId": "string",
        "reportType": "string",
        "reportGenerationTime": "string",
        "reportStatus": "string",
        "reportContentType": "string",
        "reportGenerationMode": "string"
      },
      {
        "resourceId": "string",
        "reportType": "string",
        "reportGenerationTime": "string",
        "reportStatus": "string",
        "reportContentType": "string",
        "reportGenerationMode": "string"
      },
      {
        "resourceId": "string",
        "reportType": "string",
        "reportGenerationTime": "string",
        "reportStatus": "string",
        "reportContentType": "string",
        "reportGenerationMode": "string"
      },
      {
        "resourceId": "string",
        "reportType": "string",
        "reportGenerationTime": "string",
        "reportStatus": "string",
        "reportContentType": "string",
        "reportGenerationMode": "string"
      },
      {
        "resourceId": "string",
        "reportType": "string",
        "reportGenerationTime": "string",
        "reportStatus": "string",
        "reportContentType": "string",
        "reportGenerationMode": "string"
      }
    ]
  }
]