{
  "actions": [
    {
      "name": "getIfdApiV1EquipmentIntents",
      "protocol": "REST",
      "method": "GET",
      "entitypath": "{base_path}/{version}/ifd/api/v1/equipmentIntents?{query}",
      "requestSchema": "schema.json",
      "responseSchema": "schema.json",
      "timeout": 0,
      "sendEmpty": false,
      "sendGetBody": false,
      "requestDatatype": "JSON",
      "responseDatatype": "JSON",
      "headers": {},
      "responseObjects": [
        {
          "type": "default",
          "key": "",
          "mockFile": ""
        }
      ]
    },
    {
      "name": "postIfdApiV1EquipmentIntents",
      "protocol": "REST",
      "method": "POST",
      "entitypath": "{base_path}/{version}/ifd/api/v1/equipmentIntents?{query}",
      "requestSchema": "schema.json",
      "responseSchema": "schema.json",
      "timeout": 0,
      "sendEmpty": false,
      "requestDatatype": "JSON",
      "responseDatatype": "JSON",
      "headers": {},
      "responseObjects": [
        {
          "type": "default",
          "key": "",
          "mockFile": ""
        }
      ]
    },
    {
      "name": "deleteIfdApiV1EquipmentIntentsProjectNameProjectName",
      "protocol": "REST",
      "method": "DELETE",
      "entitypath": "{base_path}/{version}/ifd/api/v1/equipmentIntents/projectName/{pathv1}?{query}",
      "requestSchema": "schema.json",
      "responseSchema": "schema.json",
      "timeout": 0,
      "sendEmpty": false,
      "requestDatatype": "JSON",
      "responseDatatype": "JSON",
      "headers": {},
      "responseObjects": [
        {
          "type": "default",
          "key": "",
          "mockFile": ""
        }
      ]
    },
    {
      "name": "getIfdApiV1EquipmentIntentsId",
      "protocol": "REST",
      "method": "GET",
      "entitypath": "{base_path}/{version}/ifd/api/v1/equipmentIntents/{pathv1}?{query}",
      "requestSchema": "schema.json",
      "responseSchema": "schema.json",
      "timeout": 0,
      "sendEmpty": false,
      "sendGetBody": false,
      "requestDatatype": "JSON",
      "responseDatatype": "JSON",
      "headers": {},
      "responseObjects": [
        {
          "type": "default",
          "key": "",
          "mockFile": ""
        }
      ]
    },
    {
      "name": "deleteIfdApiV1EquipmentIntentsId",
      "protocol": "REST",
      "method": "DELETE",
      "entitypath": "{base_path}/{version}/ifd/api/v1/equipmentIntents/{pathv1}?{query}",
      "requestSchema": "schema.json",
      "responseSchema": "schema.json",
      "timeout": 0,
      "sendEmpty": false,
      "requestDatatype": "JSON",
      "responseDatatype": "JSON",
      "headers": {},
      "responseObjects": [
        {
          "type": "default",
          "key": "",
          "mockFile": ""
        }
      ]
    }
  ]
}