{
  "$id": "schema.json",
  "type": "object",
  "schema": "http://json-schema.org/draft-07/schema#",
  "translate": true,
  "dynamicfields": true,
  "properties": {
    "ph_request_type": {
      "type": "string",
      "description": "type of request (internal to adapter)",
      "default": "getFresV5",
      "enum": [
        "getFresV5",
        "getFreByIdV5"
      ],
      "external_name": "ph_request_type"
    },
    "networkConstructId": {
      "type": "string",
      "description": "Network Construct identifier",
      "parse": false,
      "encode": false,
      "encrypt": {
        "type": "AES",
        "key": ""
      },
      "external_name": "networkConstruct\\.id"
    },
    "freExpectationsServiceIntentId": {
      "type": "string",
      "description": "The service intent Id",
      "parse": false,
      "encode": false,
      "encrypt": {
        "type": "AES",
        "key": ""
      },
      "external_name": "freExpectations\\.serviceIntent\\.id"
    },
    "freExpectationsEquipmentIntentId": {
      "type": "string",
      "description": "The equipment intent Id",
      "parse": false,
      "encode": false,
      "encrypt": {
        "type": "AES",
        "key": ""
      },
      "external_name": "freExpectations\\.equipmentIntent\\.id"
    },
    "endpointTpeConcrete": {
      "type": "string",
      "description": "Concrete TPE identifier for endpoints",
      "parse": false,
      "encode": false,
      "encrypt": {
        "type": "AES",
        "key": ""
      },
      "external_name": "endpoint\\.tpe\\.concrete"
    },
    "freExpectationsIntentId": {
      "type": "string",
      "description": "The intent Id",
      "parse": false,
      "encode": false,
      "encrypt": {
        "type": "AES",
        "key": ""
      },
      "external_name": "freExpectations\\.intent\\.id"
    }
  },
  "definitions": {}
}