{
  "actions": [
    {
      "name": "getTapiDataContextTopologyContextTopology",
      "protocol": "REST",
      "method": "GET",
      "entitypath": "{base_path}/{version}/tapi/data/context/topology-context/topology/?{query}",
      "requestSchema": "schema.json",
      "responseSchema": "schema.json",
      "timeout": 0,
      "sendEmpty": false,
      "sendGetBody": false,
      "requestDatatype": "JSON",
      "responseDatatype": "JSON",
      "headers": {
        "Accept": "application/yang-data+json"
      },
      "responseObjects": [
        {
          "type": "default",
          "key": "",
          "mockFile": ""
        }
      ]
    },
    {
      "name": "getTapiDataTapiCommonContextTapiTopologyTopologyContextTopology",
      "protocol": "REST",
      "method": "GET",
      "entitypath": "{base_path}/{version}/tapi/data/tapi-common:context/tapi-topology:topology-context/topology/?{query}",
      "requestSchema": "schema.json",
      "responseSchema": "schema.json",
      "timeout": 0,
      "sendEmpty": false,
      "sendGetBody": false,
      "requestDatatype": "JSON",
      "responseDatatype": "JSON",
      "headers": {
        "Accept": "application/yang-data+json"
      },
      "responseObjects": [
        {
          "type": "default",
          "key": "",
          "mockFile": ""
        }
      ]
    },
    {
      "name": "getTapiDataContextTopologyContextTopologyUuid",
      "protocol": "REST",
      "method": "GET",
      "entitypath": "{base_path}/{version}/tapi/data/context/topology-context/{pathv1}?{query}",
      "requestSchema": "schema.json",
      "responseSchema": "schema.json",
      "timeout": 0,
      "sendEmpty": false,
      "sendGetBody": false,
      "requestDatatype": "JSON",
      "responseDatatype": "JSON",
      "headers": {
        "Accept": "application/yang-data+json"
      },
      "responseObjects": [
        {
          "type": "default",
          "key": "",
          "mockFile": ""
        }
      ]
    },
    {
      "name": "getTapiDataTapiCommonContextTapiTopologyTopologyContextTopologyUuid",
      "protocol": "REST",
      "method": "GET",
      "entitypath": "{base_path}/{version}/tapi/data/tapi-common:context/tapi-topology:topology-context/{pathv1}?{query}",
      "requestSchema": "schema.json",
      "responseSchema": "schema.json",
      "timeout": 0,
      "sendEmpty": false,
      "sendGetBody": false,
      "requestDatatype": "JSON",
      "responseDatatype": "JSON",
      "headers": {
        "Accept": "application/yang-data+json"
      },
      "responseObjects": [
        {
          "type": "default",
          "key": "",
          "mockFile": ""
        }
      ]
    },
    {
      "name": "getTapiCoreContextTopologyMcpBaseTopologyLink",
      "protocol": "REST",
      "method": "GET",
      "entitypath": "{base_path}/{version}/tapi/core/context/topology/mcp-base-topology/link/?{query}",
      "requestSchema": "schema.json",
      "responseSchema": "schema.json",
      "timeout": 0,
      "sendEmpty": false,
      "sendGetBody": false,
      "requestDatatype": "JSON",
      "responseDatatype": "JSON",
      "headers": {
        "Accept": "application/json"
      },
      "responseObjects": [
        {
          "type": "default",
          "key": "",
          "mockFile": ""
        }
      ]
    },
    {
      "name": "getTapiDataContextTopologyContextTopologyTopologyUuidLink",
      "protocol": "REST",
      "method": "GET",
      "entitypath": "{base_path}/{version}/tapi/data/context/topology-context/{pathv1}/link/?{query}",
      "requestSchema": "schema.json",
      "responseSchema": "schema.json",
      "timeout": 0,
      "sendEmpty": false,
      "sendGetBody": false,
      "requestDatatype": "JSON",
      "responseDatatype": "JSON",
      "headers": {
        "Accept": "application/yang-data+json"
      },
      "responseObjects": [
        {
          "type": "default",
          "key": "",
          "mockFile": ""
        }
      ]
    },
    {
      "name": "getTapiDataTapiCommonContextTapiTopologyTopologyContextTopologyTopologyUuidLink",
      "protocol": "REST",
      "method": "GET",
      "entitypath": "{base_path}/{version}/tapi/data/tapi-common:context/tapi-topology:topology-context/{pathv1}/link/?{query}",
      "requestSchema": "schema.json",
      "responseSchema": "schema.json",
      "timeout": 0,
      "sendEmpty": false,
      "sendGetBody": false,
      "requestDatatype": "JSON",
      "responseDatatype": "JSON",
      "headers": {
        "Accept": "application/yang-data+json"
      },
      "responseObjects": [
        {
          "type": "default",
          "key": "",
          "mockFile": ""
        }
      ]
    },
    {
      "name": "getTapiDataContextTopologyContextTopologyTopologyUuidLinkLinkUuid",
      "protocol": "REST",
      "method": "GET",
      "entitypath": "{base_path}/{version}/tapi/data/context/topology-context/{pathv1}/{pathv2}?{query}",
      "requestSchema": "schema.json",
      "responseSchema": "schema.json",
      "timeout": 0,
      "sendEmpty": false,
      "sendGetBody": false,
      "requestDatatype": "JSON",
      "responseDatatype": "JSON",
      "headers": {
        "Accept": "application/yang-data+json"
      },
      "responseObjects": [
        {
          "type": "default",
          "key": "",
          "mockFile": ""
        }
      ]
    },
    {
      "name": "getTapiDataTapiCommonContextTapiTopologyTopologyContextTopologyTopologyUuidLinkLinkUuid",
      "protocol": "REST",
      "method": "GET",
      "entitypath": "{base_path}/{version}/tapi/data/tapi-common:context/tapi-topology:topology-context/{pathv1}/{pathv2}?{query}",
      "requestSchema": "schema.json",
      "responseSchema": "schema.json",
      "timeout": 0,
      "sendEmpty": false,
      "sendGetBody": false,
      "requestDatatype": "JSON",
      "responseDatatype": "JSON",
      "headers": {
        "Accept": "application/yang-data+json"
      },
      "responseObjects": [
        {
          "type": "default",
          "key": "",
          "mockFile": ""
        }
      ]
    },
    {
      "name": "getTapiCoreContextTopologyMcpBaseTopologyNode",
      "protocol": "REST",
      "method": "GET",
      "entitypath": "{base_path}/{version}/tapi/core/context/topology/mcp-base-topology/node/?{query}",
      "requestSchema": "schema.json",
      "responseSchema": "schema.json",
      "timeout": 0,
      "sendEmpty": false,
      "sendGetBody": false,
      "requestDatatype": "JSON",
      "responseDatatype": "JSON",
      "headers": {
        "Accept": "application/json"
      },
      "responseObjects": [
        {
          "type": "default",
          "key": "",
          "mockFile": ""
        }
      ]
    },
    {
      "name": "getTapiDataContextTopologyContextTopologyTopologyUuidNode",
      "protocol": "REST",
      "method": "GET",
      "entitypath": "{base_path}/{version}/tapi/data/context/topology-context/{pathv1}/node/?{query}",
      "requestSchema": "schema.json",
      "responseSchema": "schema.json",
      "timeout": 0,
      "sendEmpty": false,
      "sendGetBody": false,
      "requestDatatype": "JSON",
      "responseDatatype": "JSON",
      "headers": {
        "Accept": "application/yang-data+json"
      },
      "responseObjects": [
        {
          "type": "default",
          "key": "",
          "mockFile": ""
        }
      ]
    },
    {
      "name": "getTapiDataTapiCommonContextTapiTopologyTopologyContextTopologyTopologyUuidNode",
      "protocol": "REST",
      "method": "GET",
      "entitypath": "{base_path}/{version}/tapi/data/tapi-common:context/tapi-topology:topology-context/{pathv1}/node/?{query}",
      "requestSchema": "schema.json",
      "responseSchema": "schema.json",
      "timeout": 0,
      "sendEmpty": false,
      "sendGetBody": false,
      "requestDatatype": "JSON",
      "responseDatatype": "JSON",
      "headers": {
        "Accept": "application/yang-data+json"
      },
      "responseObjects": [
        {
          "type": "default",
          "key": "",
          "mockFile": ""
        }
      ]
    },
    {
      "name": "getTapiDataContextTopologyContextTopologyTopologyUuidNodeNodeUuid",
      "protocol": "REST",
      "method": "GET",
      "entitypath": "{base_path}/{version}/tapi/data/context/topology-context/{pathv1}/{pathv2}?{query}",
      "requestSchema": "schema.json",
      "responseSchema": "schema.json",
      "timeout": 0,
      "sendEmpty": false,
      "sendGetBody": false,
      "requestDatatype": "JSON",
      "responseDatatype": "JSON",
      "headers": {
        "Accept": "application/yang-data+json"
      },
      "responseObjects": [
        {
          "type": "default",
          "key": "",
          "mockFile": ""
        }
      ]
    },
    {
      "name": "getTapiDataTapiCommonContextTapiTopologyTopologyContextTopologyTopologyUuidNodeNodeUuid",
      "protocol": "REST",
      "method": "GET",
      "entitypath": "{base_path}/{version}/tapi/data/tapi-common:context/tapi-topology:topology-context/{pathv1}/{pathv2}?{query}",
      "requestSchema": "schema.json",
      "responseSchema": "schema.json",
      "timeout": 0,
      "sendEmpty": false,
      "sendGetBody": false,
      "requestDatatype": "JSON",
      "responseDatatype": "JSON",
      "headers": {
        "Accept": "application/yang-data+json"
      },
      "responseObjects": [
        {
          "type": "default",
          "key": "",
          "mockFile": ""
        }
      ]
    },
    {
      "name": "getTapiDataContextTopologyContextTopologyTopologyUuidNodeNodeUuidOwnedNodeEdgePointOwnedNodeEdgePointUuid",
      "protocol": "REST",
      "method": "GET",
      "entitypath": "{base_path}/{version}/tapi/data/context/topology-context/{pathv1}/{pathv2}/{pathv3}?{query}",
      "requestSchema": "schema.json",
      "responseSchema": "schema.json",
      "timeout": 0,
      "sendEmpty": false,
      "sendGetBody": false,
      "requestDatatype": "JSON",
      "responseDatatype": "JSON",
      "headers": {
        "Accept": "application/yang-data+json"
      },
      "responseObjects": [
        {
          "type": "default",
          "key": "",
          "mockFile": ""
        }
      ]
    },
    {
      "name": "getTapiCoreContextTopologyMcpBaseTopologyNodeEdgePoint",
      "protocol": "REST",
      "method": "GET",
      "entitypath": "{base_path}/{version}/tapi/core/context/topology/mcp-base-topology/node-edge-point/?{query}",
      "requestSchema": "schema.json",
      "responseSchema": "schema.json",
      "timeout": 0,
      "sendEmpty": false,
      "sendGetBody": false,
      "requestDatatype": "JSON",
      "responseDatatype": "JSON",
      "headers": {
        "Accept": "application/json"
      },
      "responseObjects": [
        {
          "type": "default",
          "key": "",
          "mockFile": ""
        }
      ]
    },
    {
      "name": "getTapiDataContextTopologyContextTopologyTopologyUuidNodeEdgePoint",
      "protocol": "REST",
      "method": "GET",
      "entitypath": "{base_path}/{version}/tapi/data/context/topology-context/{pathv1}/node-edge-point/?{query}",
      "requestSchema": "schema.json",
      "responseSchema": "schema.json",
      "timeout": 0,
      "sendEmpty": false,
      "sendGetBody": false,
      "requestDatatype": "JSON",
      "responseDatatype": "JSON",
      "headers": {
        "Accept": "application/yang-data+json"
      },
      "responseObjects": [
        {
          "type": "default",
          "key": "",
          "mockFile": ""
        }
      ]
    },
    {
      "name": "getTapiDataTapiCommonContextTapiTopologyTopologyContextTopologyTopologyUuidNodeEdgePoint",
      "protocol": "REST",
      "method": "GET",
      "entitypath": "{base_path}/{version}/tapi/data/tapi-common:context/tapi-topology:topology-context/{pathv1}/node-edge-point/?{query}",
      "requestSchema": "schema.json",
      "responseSchema": "schema.json",
      "timeout": 0,
      "sendEmpty": false,
      "sendGetBody": false,
      "requestDatatype": "JSON",
      "responseDatatype": "JSON",
      "headers": {
        "Accept": "application/yang-data+json"
      },
      "responseObjects": [
        {
          "type": "default",
          "key": "",
          "mockFile": ""
        }
      ]
    },
    {
      "name": "getTapiDataContextTopologyContextTopologyTopologyUuidNodeEdgePointNodeEdgePointUuid",
      "protocol": "REST",
      "method": "GET",
      "entitypath": "{base_path}/{version}/tapi/data/context/topology-context/{pathv1}/{pathv2}?{query}",
      "requestSchema": "schema.json",
      "responseSchema": "schema.json",
      "timeout": 0,
      "sendEmpty": false,
      "sendGetBody": false,
      "requestDatatype": "JSON",
      "responseDatatype": "JSON",
      "headers": {
        "Accept": "application/yang-data+json"
      },
      "responseObjects": [
        {
          "type": "default",
          "key": "",
          "mockFile": ""
        }
      ]
    },
    {
      "name": "getTapiDataTapiCommonContextTapiTopologyTopologyContextTopologyTopologyUuidNodeEdgePointNodeEdgePointUuid",
      "protocol": "REST",
      "method": "GET",
      "entitypath": "{base_path}/{version}/tapi/data/tapi-common:context/tapi-topology:topology-context/{pathv1}/{pathv2}?{query}",
      "requestSchema": "schema.json",
      "responseSchema": "schema.json",
      "timeout": 0,
      "sendEmpty": false,
      "sendGetBody": false,
      "requestDatatype": "JSON",
      "responseDatatype": "JSON",
      "headers": {
        "Accept": "application/yang-data+json"
      },
      "responseObjects": [
        {
          "type": "default",
          "key": "",
          "mockFile": ""
        }
      ]
    }
  ]
}