{
  "actions": [
    {
      "name": "getEquipmenttopologyplanningApiV1EquipmentKitNameMappings",
      "protocol": "REST",
      "method": "GET",
      "entitypath": "{base_path}/{version}/equipmenttopologyplanning/api/v1/EquipmentKitNameMappings?{query}",
      "requestSchema": "schema.json",
      "responseSchema": "schema.json",
      "timeout": 0,
      "sendEmpty": false,
      "sendGetBody": false,
      "requestDatatype": "JSON",
      "responseDatatype": "JSON",
      "headers": {},
      "responseObjects": [
        {
          "type": "default",
          "key": "",
          "mockFile": ""
        }
      ]
    },
    {
      "name": "postEquipmenttopologyplanningApiV1EquipmentKitNameMappings",
      "protocol": "REST",
      "method": "POST",
      "entitypath": "{base_path}/{version}/equipmenttopologyplanning/api/v1/EquipmentKitNameMappings?{query}",
      "requestSchema": "schema.json",
      "responseSchema": "schema.json",
      "timeout": 0,
      "sendEmpty": false,
      "requestDatatype": "JSON",
      "responseDatatype": "JSON",
      "headers": {},
      "responseObjects": [
        {
          "type": "default",
          "key": "",
          "mockFile": ""
        }
      ]
    },
    {
      "name": "getEqptKitNameMappingByKitName",
      "protocol": "REST",
      "method": "GET",
      "entitypath": "{base_path}/{version}/equipmenttopologyplanning/api/v1/EquipmentKitNameMappings/{pathv1}?{query}",
      "requestSchema": "schema.json",
      "responseSchema": "schema.json",
      "timeout": 0,
      "sendEmpty": false,
      "sendGetBody": false,
      "requestDatatype": "JSON",
      "responseDatatype": "JSON",
      "headers": {},
      "responseObjects": [
        {
          "type": "default",
          "key": "",
          "mockFile": ""
        }
      ]
    },
    {
      "name": "putEquipmenttopologyplanningApiV1EquipmentKitNameMappingsKitName",
      "protocol": "REST",
      "method": "PUT",
      "entitypath": "{base_path}/{version}/equipmenttopologyplanning/api/v1/EquipmentKitNameMappings/{pathv1}?{query}",
      "requestSchema": "schema.json",
      "responseSchema": "schema.json",
      "timeout": 0,
      "sendEmpty": false,
      "requestDatatype": "JSON",
      "responseDatatype": "JSON",
      "headers": {},
      "responseObjects": [
        {
          "type": "default",
          "key": "",
          "mockFile": ""
        }
      ]
    },
    {
      "name": "deleteEquipmenttopologyplanningApiV1EquipmentKitNameMappingsKitName",
      "protocol": "REST",
      "method": "DELETE",
      "entitypath": "{base_path}/{version}/equipmenttopologyplanning/api/v1/EquipmentKitNameMappings/{pathv1}?{query}",
      "requestSchema": "schema.json",
      "responseSchema": "schema.json",
      "timeout": 0,
      "sendEmpty": false,
      "requestDatatype": "JSON",
      "responseDatatype": "JSON",
      "headers": {},
      "responseObjects": [
        {
          "type": "default",
          "key": "",
          "mockFile": ""
        }
      ]
    }
  ]
}