{
  "actions": [
    {
      "name": "getCommissioningSettings",
      "protocol": "REST",
      "method": "GET",
      "entitypath": "{base_path}/{version}/configmgmt/api/v1/commissioning?{query}",
      "requestSchema": "schema.json",
      "responseSchema": "schema.json",
      "timeout": 0,
      "sendEmpty": false,
      "sendGetBody": false,
      "requestDatatype": "JSON",
      "responseDatatype": "JSON",
      "headers": {},
      "responseObjects": [
        {
          "type": "default",
          "key": "",
          "mockFile": ""
        }
      ]
    },
    {
      "name": "applyFunctionAndProfile",
      "protocol": "REST",
      "method": "POST",
      "entitypath": "{base_path}/{version}/configmgmt/api/v1/commissioning?{query}",
      "requestSchema": "schema.json",
      "responseSchema": "schema.json",
      "timeout": 0,
      "sendEmpty": false,
      "requestDatatype": "JSON",
      "responseDatatype": "JSON",
      "headers": {},
      "responseObjects": [
        {
          "type": "default",
          "key": "",
          "mockFile": ""
        }
      ]
    },
    {
      "name": "deleteCommissioningRequest",
      "protocol": "REST",
      "method": "POST",
      "entitypath": "{base_path}/{version}/configmgmt/api/v1/commissioning/{pathv1}/remove?{query}",
      "requestSchema": "schema.json",
      "responseSchema": "schema.json",
      "timeout": 0,
      "sendEmpty": false,
      "requestDatatype": "JSON",
      "responseDatatype": "JSON",
      "headers": {},
      "responseObjects": [
        {
          "type": "default",
          "key": "",
          "mockFile": ""
        }
      ]
    }
  ]
}