{
  "$id": "schema.json",
  "type": "object",
  "schema": "http://json-schema.org/draft-07/schema#",
  "translate": false,
  "dynamicfields": true,
  "properties": {
    "ph_request_type": {
      "type": "string",
      "description": "type of request (internal to adapter)",
      "default": "getEquipmenttopologyplanningApiV1EquipmentKitNameMappings",
      "enum": [
        "getEquipmenttopologyplanningApiV1EquipmentKitNameMappings",
        "postEquipmenttopologyplanningApiV1EquipmentKitNameMappings",
        "getEqptKitNameMappingByKitName",
        "putEquipmenttopologyplanningApiV1EquipmentKitNameMappingsKitName",
        "deleteEquipmenttopologyplanningApiV1EquipmentKitNameMappingsKitName"
      ],
      "external_name": "ph_request_type"
    }
  },
  "definitions": {}
}