{
  "$id": "schema.json",
  "type": "object",
  "schema": "http://json-schema.org/draft-07/schema#",
  "translate": false,
  "dynamicfields": true,
  "properties": {
    "ph_request_type": {
      "type": "string",
      "description": "type of request (internal to adapter)",
      "default": "getNsiApiV3PhysicalLocations",
      "enum": [
        "getNsiApiV3PhysicalLocations",
        "postNsiApiV3PhysicalLocations",
        "getNsiApiV3PhysicalLocationsId",
        "postNsiApiV3PhysicalLocationsIdExpectations",
        "getNsiApiV3PhysicalLocationsIdExpectationsExpectationId",
        "deleteNsiApiV3PhysicalLocationsIdExpectationsExpectationId",
        "putNsiApiV3PhysicalLocationsIdIdentifiersIdentifierKey",
        "deleteNsiApiV3PhysicalLocationsIdIdentifiersIdentifierKey",
        "putNsiApiV3PhysicalLocationsIdUserDataUserDataKey",
        "deleteNsiApiV3PhysicalLocationsIdUserDataUserDataKey",
        "deleteNsiApiV3PhysicalLocationsPhysicalLocationId"
      ],
      "external_name": "ph_request_type"
    }
  },
  "definitions": {}
}