{
  "actions": [
    {
      "name": "getOtdrApiV1Entities",
      "protocol": "REST",
      "method": "GET",
      "entitypath": "{base_path}/{version}/otdr/api/v1/entities?{query}",
      "requestSchema": "schema.json",
      "responseSchema": "schema.json",
      "timeout": 0,
      "sendEmpty": false,
      "sendGetBody": false,
      "requestDatatype": "JSON",
      "responseDatatype": "JSON",
      "headers": {},
      "responseObjects": [
        {
          "type": "default",
          "key": "",
          "mockFile": "mockdatafiles/getOtdrApiV1Entities-default.json"
        }
      ]
    },
    {
      "name": "postOtdrApiV1Entities",
      "protocol": "REST",
      "method": "POST",
      "entitypath": "{base_path}/{version}/otdr/api/v1/entities?{query}",
      "requestSchema": "schema.json",
      "responseSchema": "schema.json",
      "timeout": 0,
      "sendEmpty": false,
      "requestDatatype": "JSON",
      "responseDatatype": "JSON",
      "headers": {},
      "responseObjects": [
        {
          "type": "default",
          "key": "",
          "mockFile": ""
        }
      ]
    },
    {
      "name": "patchOtdrApiV1Entities",
      "protocol": "REST",
      "method": "PATCH",
      "entitypath": "{base_path}/{version}/otdr/api/v1/entities?{query}",
      "requestSchema": "schema.json",
      "responseSchema": "schema.json",
      "timeout": 0,
      "sendEmpty": false,
      "requestDatatype": "JSON",
      "responseDatatype": "JSON",
      "headers": {},
      "responseObjects": [
        {
          "type": "default",
          "key": "",
          "mockFile": ""
        }
      ]
    }
  ]
}