{
  "$id": "schema.json",
  "type": "object",
  "schema": "http://json-schema.org/draft-07/schema#",
  "translate": true,
  "dynamicfields": true,
  "properties": {
    "ph_request_type": {
      "type": "string",
      "description": "type of request (internal to adapter)",
      "default": "postOtdrApiV1Sordownload",
      "enum": [
        "postOtdrApiV1Sordownload"
      ],
      "external_name": "ph_request_type"
    },
    "sessionId": {
      "type": "string",
      "description": "Management session id of enrolled NE",
      "parse": false,
      "encode": false,
      "encrypt": {
        "type": "AES",
        "key": ""
      },
      "external_name": "session_id"
    },
    "profileName": {
      "type": "string",
      "description": "Profile name of SOR download profile",
      "parse": false,
      "encode": false,
      "encrypt": {
        "type": "AES",
        "key": ""
      },
      "external_name": "profile_name"
    }
  },
  "definitions": {}
}