{
  "actions": [
    {
      "name": "getCurrentUser",
      "protocol": "REST",
      "method": "GET",
      "entitypath": "{base_path}/{version}/rbac-e/api/v1/admin/current-user?{query}",
      "requestSchema": "schema.json",
      "responseSchema": "schema.json",
      "timeout": 0,
      "sendEmpty": false,
      "sendGetBody": false,
      "requestDatatype": "JSON",
      "responseDatatype": "JSON",
      "headers": {},
      "responseObjects": [
        {
          "type": "default",
          "key": "",
          "mockFile": ""
        }
      ]
    },
    {
      "name": "getCurrentSessionData",
      "protocol": "REST",
      "method": "GET",
      "entitypath": "{base_path}/{version}/rbac-e/api/v1/admin/current-account?{query}",
      "requestSchema": "schema.json",
      "responseSchema": "schema.json",
      "timeout": 0,
      "sendEmpty": false,
      "sendGetBody": false,
      "requestDatatype": "JSON",
      "responseDatatype": "JSON",
      "headers": {},
      "responseObjects": [
        {
          "type": "default",
          "key": "",
          "mockFile": ""
        }
      ]
    },
    {
      "name": "getCurrentPermissions",
      "protocol": "REST",
      "method": "GET",
      "entitypath": "{base_path}/{version}/rbac-e/api/v1/admin/current-permissions?{query}",
      "requestSchema": "schema.json",
      "responseSchema": "schema.json",
      "timeout": 0,
      "sendEmpty": false,
      "sendGetBody": false,
      "requestDatatype": "JSON",
      "responseDatatype": "JSON",
      "headers": {},
      "responseObjects": [
        {
          "type": "default",
          "key": "",
          "mockFile": ""
        }
      ]
    },
    {
      "name": "getRbacEApiV1AdminResources",
      "protocol": "REST",
      "method": "GET",
      "entitypath": "{base_path}/{version}/rbac-e/api/v1/admin/resources?{query}",
      "requestSchema": "schema.json",
      "responseSchema": "schema.json",
      "timeout": 0,
      "sendEmpty": false,
      "sendGetBody": false,
      "requestDatatype": "JSON",
      "responseDatatype": "JSON",
      "headers": {},
      "responseObjects": [
        {
          "type": "default",
          "key": "",
          "mockFile": "mockdatafiles/getRbacEApiV1AdminResources-default.json"
        }
      ]
    },
    {
      "name": "getSessions",
      "protocol": "REST",
      "method": "GET",
      "entitypath": "{base_path}/{version}/rbac-e/api/v1/admin/sessions?{query}",
      "requestSchema": "schema.json",
      "responseSchema": "schema.json",
      "timeout": 0,
      "sendEmpty": false,
      "sendGetBody": false,
      "requestDatatype": "JSON",
      "responseDatatype": "JSON",
      "headers": {},
      "responseObjects": [
        {
          "type": "default",
          "key": "",
          "mockFile": "mockdatafiles/getSessions-default.json"
        }
      ]
    },
    {
      "name": "clearUserCache",
      "protocol": "REST",
      "method": "DELETE",
      "entitypath": "{base_path}/{version}/rbac-e/api/v1/admin/usercache?{query}",
      "requestSchema": "schema.json",
      "responseSchema": "schema.json",
      "timeout": 0,
      "sendEmpty": false,
      "requestDatatype": "JSON",
      "responseDatatype": "JSON",
      "headers": {},
      "responseObjects": [
        {
          "type": "default",
          "key": "",
          "mockFile": ""
        }
      ]
    },
    {
      "name": "configureAudit",
      "protocol": "REST",
      "method": "POST",
      "entitypath": "{base_path}/{version}/rbac-e/api/v1/audit/configuration?{query}",
      "requestSchema": "schema.json",
      "responseSchema": "schema.json",
      "timeout": 0,
      "sendEmpty": false,
      "requestDatatype": "JSON",
      "responseDatatype": "JSON",
      "headers": {},
      "responseObjects": [
        {
          "type": "default",
          "key": "",
          "mockFile": ""
        }
      ]
    },
    {
      "name": "validateRestResource",
      "protocol": "REST",
      "method": "POST",
      "entitypath": "{base_path}/{version}/rbac-e/api/v1/rest/permission?{query}",
      "requestSchema": "schema.json",
      "responseSchema": "schema.json",
      "timeout": 0,
      "sendEmpty": false,
      "requestDatatype": "JSON",
      "responseDatatype": "JSON",
      "headers": {},
      "responseObjects": [
        {
          "type": "default",
          "key": "",
          "mockFile": "mockdatafiles/validateRestResource-default.json"
        }
      ]
    }
  ]
}