{
  "actions": [
    {
      "name": "getProjectmanagementApiV1PlanningProjects",
      "protocol": "REST",
      "method": "GET",
      "entitypath": "{base_path}/{version}/projectmanagement/api/v1/PlanningProjects?{query}",
      "requestSchema": "schema.json",
      "responseSchema": "schema.json",
      "timeout": 0,
      "sendEmpty": false,
      "sendGetBody": false,
      "requestDatatype": "JSON",
      "responseDatatype": "JSON",
      "headers": {},
      "responseObjects": [
        {
          "type": "default",
          "key": "",
          "mockFile": "mockdatafiles/getProjectmanagementApiV1PlanningProjects-default.json"
        }
      ]
    },
    {
      "name": "postProjectmanagementApiV1PlanningProjects",
      "protocol": "REST",
      "method": "POST",
      "entitypath": "{base_path}/{version}/projectmanagement/api/v1/PlanningProjects?{query}",
      "requestSchema": "schema.json",
      "responseSchema": "schema.json",
      "timeout": 0,
      "sendEmpty": false,
      "requestDatatype": "JSON",
      "responseDatatype": "JSON",
      "headers": {},
      "responseObjects": [
        {
          "type": "default",
          "key": "",
          "mockFile": ""
        }
      ]
    },
    {
      "name": "deleteProjectmanagementApiV1PlanningProjects",
      "protocol": "REST",
      "method": "DELETE",
      "entitypath": "{base_path}/{version}/projectmanagement/api/v1/PlanningProjects?{query}",
      "requestSchema": "schema.json",
      "responseSchema": "schema.json",
      "timeout": 0,
      "sendEmpty": false,
      "requestDatatype": "JSON",
      "responseDatatype": "JSON",
      "headers": {},
      "responseObjects": [
        {
          "type": "default",
          "key": "",
          "mockFile": ""
        }
      ]
    },
    {
      "name": "getByGuid",
      "protocol": "REST",
      "method": "GET",
      "entitypath": "{base_path}/{version}/projectmanagement/api/v1/PlanningProjects/{pathv1}?{query}",
      "requestSchema": "schema.json",
      "responseSchema": "schema.json",
      "timeout": 0,
      "sendEmpty": false,
      "sendGetBody": false,
      "requestDatatype": "JSON",
      "responseDatatype": "JSON",
      "headers": {},
      "responseObjects": [
        {
          "type": "default",
          "key": "",
          "mockFile": ""
        }
      ]
    },
    {
      "name": "putProjectmanagementApiV1PlanningProjectsId",
      "protocol": "REST",
      "method": "PUT",
      "entitypath": "{base_path}/{version}/projectmanagement/api/v1/PlanningProjects/{pathv1}?{query}",
      "requestSchema": "schema.json",
      "responseSchema": "schema.json",
      "timeout": 0,
      "sendEmpty": false,
      "requestDatatype": "JSON",
      "responseDatatype": "JSON",
      "headers": {},
      "responseObjects": [
        {
          "type": "default",
          "key": "",
          "mockFile": ""
        }
      ]
    },
    {
      "name": "deleteProjectmanagementApiV1PlanningProjectsId",
      "protocol": "REST",
      "method": "DELETE",
      "entitypath": "{base_path}/{version}/projectmanagement/api/v1/PlanningProjects/{pathv1}?{query}",
      "requestSchema": "schema.json",
      "responseSchema": "schema.json",
      "timeout": 0,
      "sendEmpty": false,
      "requestDatatype": "JSON",
      "responseDatatype": "JSON",
      "headers": {},
      "responseObjects": [
        {
          "type": "default",
          "key": "",
          "mockFile": ""
        }
      ]
    },
    {
      "name": "postProjectmanagementApiV1PlanningProjectsIdCommit",
      "protocol": "REST",
      "method": "POST",
      "entitypath": "{base_path}/{version}/projectmanagement/api/v1/PlanningProjects/{pathv1}/commit?{query}",
      "requestSchema": "schema.json",
      "responseSchema": "schema.json",
      "timeout": 0,
      "sendEmpty": false,
      "requestDatatype": "JSON",
      "responseDatatype": "JSON",
      "headers": {},
      "responseObjects": [
        {
          "type": "default",
          "key": "",
          "mockFile": ""
        }
      ]
    },
    {
      "name": "postProjectmanagementApiV1PlanningProjectsIdCommitOperation",
      "protocol": "REST",
      "method": "POST",
      "entitypath": "{base_path}/{version}/projectmanagement/api/v1/PlanningProjects/{pathv1}/commitOperation?{query}",
      "requestSchema": "schema.json",
      "responseSchema": "schema.json",
      "timeout": 0,
      "sendEmpty": false,
      "requestDatatype": "JSON",
      "responseDatatype": "JSON",
      "headers": {},
      "responseObjects": [
        {
          "type": "default",
          "key": "",
          "mockFile": ""
        }
      ]
    },
    {
      "name": "postProjectmanagementApiV1PlanningProjectsCommit",
      "protocol": "REST",
      "method": "POST",
      "entitypath": "{base_path}/{version}/projectmanagement/api/v1/PlanningProjects/commit?{query}",
      "requestSchema": "schema.json",
      "responseSchema": "schema.json",
      "timeout": 0,
      "sendEmpty": false,
      "requestDatatype": "JSON",
      "responseDatatype": "JSON",
      "headers": {},
      "responseObjects": [
        {
          "type": "default",
          "key": "",
          "mockFile": ""
        }
      ]
    },
    {
      "name": "postProjectmanagementApiV1PlanningProjectsCommitOperation",
      "protocol": "REST",
      "method": "POST",
      "entitypath": "{base_path}/{version}/projectmanagement/api/v1/PlanningProjects/commitOperation?{query}",
      "requestSchema": "schema.json",
      "responseSchema": "schema.json",
      "timeout": 0,
      "sendEmpty": false,
      "requestDatatype": "JSON",
      "responseDatatype": "JSON",
      "headers": {},
      "responseObjects": [
        {
          "type": "default",
          "key": "",
          "mockFile": ""
        }
      ]
    },
    {
      "name": "postProjectmanagementApiV1PlanningProjectsIdCancel",
      "protocol": "REST",
      "method": "POST",
      "entitypath": "{base_path}/{version}/projectmanagement/api/v1/PlanningProjects/{pathv1}/cancel?{query}",
      "requestSchema": "schema.json",
      "responseSchema": "schema.json",
      "timeout": 0,
      "sendEmpty": false,
      "requestDatatype": "JSON",
      "responseDatatype": "JSON",
      "headers": {},
      "responseObjects": [
        {
          "type": "default",
          "key": "",
          "mockFile": ""
        }
      ]
    },
    {
      "name": "postProjectmanagementApiV1PlanningProjectsIdCancelOperation",
      "protocol": "REST",
      "method": "POST",
      "entitypath": "{base_path}/{version}/projectmanagement/api/v1/PlanningProjects/{pathv1}/cancelOperation?{query}",
      "requestSchema": "schema.json",
      "responseSchema": "schema.json",
      "timeout": 0,
      "sendEmpty": false,
      "requestDatatype": "JSON",
      "responseDatatype": "JSON",
      "headers": {},
      "responseObjects": [
        {
          "type": "default",
          "key": "",
          "mockFile": ""
        }
      ]
    },
    {
      "name": "postProjectmanagementApiV1PlanningProjectsCancel",
      "protocol": "REST",
      "method": "POST",
      "entitypath": "{base_path}/{version}/projectmanagement/api/v1/PlanningProjects/cancel?{query}",
      "requestSchema": "schema.json",
      "responseSchema": "schema.json",
      "timeout": 0,
      "sendEmpty": false,
      "requestDatatype": "JSON",
      "responseDatatype": "JSON",
      "headers": {},
      "responseObjects": [
        {
          "type": "default",
          "key": "",
          "mockFile": ""
        }
      ]
    },
    {
      "name": "postProjectmanagementApiV1PlanningProjectsCancelOperation",
      "protocol": "REST",
      "method": "POST",
      "entitypath": "{base_path}/{version}/projectmanagement/api/v1/PlanningProjects/cancelOperation?{query}",
      "requestSchema": "schema.json",
      "responseSchema": "schema.json",
      "timeout": 0,
      "sendEmpty": false,
      "requestDatatype": "JSON",
      "responseDatatype": "JSON",
      "headers": {},
      "responseObjects": [
        {
          "type": "default",
          "key": "",
          "mockFile": ""
        }
      ]
    },
    {
      "name": "postProjectmanagementApiV1PlanningProjectsUpdateArchivedStatus",
      "protocol": "REST",
      "method": "POST",
      "entitypath": "{base_path}/{version}/projectmanagement/api/v1/PlanningProjects/updateArchivedStatus?{query}",
      "requestSchema": "schema.json",
      "responseSchema": "schema.json",
      "timeout": 0,
      "sendEmpty": false,
      "requestDatatype": "JSON",
      "responseDatatype": "JSON",
      "headers": {},
      "responseObjects": [
        {
          "type": "default",
          "key": "",
          "mockFile": ""
        }
      ]
    },
    {
      "name": "postProjectmanagementApiV1PlanningProjectsNameChangeOperation",
      "protocol": "REST",
      "method": "POST",
      "entitypath": "{base_path}/{version}/projectmanagement/api/v1/PlanningProjects/nameChangeOperation?{query}",
      "requestSchema": "schema.json",
      "responseSchema": "schema.json",
      "timeout": 0,
      "sendEmpty": false,
      "requestDatatype": "JSON",
      "responseDatatype": "JSON",
      "headers": {},
      "responseObjects": [
        {
          "type": "default",
          "key": "",
          "mockFile": ""
        }
      ]
    },
    {
      "name": "patchProjectmanagementApiV1PlanningProjectsNameProjectName",
      "protocol": "REST",
      "method": "PATCH",
      "entitypath": "{base_path}/{version}/projectmanagement/api/v1/PlanningProjects/name/{pathv1}?{query}",
      "requestSchema": "schema.json",
      "responseSchema": "schema.json",
      "timeout": 0,
      "sendEmpty": false,
      "requestDatatype": "JSON",
      "responseDatatype": "JSON",
      "headers": {},
      "responseObjects": [
        {
          "type": "default",
          "key": "",
          "mockFile": ""
        }
      ]
    }
  ]
}