{
  "actions": [
    {
      "name": "getIfdApiV3Srlg",
      "protocol": "REST",
      "method": "GET",
      "entitypath": "{base_path}/{version}/ifd/api/v3/srlg?{query}",
      "requestSchema": "schema.json",
      "responseSchema": "schema.json",
      "timeout": 0,
      "sendEmpty": false,
      "sendGetBody": false,
      "requestDatatype": "JSON",
      "responseDatatype": "JSON",
      "headers": {},
      "responseObjects": [
        {
          "type": "default",
          "key": "",
          "mockFile": ""
        }
      ]
    },
    {
      "name": "getIfdApiV3SrlgAssociatedSrlgs",
      "protocol": "REST",
      "method": "GET",
      "entitypath": "{base_path}/{version}/ifd/api/v3/srlg/associatedSrlgs?{query}",
      "requestSchema": "schema.json",
      "responseSchema": "schema.json",
      "timeout": 0,
      "sendEmpty": false,
      "sendGetBody": false,
      "requestDatatype": "JSON",
      "responseDatatype": "JSON",
      "headers": {},
      "responseObjects": [
        {
          "type": "default",
          "key": "",
          "mockFile": ""
        }
      ]
    },
    {
      "name": "getIfdApiV3SrlgJobStatus",
      "protocol": "REST",
      "method": "GET",
      "entitypath": "{base_path}/{version}/ifd/api/v3/srlg/job/status?{query}",
      "requestSchema": "schema.json",
      "responseSchema": "schema.json",
      "timeout": 0,
      "sendEmpty": false,
      "sendGetBody": false,
      "requestDatatype": "JSON",
      "responseDatatype": "JSON",
      "headers": {},
      "responseObjects": [
        {
          "type": "default",
          "key": "",
          "mockFile": ""
        }
      ]
    },
    {
      "name": "getIfdApiV3SrlgSrlgMismatch",
      "protocol": "REST",
      "method": "GET",
      "entitypath": "{base_path}/{version}/ifd/api/v3/srlg/srlgMismatch?{query}",
      "requestSchema": "schema.json",
      "responseSchema": "schema.json",
      "timeout": 0,
      "sendEmpty": false,
      "sendGetBody": false,
      "requestDatatype": "JSON",
      "responseDatatype": "JSON",
      "headers": {},
      "responseObjects": [
        {
          "type": "default",
          "key": "",
          "mockFile": ""
        }
      ]
    },
    {
      "name": "getIfdApiV3SrlgSrlgMismatchMismatchIdDetails",
      "protocol": "REST",
      "method": "GET",
      "entitypath": "{base_path}/{version}/ifd/api/v3/srlg/srlgMismatch/{pathv1}/details?{query}",
      "requestSchema": "schema.json",
      "responseSchema": "schema.json",
      "timeout": 0,
      "sendEmpty": false,
      "sendGetBody": false,
      "requestDatatype": "JSON",
      "responseDatatype": "JSON",
      "headers": {},
      "responseObjects": [
        {
          "type": "default",
          "key": "",
          "mockFile": ""
        }
      ]
    },
    {
      "name": "getIfdApiV3SrlgSrlgValueAssignmentDetails",
      "protocol": "REST",
      "method": "GET",
      "entitypath": "{base_path}/{version}/ifd/api/v3/srlg/{pathv1}/assignmentDetails?{query}",
      "requestSchema": "schema.json",
      "responseSchema": "schema.json",
      "timeout": 0,
      "sendEmpty": false,
      "sendGetBody": false,
      "requestDatatype": "JSON",
      "responseDatatype": "JSON",
      "headers": {},
      "responseObjects": [
        {
          "type": "default",
          "key": "",
          "mockFile": ""
        }
      ]
    }
  ]
}