{
  "actions": [
    {
      "name": "getClients",
      "protocol": "REST",
      "method": "GET",
      "entitypath": "{base_path}/{version}/licensing/api/v1/licensing/reports/clients?{query}",
      "requestSchema": "schema.json",
      "responseSchema": "schema.json",
      "timeout": 0,
      "sendEmpty": false,
      "sendGetBody": false,
      "requestDatatype": "JSON",
      "responseDatatype": "JSON",
      "headers": {},
      "responseObjects": [
        {
          "type": "default",
          "key": "",
          "mockFile": ""
        }
      ]
    },
    {
      "name": "exportAllClients",
      "protocol": "REST",
      "method": "GET",
      "entitypath": "{base_path}/{version}/licensing/api/v1/licensing/reports/clients/export?{query}",
      "requestSchema": "schema.json",
      "responseSchema": "schema.json",
      "timeout": 0,
      "sendEmpty": false,
      "sendGetBody": false,
      "requestDatatype": "JSON",
      "responseDatatype": "JSON",
      "headers": {},
      "responseObjects": [
        {
          "type": "default",
          "key": "",
          "mockFile": ""
        }
      ]
    }
  ]
}