{
  "actions": [
    {
      "name": "getAllUnassociatedNes",
      "protocol": "REST",
      "method": "GET",
      "entitypath": "{base_path}/{version}/pinpoint/api/v1/nes?{query}",
      "requestSchema": "schema.json",
      "responseSchema": "schema.json",
      "timeout": 0,
      "sendEmpty": false,
      "sendGetBody": false,
      "requestDatatype": "JSON",
      "responseDatatype": "JSON",
      "headers": {},
      "responseObjects": [
        {
          "type": "default",
          "key": "",
          "mockFile": ""
        }
      ]
    },
    {
      "name": "getOtdrConfigDataById",
      "protocol": "REST",
      "method": "GET",
      "entitypath": "{base_path}/{version}/pinpoint/api/v1/nes/{pathv1}/otdr/{pathv2}?{query}",
      "requestSchema": "schema.json",
      "responseSchema": "schema.json",
      "timeout": 0,
      "sendEmpty": false,
      "sendGetBody": false,
      "requestDatatype": "JSON",
      "responseDatatype": "JSON",
      "headers": {},
      "responseObjects": [
        {
          "type": "default",
          "key": "",
          "mockFile": ""
        }
      ]
    },
    {
      "name": "setBaseline",
      "protocol": "REST",
      "method": "POST",
      "entitypath": "{base_path}/{version}/pinpoint/api/v1/nes/{pathv1}/otdr/{pathv2}/setbaseline?{query}",
      "requestSchema": "schema.json",
      "responseSchema": "schema.json",
      "timeout": 0,
      "sendEmpty": false,
      "requestDatatype": "JSON",
      "responseDatatype": "JSON",
      "headers": {},
      "responseObjects": [
        {
          "type": "default",
          "key": "",
          "mockFile": ""
        }
      ]
    },
    {
      "name": "getSorFiles",
      "protocol": "REST",
      "method": "GET",
      "entitypath": "{base_path}/{version}/pinpoint/api/v1/nes/{pathv1}/otdr/{pathv2}/sorfiles?{query}",
      "requestSchema": "schema.json",
      "responseSchema": "schema.json",
      "timeout": 0,
      "sendEmpty": false,
      "sendGetBody": false,
      "requestDatatype": "JSON",
      "responseDatatype": "JSON",
      "headers": {},
      "responseObjects": [
        {
          "type": "default",
          "key": "",
          "mockFile": ""
        }
      ]
    },
    {
      "name": "startTrace",
      "protocol": "REST",
      "method": "POST",
      "entitypath": "{base_path}/{version}/pinpoint/api/v1/nes/{pathv1}/otdr/{pathv2}/starttrace?{query}",
      "requestSchema": "schema.json",
      "responseSchema": "schema.json",
      "timeout": 0,
      "sendEmpty": false,
      "requestDatatype": "JSON",
      "responseDatatype": "JSON",
      "headers": {},
      "responseObjects": [
        {
          "type": "default",
          "key": "",
          "mockFile": ""
        }
      ]
    },
    {
      "name": "stopTrace",
      "protocol": "REST",
      "method": "POST",
      "entitypath": "{base_path}/{version}/pinpoint/api/v1/nes/{pathv1}/otdr/{pathv2}/stoptrace?{query}",
      "requestSchema": "schema.json",
      "responseSchema": "schema.json",
      "timeout": 0,
      "sendEmpty": false,
      "requestDatatype": "JSON",
      "responseDatatype": "JSON",
      "headers": {},
      "responseObjects": [
        {
          "type": "default",
          "key": "",
          "mockFile": ""
        }
      ]
    },
    {
      "name": "getTraceStatus",
      "protocol": "REST",
      "method": "GET",
      "entitypath": "{base_path}/{version}/pinpoint/api/v1/nes/{pathv1}/otdr/{pathv2}/tracestatus?{query}",
      "requestSchema": "schema.json",
      "responseSchema": "schema.json",
      "timeout": 0,
      "sendEmpty": false,
      "sendGetBody": false,
      "requestDatatype": "JSON",
      "responseDatatype": "JSON",
      "headers": {},
      "responseObjects": [
        {
          "type": "default",
          "key": "",
          "mockFile": ""
        }
      ]
    }
  ]
}