{
  "$id": "schema.json",
  "type": "object",
  "schema": "http://json-schema.org/draft-07/schema#",
  "translate": true,
  "dynamicfields": true,
  "properties": {
    "ph_request_type": {
      "type": "string",
      "description": "type of request (internal to adapter)",
      "default": "getEquipmentV5",
      "enum": [
        "getEquipmentV5"
      ],
      "external_name": "ph_request_type"
    },
    "networkConstructId": {
      "type": "string",
      "description": "(Optional) Network Construct identifier",
      "parse": false,
      "encode": false,
      "encrypt": {
        "type": "AES",
        "key": ""
      },
      "external_name": "networkConstruct\\.id"
    },
    "equipmentExpectationsEquipmentIntentId": {
      "type": "string",
      "description": "(Optional) Equipment Intent Identifier",
      "parse": false,
      "encode": false,
      "encrypt": {
        "type": "AES",
        "key": ""
      },
      "external_name": "equipmentExpectations\\.equipmentIntent\\.id"
    }
  },
  "definitions": {}
}