{
  "actions": [
    {
      "name": "assignSegmentIdentifier",
      "protocol": "REST",
      "method": "POST",
      "entitypath": "{base_path}/{version}/configmgmt/api/v1/bulkOperations/assignSegmentIdentifier?{query}",
      "requestSchema": "schema.json",
      "responseSchema": "schema.json",
      "timeout": 0,
      "sendEmpty": false,
      "requestDatatype": "FORM",
      "responseDatatype": "JSON",
      "headers": {},
      "responseObjects": [
        {
          "type": "default",
          "key": "",
          "mockFile": ""
        }
      ]
    },
    {
      "name": "retrieveNEResourcesOfOperation",
      "protocol": "REST",
      "method": "GET",
      "entitypath": "{base_path}/{version}/configmgmt/api/v1/bulkOperations/getNEResourcesOfOperation?{query}",
      "requestSchema": "schema.json",
      "responseSchema": "schema.json",
      "timeout": 0,
      "sendEmpty": false,
      "sendGetBody": false,
      "requestDatatype": "JSON",
      "responseDatatype": "JSON",
      "headers": {},
      "responseObjects": [
        {
          "type": "default",
          "key": "",
          "mockFile": ""
        }
      ]
    },
    {
      "name": "retrieveProgressStatusOfOperations",
      "protocol": "REST",
      "method": "GET",
      "entitypath": "{base_path}/{version}/configmgmt/api/v1/bulkOperations/getProgressOfOperation?{query}",
      "requestSchema": "schema.json",
      "responseSchema": "schema.json",
      "timeout": 0,
      "sendEmpty": false,
      "sendGetBody": false,
      "requestDatatype": "JSON",
      "responseDatatype": "JSON",
      "headers": {},
      "responseObjects": [
        {
          "type": "default",
          "key": "",
          "mockFile": ""
        }
      ]
    },
    {
      "name": "retrieveStatusOfOperations",
      "protocol": "REST",
      "method": "GET",
      "entitypath": "{base_path}/{version}/configmgmt/api/v1/bulkOperations/getStatusOfOperations?{query}",
      "requestSchema": "schema.json",
      "responseSchema": "schema.json",
      "timeout": 0,
      "sendEmpty": false,
      "sendGetBody": false,
      "requestDatatype": "JSON",
      "responseDatatype": "JSON",
      "headers": {},
      "responseObjects": [
        {
          "type": "default",
          "key": "",
          "mockFile": ""
        }
      ]
    }
  ]
}