{
  "data": [
    {
      "id": "NMCC-1-2-9-2-1",
      "type": "spectrum-facility",
      "attributes": {
        "TARGSWSEL": "12",
        "INITATTEN": "12.00",
        "CTRLFREQOFFSET": "0.000",
        "EXPINITPOW": "N/A",
        "SWSEL": "16",
        "REFBW": "12.5GHZ",
        "WSSCHINPOW": "N/A",
        "CENTERFREQ": "191.343750",
        "CTRLSSCATTEN": "20.00",
        "MAXFREQ": "191.362500",
        "TID": "SSTSite3",
        "AID": "NMCC-1-2-9-2-1",
        "INPWEREF": "N/A",
        "INPOWSRC": "0.0",
        "SPECTRALWIDTH": "37.500",
        "CHNLPOW": "N/A",
        "TARGLOSS": "18.00",
        "CTRLSTATE": "Not Applicable",
        "SST": "IS",
        "ISOPQ": "YES",
        "CTRLTARGPOW": "N/A",
        "WSSOUTPOW": "N/A",
        "LOSS": "N/A",
        "CTRLSSC": "SSC-1-2-9-3",
        "MINFREQ": "191.325000",
        "CHCMODE": "OPENLOOPLOSS",
        "ATTEN": "N/A",
        "INPOW": "N/A",
        "CKTID": "N/A",
        "WSSCHOUTPOW": "N/A",
        "PST": "IS",
        "CTRLOUTPOW": "N/A"
      }
    },
    {
      "id": "NMCC-1-2-9-2-1",
      "type": "spectrum-facility",
      "attributes": {
        "TARGSWSEL": "12",
        "INITATTEN": "12.00",
        "CTRLFREQOFFSET": "0.000",
        "EXPINITPOW": "N/A",
        "SWSEL": "16",
        "REFBW": "12.5GHZ",
        "WSSCHINPOW": "N/A",
        "CENTERFREQ": "191.343750",
        "CTRLSSCATTEN": "20.00",
        "MAXFREQ": "191.362500",
        "TID": "SSTSite3",
        "AID": "NMCC-1-2-9-2-1",
        "INPWEREF": "N/A",
        "INPOWSRC": "0.0",
        "SPECTRALWIDTH": "37.500",
        "CHNLPOW": "N/A",
        "TARGLOSS": "18.00",
        "CTRLSTATE": "Not Applicable",
        "SST": "IS",
        "ISOPQ": "YES",
        "CTRLTARGPOW": "N/A",
        "WSSOUTPOW": "N/A",
        "LOSS": "N/A",
        "CTRLSSC": "SSC-1-2-9-3",
        "MINFREQ": "191.325000",
        "CHCMODE": "OPENLOOPLOSS",
        "ATTEN": "N/A",
        "INPOW": "N/A",
        "CKTID": "N/A",
        "WSSCHOUTPOW": "N/A",
        "PST": "IS",
        "CTRLOUTPOW": "N/A"
      }
    },
    {
      "id": "NMCC-1-2-9-2-1",
      "type": "spectrum-facility",
      "attributes": {
        "TARGSWSEL": "12",
        "INITATTEN": "12.00",
        "CTRLFREQOFFSET": "0.000",
        "EXPINITPOW": "N/A",
        "SWSEL": "16",
        "REFBW": "12.5GHZ",
        "WSSCHINPOW": "N/A",
        "CENTERFREQ": "191.343750",
        "CTRLSSCATTEN": "20.00",
        "MAXFREQ": "191.362500",
        "TID": "SSTSite3",
        "AID": "NMCC-1-2-9-2-1",
        "INPWEREF": "N/A",
        "INPOWSRC": "0.0",
        "SPECTRALWIDTH": "37.500",
        "CHNLPOW": "N/A",
        "TARGLOSS": "18.00",
        "CTRLSTATE": "Not Applicable",
        "SST": "IS",
        "ISOPQ": "YES",
        "CTRLTARGPOW": "N/A",
        "WSSOUTPOW": "N/A",
        "LOSS": "N/A",
        "CTRLSSC": "SSC-1-2-9-3",
        "MINFREQ": "191.325000",
        "CHCMODE": "OPENLOOPLOSS",
        "ATTEN": "N/A",
        "INPOW": "N/A",
        "CKTID": "N/A",
        "WSSCHOUTPOW": "N/A",
        "PST": "IS",
        "CTRLOUTPOW": "N/A"
      }
    },
    {
      "id": "NMCC-1-2-9-2-1",
      "type": "spectrum-facility",
      "attributes": {
        "TARGSWSEL": "12",
        "INITATTEN": "12.00",
        "CTRLFREQOFFSET": "0.000",
        "EXPINITPOW": "N/A",
        "SWSEL": "16",
        "REFBW": "12.5GHZ",
        "WSSCHINPOW": "N/A",
        "CENTERFREQ": "191.343750",
        "CTRLSSCATTEN": "20.00",
        "MAXFREQ": "191.362500",
        "TID": "SSTSite3",
        "AID": "NMCC-1-2-9-2-1",
        "INPWEREF": "N/A",
        "INPOWSRC": "0.0",
        "SPECTRALWIDTH": "37.500",
        "CHNLPOW": "N/A",
        "TARGLOSS": "18.00",
        "CTRLSTATE": "Not Applicable",
        "SST": "IS",
        "ISOPQ": "YES",
        "CTRLTARGPOW": "N/A",
        "WSSOUTPOW": "N/A",
        "LOSS": "N/A",
        "CTRLSSC": "SSC-1-2-9-3",
        "MINFREQ": "191.325000",
        "CHCMODE": "OPENLOOPLOSS",
        "ATTEN": "N/A",
        "INPOW": "N/A",
        "CKTID": "N/A",
        "WSSCHOUTPOW": "N/A",
        "PST": "IS",
        "CTRLOUTPOW": "N/A"
      }
    },
    {
      "id": "NMCC-1-2-9-2-1",
      "type": "spectrum-facility",
      "attributes": {
        "TARGSWSEL": "12",
        "INITATTEN": "12.00",
        "CTRLFREQOFFSET": "0.000",
        "EXPINITPOW": "N/A",
        "SWSEL": "16",
        "REFBW": "12.5GHZ",
        "WSSCHINPOW": "N/A",
        "CENTERFREQ": "191.343750",
        "CTRLSSCATTEN": "20.00",
        "MAXFREQ": "191.362500",
        "TID": "SSTSite3",
        "AID": "NMCC-1-2-9-2-1",
        "INPWEREF": "N/A",
        "INPOWSRC": "0.0",
        "SPECTRALWIDTH": "37.500",
        "CHNLPOW": "N/A",
        "TARGLOSS": "18.00",
        "CTRLSTATE": "Not Applicable",
        "SST": "IS",
        "ISOPQ": "YES",
        "CTRLTARGPOW": "N/A",
        "WSSOUTPOW": "N/A",
        "LOSS": "N/A",
        "CTRLSSC": "SSC-1-2-9-3",
        "MINFREQ": "191.325000",
        "CHCMODE": "OPENLOOPLOSS",
        "ATTEN": "N/A",
        "INPOW": "N/A",
        "CKTID": "N/A",
        "WSSCHOUTPOW": "N/A",
        "PST": "IS",
        "CTRLOUTPOW": "N/A"
      }
    },
    {
      "id": "NMCC-1-2-9-2-1",
      "type": "spectrum-facility",
      "attributes": {
        "TARGSWSEL": "12",
        "INITATTEN": "12.00",
        "CTRLFREQOFFSET": "0.000",
        "EXPINITPOW": "N/A",
        "SWSEL": "16",
        "REFBW": "12.5GHZ",
        "WSSCHINPOW": "N/A",
        "CENTERFREQ": "191.343750",
        "CTRLSSCATTEN": "20.00",
        "MAXFREQ": "191.362500",
        "TID": "SSTSite3",
        "AID": "NMCC-1-2-9-2-1",
        "INPWEREF": "N/A",
        "INPOWSRC": "0.0",
        "SPECTRALWIDTH": "37.500",
        "CHNLPOW": "N/A",
        "TARGLOSS": "18.00",
        "CTRLSTATE": "Not Applicable",
        "SST": "IS",
        "ISOPQ": "YES",
        "CTRLTARGPOW": "N/A",
        "WSSOUTPOW": "N/A",
        "LOSS": "N/A",
        "CTRLSSC": "SSC-1-2-9-3",
        "MINFREQ": "191.325000",
        "CHCMODE": "OPENLOOPLOSS",
        "ATTEN": "N/A",
        "INPOW": "N/A",
        "CKTID": "N/A",
        "WSSCHOUTPOW": "N/A",
        "PST": "IS",
        "CTRLOUTPOW": "N/A"
      }
    },
    {
      "id": "NMCC-1-2-9-2-1",
      "type": "spectrum-facility",
      "attributes": {
        "TARGSWSEL": "12",
        "INITATTEN": "12.00",
        "CTRLFREQOFFSET": "0.000",
        "EXPINITPOW": "N/A",
        "SWSEL": "16",
        "REFBW": "12.5GHZ",
        "WSSCHINPOW": "N/A",
        "CENTERFREQ": "191.343750",
        "CTRLSSCATTEN": "20.00",
        "MAXFREQ": "191.362500",
        "TID": "SSTSite3",
        "AID": "NMCC-1-2-9-2-1",
        "INPWEREF": "N/A",
        "INPOWSRC": "0.0",
        "SPECTRALWIDTH": "37.500",
        "CHNLPOW": "N/A",
        "TARGLOSS": "18.00",
        "CTRLSTATE": "Not Applicable",
        "SST": "IS",
        "ISOPQ": "YES",
        "CTRLTARGPOW": "N/A",
        "WSSOUTPOW": "N/A",
        "LOSS": "N/A",
        "CTRLSSC": "SSC-1-2-9-3",
        "MINFREQ": "191.325000",
        "CHCMODE": "OPENLOOPLOSS",
        "ATTEN": "N/A",
        "INPOW": "N/A",
        "CKTID": "N/A",
        "WSSCHOUTPOW": "N/A",
        "PST": "IS",
        "CTRLOUTPOW": "N/A"
      }
    }
  ]
}