{
  "actions": [
    {
      "name": "getNsiApiV3NetworkConstructs",
      "protocol": "REST",
      "method": "GET",
      "entitypath": "{base_path}/{version}/nsi/api/v3/networkConstructs?{query}",
      "requestSchema": "schema.json",
      "responseSchema": "schema.json",
      "timeout": 0,
      "sendEmpty": false,
      "sendGetBody": false,
      "requestDatatype": "JSON",
      "responseDatatype": "JSON",
      "headers": {},
      "responseObjects": [
        {
          "type": "default",
          "key": "",
          "mockFile": ""
        }
      ]
    },
    {
      "name": "getNsiApiV3NetworkConstructsId",
      "protocol": "REST",
      "method": "GET",
      "entitypath": "{base_path}/{version}/nsi/api/v3/networkConstructs/{pathv1}?{query}",
      "requestSchema": "schema.json",
      "responseSchema": "schema.json",
      "timeout": 0,
      "sendEmpty": false,
      "sendGetBody": false,
      "requestDatatype": "JSON",
      "responseDatatype": "JSON",
      "headers": {},
      "responseObjects": [
        {
          "type": "default",
          "key": "",
          "mockFile": ""
        }
      ]
    },
    {
      "name": "deleteNsiApiV3NetworkConstructsId",
      "protocol": "REST",
      "method": "DELETE",
      "entitypath": "{base_path}/{version}/nsi/api/v3/networkConstructs/{pathv1}?{query}",
      "requestSchema": "schema.json",
      "responseSchema": "schema.json",
      "timeout": 0,
      "sendEmpty": false,
      "requestDatatype": "JSON",
      "responseDatatype": "JSON",
      "headers": {},
      "responseObjects": [
        {
          "type": "default",
          "key": "",
          "mockFile": ""
        }
      ]
    },
    {
      "name": "patchNsiApiV3NetworkConstructsId",
      "protocol": "REST",
      "method": "PATCH",
      "entitypath": "{base_path}/{version}/nsi/api/v3/networkConstructs/{pathv1}?{query}",
      "requestSchema": "schema.json",
      "responseSchema": "schema.json",
      "timeout": 0,
      "sendEmpty": false,
      "requestDatatype": "JSON",
      "responseDatatype": "JSON",
      "headers": {},
      "responseObjects": [
        {
          "type": "default",
          "key": "",
          "mockFile": ""
        }
      ]
    },
    {
      "name": "postNsiApiV3NetworkConstructsIdExpectations",
      "protocol": "REST",
      "method": "POST",
      "entitypath": "{base_path}/{version}/nsi/api/v3/networkConstructs/{pathv1}/expectations?{query}",
      "requestSchema": "schema.json",
      "responseSchema": "schema.json",
      "timeout": 0,
      "sendEmpty": false,
      "requestDatatype": "JSON",
      "responseDatatype": "JSON",
      "headers": {},
      "responseObjects": [
        {
          "type": "default",
          "key": "",
          "mockFile": ""
        }
      ]
    },
    {
      "name": "patchNsiApiV3NetworkConstructsIdExpectationsExpectationId",
      "protocol": "REST",
      "method": "PATCH",
      "entitypath": "{base_path}/{version}/nsi/api/v3/networkConstructs/{pathv1}/expectations/{pathv2}?{query}",
      "requestSchema": "schema.json",
      "responseSchema": "schema.json",
      "timeout": 0,
      "sendEmpty": false,
      "requestDatatype": "JSON",
      "responseDatatype": "JSON",
      "headers": {},
      "responseObjects": [
        {
          "type": "default",
          "key": "",
          "mockFile": ""
        }
      ]
    },
    {
      "name": "getNsiApiV3NetworkConstructsIdExpectationsNetworkConstructExpectationId",
      "protocol": "REST",
      "method": "GET",
      "entitypath": "{base_path}/{version}/nsi/api/v3/networkConstructs/{pathv1}/expectations/{pathv2}?{query}",
      "requestSchema": "schema.json",
      "responseSchema": "schema.json",
      "timeout": 0,
      "sendEmpty": false,
      "sendGetBody": false,
      "requestDatatype": "JSON",
      "responseDatatype": "JSON",
      "headers": {},
      "responseObjects": [
        {
          "type": "default",
          "key": "",
          "mockFile": ""
        }
      ]
    },
    {
      "name": "deleteNsiApiV3NetworkConstructsIdExpectationsNetworkConstructExpectationId",
      "protocol": "REST",
      "method": "DELETE",
      "entitypath": "{base_path}/{version}/nsi/api/v3/networkConstructs/{pathv1}/expectations/{pathv2}?{query}",
      "requestSchema": "schema.json",
      "responseSchema": "schema.json",
      "timeout": 0,
      "sendEmpty": false,
      "requestDatatype": "JSON",
      "responseDatatype": "JSON",
      "headers": {},
      "responseObjects": [
        {
          "type": "default",
          "key": "",
          "mockFile": ""
        }
      ]
    },
    {
      "name": "putNsiApiV3NetworkConstructsIdExpectationsNetworkConstructExpectationIdAttributeName",
      "protocol": "REST",
      "method": "PUT",
      "entitypath": "{base_path}/{version}/nsi/api/v3/networkConstructs/{pathv1}/expectations/{pathv2}/{pathv3}?{query}",
      "requestSchema": "schema.json",
      "responseSchema": "schema.json",
      "timeout": 0,
      "sendEmpty": false,
      "requestDatatype": "PLAIN",
      "responseDatatype": "JSON",
      "headers": {},
      "responseObjects": [
        {
          "type": "default",
          "key": "",
          "mockFile": ""
        }
      ]
    },
    {
      "name": "updateNCIdentifiers",
      "protocol": "REST",
      "method": "PUT",
      "entitypath": "{base_path}/{version}/nsi/api/v3/networkConstructs/{pathv1}/identifiers/{pathv2}?{query}",
      "requestSchema": "schema.json",
      "responseSchema": "schema.json",
      "timeout": 0,
      "sendEmpty": false,
      "requestDatatype": "JSON",
      "responseDatatype": "JSON",
      "headers": {},
      "responseObjects": [
        {
          "type": "default",
          "key": "",
          "mockFile": ""
        }
      ]
    },
    {
      "name": "deleteNsiApiV3NetworkConstructsIdIdentifiersIdentifierKey",
      "protocol": "REST",
      "method": "DELETE",
      "entitypath": "{base_path}/{version}/nsi/api/v3/networkConstructs/{pathv1}/identifiers/{pathv2}?{query}",
      "requestSchema": "schema.json",
      "responseSchema": "schema.json",
      "timeout": 0,
      "sendEmpty": false,
      "requestDatatype": "JSON",
      "responseDatatype": "JSON",
      "headers": {},
      "responseObjects": [
        {
          "type": "default",
          "key": "",
          "mockFile": ""
        }
      ]
    },
    {
      "name": "getNsiApiV3NetworkConstructsIdNetworkConstructPlanned",
      "protocol": "REST",
      "method": "GET",
      "entitypath": "{base_path}/{version}/nsi/api/v3/networkConstructs/{pathv1}/networkConstructPlanned?{query}",
      "requestSchema": "schema.json",
      "responseSchema": "schema.json",
      "timeout": 0,
      "sendEmpty": false,
      "sendGetBody": false,
      "requestDatatype": "JSON",
      "responseDatatype": "JSON",
      "headers": {},
      "responseObjects": [
        {
          "type": "default",
          "key": "",
          "mockFile": ""
        }
      ]
    },
    {
      "name": "patchNsiApiV3NetworkConstructsIdNetworkConstructPlanned",
      "protocol": "REST",
      "method": "PATCH",
      "entitypath": "{base_path}/{version}/nsi/api/v3/networkConstructs/{pathv1}/networkConstructPlanned?{query}",
      "requestSchema": "schema.json",
      "responseSchema": "schema.json",
      "timeout": 0,
      "sendEmpty": false,
      "requestDatatype": "JSON",
      "responseDatatype": "JSON",
      "headers": {},
      "responseObjects": [
        {
          "type": "default",
          "key": "",
          "mockFile": ""
        }
      ]
    }
  ]
}