{
  "$id": "schema.json",
  "type": "object",
  "schema": "http://json-schema.org/draft-07/schema#",
  "translate": true,
  "dynamicfields": true,
  "properties": {
    "ph_request_type": {
      "type": "string",
      "description": "type of request (internal to adapter)",
      "default": "getControllers",
      "enum": [
        "getControllers",
        "postController",
        "getController",
        "deleteControllerById",
        "getControllerExpectationsById",
        "deleteControllerExpectation",
        "getControllerPlannedById",
        "postNsiApiControllersControllerIdExpectations",
        "postNsiApiControllersControllerIdExpectationsControllerExpectationIdRealize",
        "putControllerOperations"
      ],
      "external_name": "ph_request_type"
    },
    "networkConstructId": {
      "type": "string",
      "description": "Network Construct identifier",
      "parse": false,
      "encode": false,
      "encrypt": {
        "type": "AES",
        "key": ""
      },
      "external_name": "networkConstruct\\.id"
    }
  },
  "definitions": {}
}