{
  "openapi": "3.0.0",
  "info": {
    "title": "Calix API Documentation",
    "description": "Integration with Calix SOAP interface - 1 endpoint need to manually add others",
    "contact": {},
    "version": "1.0"
  },
  "servers": [
    {
      "url": "http://example.com/v1",
      "variables": {}
    },
    {
      "url": "https://example.com/v1",
      "variables": {}
    }
  ],
  "paths": {
    "/cmsexc/ex/netconf": {
      "post": {
        "tags": [
          "Generic"
        ],
        "summary": "Generic call to Calix",
        "description": "Generic call to Calix",
        "operationId": "GenericCalixRequest",
        "parameters": [],
        "requestBody": {
          "content": {
            "application/xml": {
              "schema": {
                "type": "string"
              }
            }
          },
          "required": true
        },
        "responses": {
          "200": {
            "description": "",
            "content": {
              "application/xml": {
                "schema": {
                  "type": "string"
                }
              }
            }
          }
        }
      }
    }
  },
  "components": {
    "schemas": {
    }
  },
  "tags": [
    {
      "name": "Generic",
      "description": "Generic Entity"
    }
  ]
}