{
  "actions": [
    {
      "name": "virtualserviceGET",
      "protocol": "REST",
      "method": "GET",
      "entitypath": "{base_path}/{version}/virtualservice?{query}",
      "requestSchema": "schema.json",
      "responseSchema": "schema.json",
      "timeout": 0,
      "sendEmpty": false,
      "sendGetBody": false,
      "requestDatatype": "JSON",
      "responseDatatype": "JSON",
      "headers": {},
      "responseObjects": [
        {
          "type": "default",
          "key": "",
          "mockFile": "mockdatafiles/virtualserviceGET-default.json"
        }
      ]
    },
    {
      "name": "virtualservicePOST",
      "protocol": "REST",
      "method": "POST",
      "entitypath": "{base_path}/{version}/virtualservice?{query}",
      "requestSchema": "schema.json",
      "responseSchema": "schema.json",
      "timeout": 0,
      "sendEmpty": false,
      "requestDatatype": "JSON",
      "responseDatatype": "JSON",
      "headers": {},
      "responseObjects": [
        {
          "type": "default",
          "key": "",
          "mockFile": "mockdatafiles/virtualservicePOST-default.json"
        }
      ]
    },
    {
      "name": "virtualserviceByUuidGET",
      "protocol": "REST",
      "method": "GET",
      "entitypath": "{base_path}/{version}/virtualservice/{pathv1}?{query}",
      "requestSchema": "schema.json",
      "responseSchema": "schema.json",
      "timeout": 0,
      "sendEmpty": false,
      "sendGetBody": false,
      "requestDatatype": "JSON",
      "responseDatatype": "JSON",
      "headers": {},
      "responseObjects": [
        {
          "type": "default",
          "key": "",
          "mockFile": "mockdatafiles/virtualserviceByUuidGET-default.json"
        }
      ]
    },
    {
      "name": "virtualserviceByUuidPUT",
      "protocol": "REST",
      "method": "PUT",
      "entitypath": "{base_path}/{version}/virtualservice/{pathv1}?{query}",
      "requestSchema": "schema.json",
      "responseSchema": "schema.json",
      "timeout": 0,
      "sendEmpty": false,
      "requestDatatype": "JSON",
      "responseDatatype": "JSON",
      "headers": {},
      "responseObjects": [
        {
          "type": "default",
          "key": "",
          "mockFile": "mockdatafiles/virtualserviceByUuidPUT-default.json"
        }
      ]
    },
    {
      "name": "virtualserviceByUuidPATCH",
      "protocol": "REST",
      "method": "PATCH",
      "entitypath": "{base_path}/{version}/virtualservice/{pathv1}?{query}",
      "requestSchema": "schema.json",
      "responseSchema": "schema.json",
      "timeout": 0,
      "sendEmpty": false,
      "requestDatatype": "JSON",
      "responseDatatype": "JSON",
      "headers": {},
      "responseObjects": [
        {
          "type": "default",
          "key": "",
          "mockFile": "mockdatafiles/virtualserviceByUuidPATCH-default.json"
        }
      ]
    },
    {
      "name": "virtualserviceByUuidDELETE",
      "protocol": "REST",
      "method": "DELETE",
      "entitypath": "{base_path}/{version}/virtualservice/{pathv1}?{query}",
      "requestSchema": "schema.json",
      "responseSchema": "schema.json",
      "timeout": 0,
      "sendEmpty": false,
      "requestDatatype": "JSON",
      "responseDatatype": "JSON",
      "headers": {},
      "responseObjects": [
        {
          "type": "default",
          "key": "",
          "mockFile": ""
        }
      ]
    },
    {
      "name": "virtualserviceScaleoutByUuidPOST",
      "protocol": "REST",
      "method": "POST",
      "entitypath": "{base_path}/{version}/virtualservice/{pathv1}/scaleout?{query}",
      "requestSchema": "schema.json",
      "responseSchema": "schema.json",
      "timeout": 0,
      "sendEmpty": false,
      "requestDatatype": "JSON",
      "responseDatatype": "JSON",
      "headers": {},
      "responseObjects": [
        {
          "type": "default",
          "key": "",
          "mockFile": ""
        }
      ]
    },
    {
      "name": "virtualserviceScaleinByUuidPOST",
      "protocol": "REST",
      "method": "POST",
      "entitypath": "{base_path}/{version}/virtualservice/{pathv1}/scalein?{query}",
      "requestSchema": "schema.json",
      "responseSchema": "schema.json",
      "timeout": 0,
      "sendEmpty": false,
      "requestDatatype": "JSON",
      "responseDatatype": "JSON",
      "headers": {},
      "responseObjects": [
        {
          "type": "default",
          "key": "",
          "mockFile": ""
        }
      ]
    },
    {
      "name": "virtualserviceMigrateByUuidPOST",
      "protocol": "REST",
      "method": "POST",
      "entitypath": "{base_path}/{version}/virtualservice/{pathv1}/migrate?{query}",
      "requestSchema": "schema.json",
      "responseSchema": "schema.json",
      "timeout": 0,
      "sendEmpty": false,
      "requestDatatype": "JSON",
      "responseDatatype": "JSON",
      "headers": {},
      "responseObjects": [
        {
          "type": "default",
          "key": "",
          "mockFile": ""
        }
      ]
    },
    {
      "name": "virtualserviceSwitchoverByUuidPOST",
      "protocol": "REST",
      "method": "POST",
      "entitypath": "{base_path}/{version}/virtualservice/{pathv1}/switchover?{query}",
      "requestSchema": "schema.json",
      "responseSchema": "schema.json",
      "timeout": 0,
      "sendEmpty": false,
      "requestDatatype": "JSON",
      "responseDatatype": "JSON",
      "headers": {},
      "responseObjects": [
        {
          "type": "default",
          "key": "",
          "mockFile": ""
        }
      ]
    },
    {
      "name": "virtualserviceClearByUuidPOST",
      "protocol": "REST",
      "method": "POST",
      "entitypath": "{base_path}/{version}/virtualservice/{pathv1}/clear?{query}",
      "requestSchema": "schema.json",
      "responseSchema": "schema.json",
      "timeout": 0,
      "sendEmpty": false,
      "requestDatatype": "JSON",
      "responseDatatype": "JSON",
      "headers": {},
      "responseObjects": [
        {
          "type": "default",
          "key": "",
          "mockFile": ""
        }
      ]
    },
    {
      "name": "virtualserviceResyncByUuidPOST",
      "protocol": "REST",
      "method": "POST",
      "entitypath": "{base_path}/{version}/virtualservice/{pathv1}/resync?{query}",
      "requestSchema": "schema.json",
      "responseSchema": "schema.json",
      "timeout": 0,
      "sendEmpty": false,
      "requestDatatype": "JSON",
      "responseDatatype": "JSON",
      "headers": {},
      "responseObjects": [
        {
          "type": "default",
          "key": "",
          "mockFile": ""
        }
      ]
    },
    {
      "name": "virtualserviceRotatekeysByUuidPOST",
      "protocol": "REST",
      "method": "POST",
      "entitypath": "{base_path}/{version}/virtualservice/{pathv1}/rotatekeys?{query}",
      "requestSchema": "schema.json",
      "responseSchema": "schema.json",
      "timeout": 0,
      "sendEmpty": false,
      "requestDatatype": "JSON",
      "responseDatatype": "JSON",
      "headers": {},
      "responseObjects": [
        {
          "type": "default",
          "key": "",
          "mockFile": ""
        }
      ]
    },
    {
      "name": "virtualserviceApicplacementByUuidPOST",
      "protocol": "REST",
      "method": "POST",
      "entitypath": "{base_path}/{version}/virtualservice/{pathv1}/apicplacement?{query}",
      "requestSchema": "schema.json",
      "responseSchema": "schema.json",
      "timeout": 0,
      "sendEmpty": false,
      "requestDatatype": "JSON",
      "responseDatatype": "JSON",
      "headers": {},
      "responseObjects": [
        {
          "type": "default",
          "key": "",
          "mockFile": ""
        }
      ]
    },
    {
      "name": "virtualserviceRetryplacementByUuidPOST",
      "protocol": "REST",
      "method": "POST",
      "entitypath": "{base_path}/{version}/virtualservice/{pathv1}/retryplacement?{query}",
      "requestSchema": "schema.json",
      "responseSchema": "schema.json",
      "timeout": 0,
      "sendEmpty": false,
      "requestDatatype": "JSON",
      "responseDatatype": "JSON",
      "headers": {},
      "responseObjects": [
        {
          "type": "default",
          "key": "",
          "mockFile": ""
        }
      ]
    },
    {
      "name": "virtualserviceRuntimeByUuidGET",
      "protocol": "REST",
      "method": "GET",
      "entitypath": "{base_path}/{version}/virtualservice/{pathv1}/runtime/?{query}",
      "requestSchema": "schema.json",
      "responseSchema": "schema.json",
      "timeout": 0,
      "sendEmpty": false,
      "sendGetBody": false,
      "requestDatatype": "JSON",
      "responseDatatype": "JSON",
      "headers": {},
      "responseObjects": [
        {
          "type": "default",
          "key": "",
          "mockFile": ""
        }
      ]
    },
    {
      "name": "virtualserviceRuntimeDetailByUuidGET",
      "protocol": "REST",
      "method": "GET",
      "entitypath": "{base_path}/{version}/virtualservice/{pathv1}/runtime/detail/?{query}",
      "requestSchema": "schema.json",
      "responseSchema": "schema.json",
      "timeout": 0,
      "sendEmpty": false,
      "sendGetBody": false,
      "requestDatatype": "JSON",
      "responseDatatype": "JSON",
      "headers": {},
      "responseObjects": [
        {
          "type": "default",
          "key": "",
          "mockFile": ""
        }
      ]
    },
    {
      "name": "virtualserviceRuntimeInternalByUuidGET",
      "protocol": "REST",
      "method": "GET",
      "entitypath": "{base_path}/{version}/virtualservice/{pathv1}/runtime/internal/?{query}",
      "requestSchema": "schema.json",
      "responseSchema": "schema.json",
      "timeout": 0,
      "sendEmpty": false,
      "sendGetBody": false,
      "requestDatatype": "JSON",
      "responseDatatype": "JSON",
      "headers": {},
      "responseObjects": [
        {
          "type": "default",
          "key": "",
          "mockFile": ""
        }
      ]
    },
    {
      "name": "virtualserviceUdpstatByUuidGET",
      "protocol": "REST",
      "method": "GET",
      "entitypath": "{base_path}/{version}/virtualservice/{pathv1}/udpstat/?{query}",
      "requestSchema": "schema.json",
      "responseSchema": "schema.json",
      "timeout": 0,
      "sendEmpty": false,
      "sendGetBody": false,
      "requestDatatype": "JSON",
      "responseDatatype": "JSON",
      "headers": {},
      "responseObjects": [
        {
          "type": "default",
          "key": "",
          "mockFile": ""
        }
      ]
    },
    {
      "name": "virtualserviceTcpstatByUuidGET",
      "protocol": "REST",
      "method": "GET",
      "entitypath": "{base_path}/{version}/virtualservice/{pathv1}/tcpstat/?{query}",
      "requestSchema": "schema.json",
      "responseSchema": "schema.json",
      "timeout": 0,
      "sendEmpty": false,
      "sendGetBody": false,
      "requestDatatype": "JSON",
      "responseDatatype": "JSON",
      "headers": {},
      "responseObjects": [
        {
          "type": "default",
          "key": "",
          "mockFile": ""
        }
      ]
    },
    {
      "name": "virtualserviceTrafficCloneStatsByUuidGET",
      "protocol": "REST",
      "method": "GET",
      "entitypath": "{base_path}/{version}/virtualservice/{pathv1}/traffic_clone_stats/?{query}",
      "requestSchema": "schema.json",
      "responseSchema": "schema.json",
      "timeout": 0,
      "sendEmpty": false,
      "sendGetBody": false,
      "requestDatatype": "JSON",
      "responseDatatype": "JSON",
      "headers": {},
      "responseObjects": [
        {
          "type": "default",
          "key": "",
          "mockFile": ""
        }
      ]
    },
    {
      "name": "virtualserviceDosstatByUuidGET",
      "protocol": "REST",
      "method": "GET",
      "entitypath": "{base_path}/{version}/virtualservice/{pathv1}/dosstat/?{query}",
      "requestSchema": "schema.json",
      "responseSchema": "schema.json",
      "timeout": 0,
      "sendEmpty": false,
      "sendGetBody": false,
      "requestDatatype": "JSON",
      "responseDatatype": "JSON",
      "headers": {},
      "responseObjects": [
        {
          "type": "default",
          "key": "",
          "mockFile": ""
        }
      ]
    },
    {
      "name": "virtualserviceConnectionsByUuidGET",
      "protocol": "REST",
      "method": "GET",
      "entitypath": "{base_path}/{version}/virtualservice/{pathv1}/connections/?{query}",
      "requestSchema": "schema.json",
      "responseSchema": "schema.json",
      "timeout": 0,
      "sendEmpty": false,
      "sendGetBody": false,
      "requestDatatype": "JSON",
      "responseDatatype": "JSON",
      "headers": {},
      "responseObjects": [
        {
          "type": "default",
          "key": "",
          "mockFile": ""
        }
      ]
    },
    {
      "name": "virtualserviceHttpconnectionsByUuidGET",
      "protocol": "REST",
      "method": "GET",
      "entitypath": "{base_path}/{version}/virtualservice/{pathv1}/httpconnections/?{query}",
      "requestSchema": "schema.json",
      "responseSchema": "schema.json",
      "timeout": 0,
      "sendEmpty": false,
      "sendGetBody": false,
      "requestDatatype": "JSON",
      "responseDatatype": "JSON",
      "headers": {},
      "responseObjects": [
        {
          "type": "default",
          "key": "",
          "mockFile": ""
        }
      ]
    },
    {
      "name": "virtualserviceHttpconnectionsDetailGET",
      "protocol": "REST",
      "method": "GET",
      "entitypath": "{base_path}/{version}/virtualservice/{pathv1}/httpconnections/detail/?{query}",
      "requestSchema": "schema.json",
      "responseSchema": "schema.json",
      "timeout": 0,
      "sendEmpty": false,
      "sendGetBody": false,
      "requestDatatype": "JSON",
      "responseDatatype": "JSON",
      "headers": {},
      "responseObjects": [
        {
          "type": "default",
          "key": "",
          "mockFile": ""
        }
      ]
    },
    {
      "name": "virtualserviceHttpstatsByUuidGET",
      "protocol": "REST",
      "method": "GET",
      "entitypath": "{base_path}/{version}/virtualservice/{pathv1}/httpstats/?{query}",
      "requestSchema": "schema.json",
      "responseSchema": "schema.json",
      "timeout": 0,
      "sendEmpty": false,
      "sendGetBody": false,
      "requestDatatype": "JSON",
      "responseDatatype": "JSON",
      "headers": {},
      "responseObjects": [
        {
          "type": "default",
          "key": "",
          "mockFile": ""
        }
      ]
    },
    {
      "name": "virtualserviceAuthstatsByUuidGET",
      "protocol": "REST",
      "method": "GET",
      "entitypath": "{base_path}/{version}/virtualservice/{pathv1}/authstats/?{query}",
      "requestSchema": "schema.json",
      "responseSchema": "schema.json",
      "timeout": 0,
      "sendEmpty": false,
      "sendGetBody": false,
      "requestDatatype": "JSON",
      "responseDatatype": "JSON",
      "headers": {},
      "responseObjects": [
        {
          "type": "default",
          "key": "",
          "mockFile": ""
        }
      ]
    },
    {
      "name": "virtualserviceHttppolicysetByUuidGET",
      "protocol": "REST",
      "method": "GET",
      "entitypath": "{base_path}/{version}/virtualservice/{pathv1}/httppolicyset/?{query}",
      "requestSchema": "schema.json",
      "responseSchema": "schema.json",
      "timeout": 0,
      "sendEmpty": false,
      "sendGetBody": false,
      "requestDatatype": "JSON",
      "responseDatatype": "JSON",
      "headers": {},
      "responseObjects": [
        {
          "type": "default",
          "key": "",
          "mockFile": ""
        }
      ]
    },
    {
      "name": "virtualserviceHttppolicysetstatsByUuidGET",
      "protocol": "REST",
      "method": "GET",
      "entitypath": "{base_path}/{version}/virtualservice/{pathv1}/httppolicysetstats/?{query}",
      "requestSchema": "schema.json",
      "responseSchema": "schema.json",
      "timeout": 0,
      "sendEmpty": false,
      "sendGetBody": false,
      "requestDatatype": "JSON",
      "responseDatatype": "JSON",
      "headers": {},
      "responseObjects": [
        {
          "type": "default",
          "key": "",
          "mockFile": ""
        }
      ]
    },
    {
      "name": "virtualserviceDnspolicystatsByUuidGET",
      "protocol": "REST",
      "method": "GET",
      "entitypath": "{base_path}/{version}/virtualservice/{pathv1}/dnspolicystats/?{query}",
      "requestSchema": "schema.json",
      "responseSchema": "schema.json",
      "timeout": 0,
      "sendEmpty": false,
      "sendGetBody": false,
      "requestDatatype": "JSON",
      "responseDatatype": "JSON",
      "headers": {},
      "responseObjects": [
        {
          "type": "default",
          "key": "",
          "mockFile": ""
        }
      ]
    },
    {
      "name": "virtualserviceNetworksecuritypolicystatsGET",
      "protocol": "REST",
      "method": "GET",
      "entitypath": "{base_path}/{version}/virtualservice/{pathv1}/networksecuritypolicystats/?{query}",
      "requestSchema": "schema.json",
      "responseSchema": "schema.json",
      "timeout": 0,
      "sendEmpty": false,
      "sendGetBody": false,
      "requestDatatype": "JSON",
      "responseDatatype": "JSON",
      "headers": {},
      "responseObjects": [
        {
          "type": "default",
          "key": "",
          "mockFile": ""
        }
      ]
    },
    {
      "name": "virtualserviceNetworksecuritypolicyDetailGET",
      "protocol": "REST",
      "method": "GET",
      "entitypath": "{base_path}/{version}/virtualservice/{pathv1}/networksecuritypolicy/detail/?{query}",
      "requestSchema": "schema.json",
      "responseSchema": "schema.json",
      "timeout": 0,
      "sendEmpty": false,
      "sendGetBody": false,
      "requestDatatype": "JSON",
      "responseDatatype": "JSON",
      "headers": {},
      "responseObjects": [
        {
          "type": "default",
          "key": "",
          "mockFile": ""
        }
      ]
    },
    {
      "name": "virtualserviceCandidatesehostlistByUuidGET",
      "protocol": "REST",
      "method": "GET",
      "entitypath": "{base_path}/{version}/virtualservice/{pathv1}/candidatesehostlist/?{query}",
      "requestSchema": "schema.json",
      "responseSchema": "schema.json",
      "timeout": 0,
      "sendEmpty": false,
      "sendGetBody": false,
      "requestDatatype": "JSON",
      "responseDatatype": "JSON",
      "headers": {},
      "responseObjects": [
        {
          "type": "default",
          "key": "",
          "mockFile": ""
        }
      ]
    },
    {
      "name": "virtualservicePlacementByUuidGET",
      "protocol": "REST",
      "method": "GET",
      "entitypath": "{base_path}/{version}/virtualservice/{pathv1}/placement/?{query}",
      "requestSchema": "schema.json",
      "responseSchema": "schema.json",
      "timeout": 0,
      "sendEmpty": false,
      "sendGetBody": false,
      "requestDatatype": "JSON",
      "responseDatatype": "JSON",
      "headers": {},
      "responseObjects": [
        {
          "type": "default",
          "key": "",
          "mockFile": ""
        }
      ]
    },
    {
      "name": "virtualserviceKeyvalByUuidGET",
      "protocol": "REST",
      "method": "GET",
      "entitypath": "{base_path}/{version}/virtualservice/{pathv1}/keyval/?{query}",
      "requestSchema": "schema.json",
      "responseSchema": "schema.json",
      "timeout": 0,
      "sendEmpty": false,
      "sendGetBody": false,
      "requestDatatype": "JSON",
      "responseDatatype": "JSON",
      "headers": {},
      "responseObjects": [
        {
          "type": "default",
          "key": "",
          "mockFile": ""
        }
      ]
    },
    {
      "name": "virtualserviceKeyvalsummaryByUuidGET",
      "protocol": "REST",
      "method": "GET",
      "entitypath": "{base_path}/{version}/virtualservice/{pathv1}/keyvalsummary/?{query}",
      "requestSchema": "schema.json",
      "responseSchema": "schema.json",
      "timeout": 0,
      "sendEmpty": false,
      "sendGetBody": false,
      "requestDatatype": "JSON",
      "responseDatatype": "JSON",
      "headers": {},
      "responseObjects": [
        {
          "type": "default",
          "key": "",
          "mockFile": ""
        }
      ]
    },
    {
      "name": "virtualserviceSslsessioncacheByUuidGET",
      "protocol": "REST",
      "method": "GET",
      "entitypath": "{base_path}/{version}/virtualservice/{pathv1}/sslsessioncache/?{query}",
      "requestSchema": "schema.json",
      "responseSchema": "schema.json",
      "timeout": 0,
      "sendEmpty": false,
      "sendGetBody": false,
      "requestDatatype": "JSON",
      "responseDatatype": "JSON",
      "headers": {},
      "responseObjects": [
        {
          "type": "default",
          "key": "",
          "mockFile": ""
        }
      ]
    },
    {
      "name": "virtualserviceCltrackByUuidGET",
      "protocol": "REST",
      "method": "GET",
      "entitypath": "{base_path}/{version}/virtualservice/{pathv1}/cltrack/?{query}",
      "requestSchema": "schema.json",
      "responseSchema": "schema.json",
      "timeout": 0,
      "sendEmpty": false,
      "sendGetBody": false,
      "requestDatatype": "JSON",
      "responseDatatype": "JSON",
      "headers": {},
      "responseObjects": [
        {
          "type": "default",
          "key": "",
          "mockFile": ""
        }
      ]
    },
    {
      "name": "virtualserviceCltracksummaryByUuidGET",
      "protocol": "REST",
      "method": "GET",
      "entitypath": "{base_path}/{version}/virtualservice/{pathv1}/cltracksummary/?{query}",
      "requestSchema": "schema.json",
      "responseSchema": "schema.json",
      "timeout": 0,
      "sendEmpty": false,
      "sendGetBody": false,
      "requestDatatype": "JSON",
      "responseDatatype": "JSON",
      "headers": {},
      "responseObjects": [
        {
          "type": "default",
          "key": "",
          "mockFile": ""
        }
      ]
    },
    {
      "name": "virtualserviceClientByUuidGET",
      "protocol": "REST",
      "method": "GET",
      "entitypath": "{base_path}/{version}/virtualservice/{pathv1}/client/?{query}",
      "requestSchema": "schema.json",
      "responseSchema": "schema.json",
      "timeout": 0,
      "sendEmpty": false,
      "sendGetBody": false,
      "requestDatatype": "JSON",
      "responseDatatype": "JSON",
      "headers": {},
      "responseObjects": [
        {
          "type": "default",
          "key": "",
          "mockFile": ""
        }
      ]
    },
    {
      "name": "virtualserviceClientsummaryByUuidGET",
      "protocol": "REST",
      "method": "GET",
      "entitypath": "{base_path}/{version}/virtualservice/{pathv1}/clientsummary/?{query}",
      "requestSchema": "schema.json",
      "responseSchema": "schema.json",
      "timeout": 0,
      "sendEmpty": false,
      "sendGetBody": false,
      "requestDatatype": "JSON",
      "responseDatatype": "JSON",
      "headers": {},
      "responseObjects": [
        {
          "type": "default",
          "key": "",
          "mockFile": ""
        }
      ]
    },
    {
      "name": "virtualserviceDnstableByUuidGET",
      "protocol": "REST",
      "method": "GET",
      "entitypath": "{base_path}/{version}/virtualservice/{pathv1}/dnstable/?{query}",
      "requestSchema": "schema.json",
      "responseSchema": "schema.json",
      "timeout": 0,
      "sendEmpty": false,
      "sendGetBody": false,
      "requestDatatype": "JSON",
      "responseDatatype": "JSON",
      "headers": {},
      "responseObjects": [
        {
          "type": "default",
          "key": "",
          "mockFile": ""
        }
      ]
    },
    {
      "name": "virtualserviceGslbservicedetailByUuidGET",
      "protocol": "REST",
      "method": "GET",
      "entitypath": "{base_path}/{version}/virtualservice/{pathv1}/gslbservicedetail/?{query}",
      "requestSchema": "schema.json",
      "responseSchema": "schema.json",
      "timeout": 0,
      "sendEmpty": false,
      "sendGetBody": false,
      "requestDatatype": "JSON",
      "responseDatatype": "JSON",
      "headers": {},
      "responseObjects": [
        {
          "type": "default",
          "key": "",
          "mockFile": ""
        }
      ]
    },
    {
      "name": "virtualserviceGslbserviceinternalByUuidGET",
      "protocol": "REST",
      "method": "GET",
      "entitypath": "{base_path}/{version}/virtualservice/{pathv1}/gslbserviceinternal/?{query}",
      "requestSchema": "schema.json",
      "responseSchema": "schema.json",
      "timeout": 0,
      "sendEmpty": false,
      "sendGetBody": false,
      "requestDatatype": "JSON",
      "responseDatatype": "JSON",
      "headers": {},
      "responseObjects": [
        {
          "type": "default",
          "key": "",
          "mockFile": ""
        }
      ]
    },
    {
      "name": "virtualserviceGslbservicealgostatByUuidGET",
      "protocol": "REST",
      "method": "GET",
      "entitypath": "{base_path}/{version}/virtualservice/{pathv1}/gslbservicealgostat/?{query}",
      "requestSchema": "schema.json",
      "responseSchema": "schema.json",
      "timeout": 0,
      "sendEmpty": false,
      "sendGetBody": false,
      "requestDatatype": "JSON",
      "responseDatatype": "JSON",
      "headers": {},
      "responseObjects": [
        {
          "type": "default",
          "key": "",
          "mockFile": ""
        }
      ]
    },
    {
      "name": "virtualserviceGslbservicehmonstatByUuidGET",
      "protocol": "REST",
      "method": "GET",
      "entitypath": "{base_path}/{version}/virtualservice/{pathv1}/gslbservicehmonstat/?{query}",
      "requestSchema": "schema.json",
      "responseSchema": "schema.json",
      "timeout": 0,
      "sendEmpty": false,
      "sendGetBody": false,
      "requestDatatype": "JSON",
      "responseDatatype": "JSON",
      "headers": {},
      "responseObjects": [
        {
          "type": "default",
          "key": "",
          "mockFile": ""
        }
      ]
    },
    {
      "name": "virtualserviceGeolocationinfoByUuidGET",
      "protocol": "REST",
      "method": "GET",
      "entitypath": "{base_path}/{version}/virtualservice/{pathv1}/geolocationinfo/?{query}",
      "requestSchema": "schema.json",
      "responseSchema": "schema.json",
      "timeout": 0,
      "sendEmpty": false,
      "sendGetBody": false,
      "requestDatatype": "JSON",
      "responseDatatype": "JSON",
      "headers": {},
      "responseObjects": [
        {
          "type": "default",
          "key": "",
          "mockFile": ""
        }
      ]
    },
    {
      "name": "virtualserviceGeodbinternalByUuidGET",
      "protocol": "REST",
      "method": "GET",
      "entitypath": "{base_path}/{version}/virtualservice/{pathv1}/geodbinternal/?{query}",
      "requestSchema": "schema.json",
      "responseSchema": "schema.json",
      "timeout": 0,
      "sendEmpty": false,
      "sendGetBody": false,
      "requestDatatype": "JSON",
      "responseDatatype": "JSON",
      "headers": {},
      "responseObjects": [
        {
          "type": "default",
          "key": "",
          "mockFile": ""
        }
      ]
    },
    {
      "name": "virtualserviceGslbsiteinternalByUuidGET",
      "protocol": "REST",
      "method": "GET",
      "entitypath": "{base_path}/{version}/virtualservice/{pathv1}/gslbsiteinternal/?{query}",
      "requestSchema": "schema.json",
      "responseSchema": "schema.json",
      "timeout": 0,
      "sendEmpty": false,
      "sendGetBody": false,
      "requestDatatype": "JSON",
      "responseDatatype": "JSON",
      "headers": {},
      "responseObjects": [
        {
          "type": "default",
          "key": "",
          "mockFile": ""
        }
      ]
    },
    {
      "name": "virtualserviceUserdefineddatascriptcountersGET",
      "protocol": "REST",
      "method": "GET",
      "entitypath": "{base_path}/{version}/virtualservice/{pathv1}/userdefineddatascriptcounters/?{query}",
      "requestSchema": "schema.json",
      "responseSchema": "schema.json",
      "timeout": 0,
      "sendEmpty": false,
      "sendGetBody": false,
      "requestDatatype": "JSON",
      "responseDatatype": "JSON",
      "headers": {},
      "responseObjects": [
        {
          "type": "default",
          "key": "",
          "mockFile": ""
        }
      ]
    },
    {
      "name": "virtualserviceL4policysetstatsByUuidGET",
      "protocol": "REST",
      "method": "GET",
      "entitypath": "{base_path}/{version}/virtualservice/{pathv1}/l4policysetstats/?{query}",
      "requestSchema": "schema.json",
      "responseSchema": "schema.json",
      "timeout": 0,
      "sendEmpty": false,
      "sendGetBody": false,
      "requestDatatype": "JSON",
      "responseDatatype": "JSON",
      "headers": {},
      "responseObjects": [
        {
          "type": "default",
          "key": "",
          "mockFile": ""
        }
      ]
    },
    {
      "name": "virtualserviceSescaleoutstatusByUuidGET",
      "protocol": "REST",
      "method": "GET",
      "entitypath": "{base_path}/{version}/virtualservice/{pathv1}/sescaleoutstatus/?{query}",
      "requestSchema": "schema.json",
      "responseSchema": "schema.json",
      "timeout": 0,
      "sendEmpty": false,
      "sendGetBody": false,
      "requestDatatype": "JSON",
      "responseDatatype": "JSON",
      "headers": {},
      "responseObjects": [
        {
          "type": "default",
          "key": "",
          "mockFile": ""
        }
      ]
    },
    {
      "name": "virtualserviceScaleoutstatusByUuidGET",
      "protocol": "REST",
      "method": "GET",
      "entitypath": "{base_path}/{version}/virtualservice/{pathv1}/scaleoutstatus/?{query}",
      "requestSchema": "schema.json",
      "responseSchema": "schema.json",
      "timeout": 0,
      "sendEmpty": false,
      "sendGetBody": false,
      "requestDatatype": "JSON",
      "responseDatatype": "JSON",
      "headers": {},
      "responseObjects": [
        {
          "type": "default",
          "key": "",
          "mockFile": ""
        }
      ]
    },
    {
      "name": "virtualserviceScaleoutstatusDetailByUuidGET",
      "protocol": "REST",
      "method": "GET",
      "entitypath": "{base_path}/{version}/virtualservice/{pathv1}/scaleoutstatus/detail/?{query}",
      "requestSchema": "schema.json",
      "responseSchema": "schema.json",
      "timeout": 0,
      "sendEmpty": false,
      "sendGetBody": false,
      "requestDatatype": "JSON",
      "responseDatatype": "JSON",
      "headers": {},
      "responseObjects": [
        {
          "type": "default",
          "key": "",
          "mockFile": ""
        }
      ]
    },
    {
      "name": "virtualserviceSsopolicystatsByUuidGET",
      "protocol": "REST",
      "method": "GET",
      "entitypath": "{base_path}/{version}/virtualservice/{pathv1}/ssopolicystats/?{query}",
      "requestSchema": "schema.json",
      "responseSchema": "schema.json",
      "timeout": 0,
      "sendEmpty": false,
      "sendGetBody": false,
      "requestDatatype": "JSON",
      "responseDatatype": "JSON",
      "headers": {},
      "responseObjects": [
        {
          "type": "default",
          "key": "",
          "mockFile": ""
        }
      ]
    }
  ]
}