{
  "_last_modified": "string",
  "attrs": [
    {
      "key": "string",
      "value": "string"
    },
    {
      "key": "string",
      "value": "string"
    },
    {
      "key": "string",
      "value": "string"
    },
    {
      "key": "string",
      "value": "string"
    },
    {
      "key": "string",
      "value": "string"
    },
    {
      "key": "string",
      "value": "string"
    },
    {
      "key": "string",
      "value": "string"
    },
    {
      "key": "string",
      "value": "string"
    },
    {
      "key": "string",
      "value": "string"
    }
  ],
  "cloud_ref": "string",
  "configured_subnets": [
    {
      "prefix": {
        "ip_addr": {
          "addr": "string",
          "type": "string"
        },
        "mask": 2
      },
      "static_ips": [
        {
          "addr": "string",
          "type": "string"
        },
        {
          "addr": "string",
          "type": "string"
        },
        {
          "addr": "string",
          "type": "string"
        },
        {
          "addr": "string",
          "type": "string"
        },
        {
          "addr": "string",
          "type": "string"
        },
        {
          "addr": "string",
          "type": "string"
        },
        {
          "addr": "string",
          "type": "string"
        },
        {
          "addr": "string",
          "type": "string"
        },
        {
          "addr": "string",
          "type": "string"
        }
      ],
      "static_ranges": [
        {
          "begin": {
            "addr": "string",
            "type": "string"
          },
          "end": {
            "addr": "string",
            "type": "string"
          }
        },
        {
          "begin": {
            "addr": "string",
            "type": "string"
          },
          "end": {
            "addr": "string",
            "type": "string"
          }
        },
        {
          "begin": {
            "addr": "string",
            "type": "string"
          },
          "end": {
            "addr": "string",
            "type": "string"
          }
        },
        {
          "begin": {
            "addr": "string",
            "type": "string"
          },
          "end": {
            "addr": "string",
            "type": "string"
          }
        },
        {
          "begin": {
            "addr": "string",
            "type": "string"
          },
          "end": {
            "addr": "string",
            "type": "string"
          }
        }
      ]
    },
    {
      "prefix": {
        "ip_addr": {
          "addr": "string",
          "type": "string"
        },
        "mask": 9
      },
      "static_ips": [
        {
          "addr": "string",
          "type": "string"
        },
        {
          "addr": "string",
          "type": "string"
        },
        {
          "addr": "string",
          "type": "string"
        },
        {
          "addr": "string",
          "type": "string"
        },
        {
          "addr": "string",
          "type": "string"
        },
        {
          "addr": "string",
          "type": "string"
        },
        {
          "addr": "string",
          "type": "string"
        },
        {
          "addr": "string",
          "type": "string"
        },
        {
          "addr": "string",
          "type": "string"
        },
        {
          "addr": "string",
          "type": "string"
        }
      ],
      "static_ranges": [
        {
          "begin": {
            "addr": "string",
            "type": "string"
          },
          "end": {
            "addr": "string",
            "type": "string"
          }
        },
        {
          "begin": {
            "addr": "string",
            "type": "string"
          },
          "end": {
            "addr": "string",
            "type": "string"
          }
        },
        {
          "begin": {
            "addr": "string",
            "type": "string"
          },
          "end": {
            "addr": "string",
            "type": "string"
          }
        },
        {
          "begin": {
            "addr": "string",
            "type": "string"
          },
          "end": {
            "addr": "string",
            "type": "string"
          }
        }
      ]
    },
    {
      "prefix": {
        "ip_addr": {
          "addr": "string",
          "type": "string"
        },
        "mask": 3
      },
      "static_ips": [
        {
          "addr": "string",
          "type": "string"
        },
        {
          "addr": "string",
          "type": "string"
        },
        {
          "addr": "string",
          "type": "string"
        },
        {
          "addr": "string",
          "type": "string"
        }
      ],
      "static_ranges": [
        {
          "begin": {
            "addr": "string",
            "type": "string"
          },
          "end": {
            "addr": "string",
            "type": "string"
          }
        },
        {
          "begin": {
            "addr": "string",
            "type": "string"
          },
          "end": {
            "addr": "string",
            "type": "string"
          }
        },
        {
          "begin": {
            "addr": "string",
            "type": "string"
          },
          "end": {
            "addr": "string",
            "type": "string"
          }
        },
        {
          "begin": {
            "addr": "string",
            "type": "string"
          },
          "end": {
            "addr": "string",
            "type": "string"
          }
        }
      ]
    },
    {
      "prefix": {
        "ip_addr": {
          "addr": "string",
          "type": "string"
        },
        "mask": 4
      },
      "static_ips": [
        {
          "addr": "string",
          "type": "string"
        },
        {
          "addr": "string",
          "type": "string"
        }
      ],
      "static_ranges": [
        {
          "begin": {
            "addr": "string",
            "type": "string"
          },
          "end": {
            "addr": "string",
            "type": "string"
          }
        },
        {
          "begin": {
            "addr": "string",
            "type": "string"
          },
          "end": {
            "addr": "string",
            "type": "string"
          }
        },
        {
          "begin": {
            "addr": "string",
            "type": "string"
          },
          "end": {
            "addr": "string",
            "type": "string"
          }
        },
        {
          "begin": {
            "addr": "string",
            "type": "string"
          },
          "end": {
            "addr": "string",
            "type": "string"
          }
        },
        {
          "begin": {
            "addr": "string",
            "type": "string"
          },
          "end": {
            "addr": "string",
            "type": "string"
          }
        }
      ]
    },
    {
      "prefix": {
        "ip_addr": {
          "addr": "string",
          "type": "string"
        },
        "mask": 2
      },
      "static_ips": [
        {
          "addr": "string",
          "type": "string"
        },
        {
          "addr": "string",
          "type": "string"
        },
        {
          "addr": "string",
          "type": "string"
        },
        {
          "addr": "string",
          "type": "string"
        },
        {
          "addr": "string",
          "type": "string"
        },
        {
          "addr": "string",
          "type": "string"
        },
        {
          "addr": "string",
          "type": "string"
        },
        {
          "addr": "string",
          "type": "string"
        },
        {
          "addr": "string",
          "type": "string"
        },
        {
          "addr": "string",
          "type": "string"
        }
      ],
      "static_ranges": [
        {
          "begin": {
            "addr": "string",
            "type": "string"
          },
          "end": {
            "addr": "string",
            "type": "string"
          }
        },
        {
          "begin": {
            "addr": "string",
            "type": "string"
          },
          "end": {
            "addr": "string",
            "type": "string"
          }
        },
        {
          "begin": {
            "addr": "string",
            "type": "string"
          },
          "end": {
            "addr": "string",
            "type": "string"
          }
        }
      ]
    }
  ],
  "dhcp_enabled": true,
  "exclude_discovered_subnets": false,
  "ip6_autocfg_enabled": true,
  "labels": [
    {
      "key": "string",
      "value": "string"
    }
  ],
  "name": "string",
  "synced_from_se": false,
  "tenant_ref": "string",
  "url": "string",
  "uuid": "string",
  "vcenter_dvs": true,
  "vimgrnw_ref": "string",
  "vrf_context_ref": "string"
}