{
  "_last_modified": "string",
  "cloud_ref": "string",
  "dns_info": [
    {
      "algorithm": "DNS_RECORD_RESPONSE_CONSISTENT_HASH",
      "cname": {
        "cname": "string"
      },
      "fqdn": "string",
      "metadata": "string",
      "num_records_in_response": 1,
      "ttl": 10,
      "type": "DNS_RECORD_A"
    },
    {
      "algorithm": "DNS_RECORD_RESPONSE_CONSISTENT_HASH",
      "cname": {
        "cname": "string"
      },
      "fqdn": "string",
      "metadata": "string",
      "num_records_in_response": 1,
      "ttl": 8,
      "type": "DNS_RECORD_A"
    },
    {
      "algorithm": "DNS_RECORD_RESPONSE_CONSISTENT_HASH",
      "cname": {
        "cname": "string"
      },
      "fqdn": "string",
      "metadata": "string",
      "num_records_in_response": 1,
      "ttl": 3,
      "type": "DNS_RECORD_A"
    },
    {
      "algorithm": "DNS_RECORD_RESPONSE_CONSISTENT_HASH",
      "cname": {
        "cname": "string"
      },
      "fqdn": "string",
      "metadata": "string",
      "num_records_in_response": 1,
      "ttl": 6,
      "type": "DNS_RECORD_A"
    },
    {
      "algorithm": "DNS_RECORD_RESPONSE_CONSISTENT_HASH",
      "cname": {
        "cname": "string"
      },
      "fqdn": "string",
      "metadata": "string",
      "num_records_in_response": 1,
      "ttl": 4,
      "type": "DNS_RECORD_A"
    }
  ],
  "east_west_placement": false,
  "name": "string",
  "tenant_ref": "string",
  "tier1_lr": "string",
  "url": "string",
  "use_standard_alb": false,
  "uuid": "string",
  "vip": [
    {
      "auto_allocate_floating_ip": true,
      "auto_allocate_ip": false,
      "auto_allocate_ip_type": "V4_ONLY",
      "availability_zone": "string",
      "avi_allocated_fip": false,
      "avi_allocated_vip": false,
      "discovered_networks": [
        {
          "network_ref": "string",
          "subnet": [
            {
              "ip_addr": {},
              "mask": 9
            },
            {
              "ip_addr": {},
              "mask": 9
            },
            {
              "ip_addr": {},
              "mask": 10
            },
            {
              "ip_addr": {},
              "mask": 2
            },
            {
              "ip_addr": {},
              "mask": 7
            },
            {
              "ip_addr": {},
              "mask": 2
            },
            {
              "ip_addr": {},
              "mask": 8
            },
            {
              "ip_addr": {},
              "mask": 2
            },
            {
              "ip_addr": {},
              "mask": 6
            }
          ],
          "subnet6": [
            {
              "ip_addr": {},
              "mask": 3
            },
            {
              "ip_addr": {},
              "mask": 9
            },
            {
              "ip_addr": {},
              "mask": 5
            },
            {
              "ip_addr": {},
              "mask": 8
            },
            {
              "ip_addr": {},
              "mask": 1
            },
            {
              "ip_addr": {},
              "mask": 10
            },
            {
              "ip_addr": {},
              "mask": 3
            },
            {
              "ip_addr": {},
              "mask": 7
            }
          ]
        },
        {
          "network_ref": "string",
          "subnet": [
            {
              "ip_addr": {},
              "mask": 5
            },
            {
              "ip_addr": {},
              "mask": 3
            },
            {
              "ip_addr": {},
              "mask": 9
            },
            {
              "ip_addr": {},
              "mask": 8
            },
            {
              "ip_addr": {},
              "mask": 10
            }
          ],
          "subnet6": [
            {
              "ip_addr": {},
              "mask": 1
            },
            {
              "ip_addr": {},
              "mask": 9
            },
            {
              "ip_addr": {},
              "mask": 7
            },
            {
              "ip_addr": {},
              "mask": 8
            },
            {
              "ip_addr": {},
              "mask": 6
            },
            {
              "ip_addr": {},
              "mask": 7
            },
            {
              "ip_addr": {},
              "mask": 2
            },
            {
              "ip_addr": {},
              "mask": 2
            },
            {
              "ip_addr": {},
              "mask": 1
            },
            {
              "ip_addr": {},
              "mask": 10
            }
          ]
        },
        {
          "network_ref": "string",
          "subnet": [
            {
              "ip_addr": {},
              "mask": 6
            },
            {
              "ip_addr": {},
              "mask": 7
            },
            {
              "ip_addr": {},
              "mask": 3
            },
            {
              "ip_addr": {},
              "mask": 1
            },
            {
              "ip_addr": {},
              "mask": 4
            },
            {
              "ip_addr": {},
              "mask": 6
            },
            {
              "ip_addr": {},
              "mask": 2
            },
            {
              "ip_addr": {},
              "mask": 8
            }
          ],
          "subnet6": [
            {
              "ip_addr": {},
              "mask": 3
            },
            {
              "ip_addr": {},
              "mask": 9
            },
            {
              "ip_addr": {},
              "mask": 6
            },
            {
              "ip_addr": {},
              "mask": 3
            },
            {
              "ip_addr": {},
              "mask": 3
            },
            {
              "ip_addr": {},
              "mask": 8
            }
          ]
        },
        {
          "network_ref": "string",
          "subnet": [
            {
              "ip_addr": {},
              "mask": 8
            },
            {
              "ip_addr": {},
              "mask": 6
            },
            {
              "ip_addr": {},
              "mask": 4
            },
            {
              "ip_addr": {},
              "mask": 8
            },
            {
              "ip_addr": {},
              "mask": 6
            },
            {
              "ip_addr": {},
              "mask": 1
            },
            {
              "ip_addr": {},
              "mask": 8
            },
            {
              "ip_addr": {},
              "mask": 5
            },
            {
              "ip_addr": {},
              "mask": 3
            }
          ],
          "subnet6": [
            {
              "ip_addr": {},
              "mask": 5
            },
            {
              "ip_addr": {},
              "mask": 2
            },
            {
              "ip_addr": {},
              "mask": 7
            },
            {
              "ip_addr": {},
              "mask": 7
            },
            {
              "ip_addr": {},
              "mask": 5
            },
            {
              "ip_addr": {},
              "mask": 10
            },
            {
              "ip_addr": {},
              "mask": 9
            },
            {
              "ip_addr": {},
              "mask": 7
            }
          ]
        },
        {
          "network_ref": "string",
          "subnet": [
            {
              "ip_addr": {},
              "mask": 4
            },
            {
              "ip_addr": {},
              "mask": 9
            },
            {
              "ip_addr": {},
              "mask": 8
            }
          ],
          "subnet6": [
            {
              "ip_addr": {},
              "mask": 4
            },
            {
              "ip_addr": {},
              "mask": 6
            },
            {
              "ip_addr": {},
              "mask": 9
            },
            {
              "ip_addr": {},
              "mask": 3
            },
            {
              "ip_addr": {},
              "mask": 9
            },
            {
              "ip_addr": {},
              "mask": 8
            },
            {
              "ip_addr": {},
              "mask": 2
            },
            {
              "ip_addr": {},
              "mask": 9
            },
            {
              "ip_addr": {},
              "mask": 3
            },
            {
              "ip_addr": {},
              "mask": 4
            }
          ]
        }
      ],
      "enabled": true,
      "floating_ip": {
        "addr": "string",
        "type": "string"
      },
      "floating_ip6": {
        "addr": "string",
        "type": "string"
      },
      "floating_subnet6_uuid": "string",
      "floating_subnet_uuid": "string",
      "ip6_address": {
        "addr": "string",
        "type": "string"
      },
      "ip_address": {
        "addr": "string",
        "type": "string"
      },
      "ipam_network_subnet": {
        "network_ref": "string",
        "subnet": {
          "ip_addr": {},
          "mask": 7
        },
        "subnet6": {
          "ip_addr": {},
          "mask": 3
        },
        "subnet6_uuid": "string",
        "subnet_uuid": "string"
      },
      "network_ref": "string",
      "placement_networks": [
        {
          "network_ref": "string",
          "subnet": {
            "ip_addr": {},
            "mask": 3
          },
          "subnet6": {
            "ip_addr": {},
            "mask": 4
          }
        },
        {
          "network_ref": "string",
          "subnet": {
            "ip_addr": {},
            "mask": 5
          },
          "subnet6": {
            "ip_addr": {},
            "mask": 6
          }
        },
        {
          "network_ref": "string",
          "subnet": {
            "ip_addr": {},
            "mask": 6
          },
          "subnet6": {
            "ip_addr": {},
            "mask": 3
          }
        },
        {
          "network_ref": "string",
          "subnet": {
            "ip_addr": {},
            "mask": 3
          },
          "subnet6": {
            "ip_addr": {},
            "mask": 10
          }
        },
        {
          "network_ref": "string",
          "subnet": {
            "ip_addr": {},
            "mask": 6
          },
          "subnet6": {
            "ip_addr": {},
            "mask": 8
          }
        },
        {
          "network_ref": "string",
          "subnet": {
            "ip_addr": {},
            "mask": 10
          },
          "subnet6": {
            "ip_addr": {},
            "mask": 3
          }
        },
        {
          "network_ref": "string",
          "subnet": {
            "ip_addr": {},
            "mask": 5
          },
          "subnet6": {
            "ip_addr": {},
            "mask": 5
          }
        }
      ],
      "port_uuid": "string",
      "prefix_length": 32,
      "subnet": {
        "ip_addr": {},
        "mask": 4
      },
      "subnet6": {
        "ip_addr": {},
        "mask": 3
      },
      "subnet6_uuid": "string",
      "subnet_uuid": "string",
      "vip_id": "string"
    },
    {
      "auto_allocate_floating_ip": false,
      "auto_allocate_ip": true,
      "auto_allocate_ip_type": "V4_ONLY",
      "availability_zone": "string",
      "avi_allocated_fip": true,
      "avi_allocated_vip": true,
      "discovered_networks": [
        {
          "network_ref": "string",
          "subnet": [
            {
              "ip_addr": {},
              "mask": 1
            },
            {
              "ip_addr": {},
              "mask": 4
            },
            {
              "ip_addr": {},
              "mask": 6
            },
            {
              "ip_addr": {},
              "mask": 4
            },
            {
              "ip_addr": {},
              "mask": 2
            },
            {
              "ip_addr": {},
              "mask": 8
            },
            {
              "ip_addr": {},
              "mask": 4
            },
            {
              "ip_addr": {},
              "mask": 1
            },
            {
              "ip_addr": {},
              "mask": 1
            }
          ],
          "subnet6": [
            {
              "ip_addr": {},
              "mask": 3
            },
            {
              "ip_addr": {},
              "mask": 2
            },
            {
              "ip_addr": {},
              "mask": 3
            },
            {
              "ip_addr": {},
              "mask": 3
            },
            {
              "ip_addr": {},
              "mask": 2
            },
            {
              "ip_addr": {},
              "mask": 6
            },
            {
              "ip_addr": {},
              "mask": 5
            },
            {
              "ip_addr": {},
              "mask": 10
            }
          ]
        },
        {
          "network_ref": "string",
          "subnet": [
            {
              "ip_addr": {},
              "mask": 5
            },
            {
              "ip_addr": {},
              "mask": 3
            },
            {
              "ip_addr": {},
              "mask": 5
            },
            {
              "ip_addr": {},
              "mask": 3
            },
            {
              "ip_addr": {},
              "mask": 6
            },
            {
              "ip_addr": {},
              "mask": 7
            },
            {
              "ip_addr": {},
              "mask": 10
            }
          ],
          "subnet6": [
            {
              "ip_addr": {},
              "mask": 5
            },
            {
              "ip_addr": {},
              "mask": 3
            },
            {
              "ip_addr": {},
              "mask": 2
            },
            {
              "ip_addr": {},
              "mask": 6
            },
            {
              "ip_addr": {},
              "mask": 4
            },
            {
              "ip_addr": {},
              "mask": 10
            },
            {
              "ip_addr": {},
              "mask": 2
            },
            {
              "ip_addr": {},
              "mask": 1
            },
            {
              "ip_addr": {},
              "mask": 6
            },
            {
              "ip_addr": {},
              "mask": 5
            }
          ]
        },
        {
          "network_ref": "string",
          "subnet": [
            {
              "ip_addr": {},
              "mask": 9
            },
            {
              "ip_addr": {},
              "mask": 2
            },
            {
              "ip_addr": {},
              "mask": 3
            },
            {
              "ip_addr": {},
              "mask": 4
            },
            {
              "ip_addr": {},
              "mask": 7
            }
          ],
          "subnet6": [
            {
              "ip_addr": {},
              "mask": 6
            },
            {
              "ip_addr": {},
              "mask": 4
            },
            {
              "ip_addr": {},
              "mask": 8
            },
            {
              "ip_addr": {},
              "mask": 6
            },
            {
              "ip_addr": {},
              "mask": 4
            },
            {
              "ip_addr": {},
              "mask": 7
            }
          ]
        },
        {
          "network_ref": "string",
          "subnet": [
            {
              "ip_addr": {},
              "mask": 3
            },
            {
              "ip_addr": {},
              "mask": 2
            },
            {
              "ip_addr": {},
              "mask": 8
            },
            {
              "ip_addr": {},
              "mask": 2
            },
            {
              "ip_addr": {},
              "mask": 1
            }
          ],
          "subnet6": [
            {
              "ip_addr": {},
              "mask": 9
            },
            {
              "ip_addr": {},
              "mask": 7
            },
            {
              "ip_addr": {},
              "mask": 3
            },
            {
              "ip_addr": {},
              "mask": 3
            },
            {
              "ip_addr": {},
              "mask": 3
            },
            {
              "ip_addr": {},
              "mask": 8
            }
          ]
        }
      ],
      "enabled": true,
      "floating_ip": {
        "addr": "string",
        "type": "string"
      },
      "floating_ip6": {
        "addr": "string",
        "type": "string"
      },
      "floating_subnet6_uuid": "string",
      "floating_subnet_uuid": "string",
      "ip6_address": {
        "addr": "string",
        "type": "string"
      },
      "ip_address": {
        "addr": "string",
        "type": "string"
      },
      "ipam_network_subnet": {
        "network_ref": "string",
        "subnet": {
          "ip_addr": {},
          "mask": 2
        },
        "subnet6": {
          "ip_addr": {},
          "mask": 10
        },
        "subnet6_uuid": "string",
        "subnet_uuid": "string"
      },
      "network_ref": "string",
      "placement_networks": [
        {
          "network_ref": "string",
          "subnet": {
            "ip_addr": {},
            "mask": 2
          },
          "subnet6": {
            "ip_addr": {},
            "mask": 8
          }
        },
        {
          "network_ref": "string",
          "subnet": {
            "ip_addr": {},
            "mask": 8
          },
          "subnet6": {
            "ip_addr": {},
            "mask": 3
          }
        },
        {
          "network_ref": "string",
          "subnet": {
            "ip_addr": {},
            "mask": 3
          },
          "subnet6": {
            "ip_addr": {},
            "mask": 10
          }
        }
      ],
      "port_uuid": "string",
      "prefix_length": 32,
      "subnet": {
        "ip_addr": {},
        "mask": 6
      },
      "subnet6": {
        "ip_addr": {},
        "mask": 3
      },
      "subnet6_uuid": "string",
      "subnet_uuid": "string",
      "vip_id": "string"
    },
    {
      "auto_allocate_floating_ip": false,
      "auto_allocate_ip": false,
      "auto_allocate_ip_type": "V4_ONLY",
      "availability_zone": "string",
      "avi_allocated_fip": true,
      "avi_allocated_vip": false,
      "discovered_networks": [
        {
          "network_ref": "string",
          "subnet": [
            {
              "ip_addr": {},
              "mask": 4
            },
            {
              "ip_addr": {},
              "mask": 7
            },
            {
              "ip_addr": {},
              "mask": 10
            },
            {
              "ip_addr": {},
              "mask": 2
            },
            {
              "ip_addr": {},
              "mask": 9
            },
            {
              "ip_addr": {},
              "mask": 4
            },
            {
              "ip_addr": {},
              "mask": 2
            },
            {
              "ip_addr": {},
              "mask": 8
            },
            {
              "ip_addr": {},
              "mask": 9
            }
          ],
          "subnet6": [
            {
              "ip_addr": {},
              "mask": 3
            },
            {
              "ip_addr": {},
              "mask": 3
            },
            {
              "ip_addr": {},
              "mask": 9
            },
            {
              "ip_addr": {},
              "mask": 3
            },
            {
              "ip_addr": {},
              "mask": 6
            },
            {
              "ip_addr": {},
              "mask": 3
            },
            {
              "ip_addr": {},
              "mask": 7
            },
            {
              "ip_addr": {},
              "mask": 6
            }
          ]
        },
        {
          "network_ref": "string",
          "subnet": [
            {
              "ip_addr": {},
              "mask": 8
            },
            {
              "ip_addr": {},
              "mask": 6
            },
            {
              "ip_addr": {},
              "mask": 2
            },
            {
              "ip_addr": {},
              "mask": 10
            },
            {
              "ip_addr": {},
              "mask": 5
            }
          ],
          "subnet6": [
            {
              "ip_addr": {},
              "mask": 1
            },
            {
              "ip_addr": {},
              "mask": 5
            },
            {
              "ip_addr": {},
              "mask": 8
            },
            {
              "ip_addr": {},
              "mask": 6
            },
            {
              "ip_addr": {},
              "mask": 3
            },
            {
              "ip_addr": {},
              "mask": 5
            },
            {
              "ip_addr": {},
              "mask": 4
            },
            {
              "ip_addr": {},
              "mask": 1
            },
            {
              "ip_addr": {},
              "mask": 2
            }
          ]
        }
      ],
      "enabled": true,
      "floating_ip": {
        "addr": "string",
        "type": "string"
      },
      "floating_ip6": {
        "addr": "string",
        "type": "string"
      },
      "floating_subnet6_uuid": "string",
      "floating_subnet_uuid": "string",
      "ip6_address": {
        "addr": "string",
        "type": "string"
      },
      "ip_address": {
        "addr": "string",
        "type": "string"
      },
      "ipam_network_subnet": {
        "network_ref": "string",
        "subnet": {
          "ip_addr": {},
          "mask": 5
        },
        "subnet6": {
          "ip_addr": {},
          "mask": 6
        },
        "subnet6_uuid": "string",
        "subnet_uuid": "string"
      },
      "network_ref": "string",
      "placement_networks": [
        {
          "network_ref": "string",
          "subnet": {
            "ip_addr": {},
            "mask": 2
          },
          "subnet6": {
            "ip_addr": {},
            "mask": 10
          }
        },
        {
          "network_ref": "string",
          "subnet": {
            "ip_addr": {},
            "mask": 3
          },
          "subnet6": {
            "ip_addr": {},
            "mask": 4
          }
        },
        {
          "network_ref": "string",
          "subnet": {
            "ip_addr": {},
            "mask": 4
          },
          "subnet6": {
            "ip_addr": {},
            "mask": 10
          }
        },
        {
          "network_ref": "string",
          "subnet": {
            "ip_addr": {},
            "mask": 1
          },
          "subnet6": {
            "ip_addr": {},
            "mask": 4
          }
        },
        {
          "network_ref": "string",
          "subnet": {
            "ip_addr": {},
            "mask": 10
          },
          "subnet6": {
            "ip_addr": {},
            "mask": 6
          }
        },
        {
          "network_ref": "string",
          "subnet": {
            "ip_addr": {},
            "mask": 9
          },
          "subnet6": {
            "ip_addr": {},
            "mask": 6
          }
        },
        {
          "network_ref": "string",
          "subnet": {
            "ip_addr": {},
            "mask": 5
          },
          "subnet6": {
            "ip_addr": {},
            "mask": 10
          }
        },
        {
          "network_ref": "string",
          "subnet": {
            "ip_addr": {},
            "mask": 5
          },
          "subnet6": {
            "ip_addr": {},
            "mask": 2
          }
        },
        {
          "network_ref": "string",
          "subnet": {
            "ip_addr": {},
            "mask": 1
          },
          "subnet6": {
            "ip_addr": {},
            "mask": 5
          }
        }
      ],
      "port_uuid": "string",
      "prefix_length": 32,
      "subnet": {
        "ip_addr": {},
        "mask": 6
      },
      "subnet6": {
        "ip_addr": {},
        "mask": 9
      },
      "subnet6_uuid": "string",
      "subnet_uuid": "string",
      "vip_id": "string"
    },
    {
      "auto_allocate_floating_ip": true,
      "auto_allocate_ip": false,
      "auto_allocate_ip_type": "V4_ONLY",
      "availability_zone": "string",
      "avi_allocated_fip": true,
      "avi_allocated_vip": false,
      "discovered_networks": [
        {
          "network_ref": "string",
          "subnet": [
            {
              "ip_addr": {},
              "mask": 8
            },
            {
              "ip_addr": {},
              "mask": 7
            },
            {
              "ip_addr": {},
              "mask": 1
            },
            {
              "ip_addr": {},
              "mask": 5
            },
            {
              "ip_addr": {},
              "mask": 2
            },
            {
              "ip_addr": {},
              "mask": 2
            },
            {
              "ip_addr": {},
              "mask": 4
            },
            {
              "ip_addr": {},
              "mask": 6
            },
            {
              "ip_addr": {},
              "mask": 10
            }
          ],
          "subnet6": [
            {
              "ip_addr": {},
              "mask": 10
            },
            {
              "ip_addr": {},
              "mask": 5
            },
            {
              "ip_addr": {},
              "mask": 5
            },
            {
              "ip_addr": {},
              "mask": 4
            }
          ]
        },
        {
          "network_ref": "string",
          "subnet": [
            {
              "ip_addr": {},
              "mask": 4
            }
          ],
          "subnet6": [
            {
              "ip_addr": {},
              "mask": 1
            },
            {
              "ip_addr": {},
              "mask": 5
            },
            {
              "ip_addr": {},
              "mask": 7
            }
          ]
        },
        {
          "network_ref": "string",
          "subnet": [
            {
              "ip_addr": {},
              "mask": 9
            }
          ],
          "subnet6": [
            {
              "ip_addr": {},
              "mask": 4
            },
            {
              "ip_addr": {},
              "mask": 10
            },
            {
              "ip_addr": {},
              "mask": 7
            },
            {
              "ip_addr": {},
              "mask": 5
            },
            {
              "ip_addr": {},
              "mask": 2
            },
            {
              "ip_addr": {},
              "mask": 5
            },
            {
              "ip_addr": {},
              "mask": 8
            },
            {
              "ip_addr": {},
              "mask": 2
            }
          ]
        },
        {
          "network_ref": "string",
          "subnet": [
            {
              "ip_addr": {},
              "mask": 10
            },
            {
              "ip_addr": {},
              "mask": 3
            },
            {
              "ip_addr": {},
              "mask": 1
            },
            {
              "ip_addr": {},
              "mask": 9
            },
            {
              "ip_addr": {},
              "mask": 5
            },
            {
              "ip_addr": {},
              "mask": 10
            }
          ],
          "subnet6": [
            {
              "ip_addr": {},
              "mask": 1
            },
            {
              "ip_addr": {},
              "mask": 1
            },
            {
              "ip_addr": {},
              "mask": 3
            },
            {
              "ip_addr": {},
              "mask": 1
            },
            {
              "ip_addr": {},
              "mask": 10
            }
          ]
        },
        {
          "network_ref": "string",
          "subnet": [
            {
              "ip_addr": {},
              "mask": 5
            }
          ],
          "subnet6": [
            {
              "ip_addr": {},
              "mask": 1
            },
            {
              "ip_addr": {},
              "mask": 6
            },
            {
              "ip_addr": {},
              "mask": 6
            }
          ]
        },
        {
          "network_ref": "string",
          "subnet": [
            {
              "ip_addr": {},
              "mask": 3
            },
            {
              "ip_addr": {},
              "mask": 9
            }
          ],
          "subnet6": [
            {
              "ip_addr": {},
              "mask": 6
            },
            {
              "ip_addr": {},
              "mask": 7
            },
            {
              "ip_addr": {},
              "mask": 3
            },
            {
              "ip_addr": {},
              "mask": 9
            },
            {
              "ip_addr": {},
              "mask": 5
            },
            {
              "ip_addr": {},
              "mask": 5
            },
            {
              "ip_addr": {},
              "mask": 1
            },
            {
              "ip_addr": {},
              "mask": 4
            },
            {
              "ip_addr": {},
              "mask": 1
            }
          ]
        },
        {
          "network_ref": "string",
          "subnet": [
            {
              "ip_addr": {},
              "mask": 9
            },
            {
              "ip_addr": {},
              "mask": 10
            },
            {
              "ip_addr": {},
              "mask": 7
            },
            {
              "ip_addr": {},
              "mask": 9
            }
          ],
          "subnet6": [
            {
              "ip_addr": {},
              "mask": 10
            }
          ]
        },
        {
          "network_ref": "string",
          "subnet": [
            {
              "ip_addr": {},
              "mask": 1
            },
            {
              "ip_addr": {},
              "mask": 9
            },
            {
              "ip_addr": {},
              "mask": 1
            },
            {
              "ip_addr": {},
              "mask": 10
            },
            {
              "ip_addr": {},
              "mask": 1
            },
            {
              "ip_addr": {},
              "mask": 8
            },
            {
              "ip_addr": {},
              "mask": 4
            },
            {
              "ip_addr": {},
              "mask": 4
            },
            {
              "ip_addr": {},
              "mask": 7
            }
          ],
          "subnet6": [
            {
              "ip_addr": {},
              "mask": 3
            },
            {
              "ip_addr": {},
              "mask": 3
            },
            {
              "ip_addr": {},
              "mask": 8
            },
            {
              "ip_addr": {},
              "mask": 7
            },
            {
              "ip_addr": {},
              "mask": 1
            },
            {
              "ip_addr": {},
              "mask": 6
            },
            {
              "ip_addr": {},
              "mask": 3
            },
            {
              "ip_addr": {},
              "mask": 9
            }
          ]
        },
        {
          "network_ref": "string",
          "subnet": [
            {
              "ip_addr": {},
              "mask": 3
            },
            {
              "ip_addr": {},
              "mask": 4
            },
            {
              "ip_addr": {},
              "mask": 6
            },
            {
              "ip_addr": {},
              "mask": 1
            },
            {
              "ip_addr": {},
              "mask": 6
            },
            {
              "ip_addr": {},
              "mask": 10
            },
            {
              "ip_addr": {},
              "mask": 3
            },
            {
              "ip_addr": {},
              "mask": 4
            }
          ],
          "subnet6": [
            {
              "ip_addr": {},
              "mask": 8
            },
            {
              "ip_addr": {},
              "mask": 7
            },
            {
              "ip_addr": {},
              "mask": 10
            },
            {
              "ip_addr": {},
              "mask": 10
            },
            {
              "ip_addr": {},
              "mask": 6
            }
          ]
        },
        {
          "network_ref": "string",
          "subnet": [
            {
              "ip_addr": {},
              "mask": 6
            },
            {
              "ip_addr": {},
              "mask": 6
            }
          ],
          "subnet6": [
            {
              "ip_addr": {},
              "mask": 3
            },
            {
              "ip_addr": {},
              "mask": 4
            },
            {
              "ip_addr": {},
              "mask": 1
            },
            {
              "ip_addr": {},
              "mask": 1
            },
            {
              "ip_addr": {},
              "mask": 6
            },
            {
              "ip_addr": {},
              "mask": 3
            },
            {
              "ip_addr": {},
              "mask": 2
            },
            {
              "ip_addr": {},
              "mask": 6
            },
            {
              "ip_addr": {},
              "mask": 3
            }
          ]
        }
      ],
      "enabled": true,
      "floating_ip": {
        "addr": "string",
        "type": "string"
      },
      "floating_ip6": {
        "addr": "string",
        "type": "string"
      },
      "floating_subnet6_uuid": "string",
      "floating_subnet_uuid": "string",
      "ip6_address": {
        "addr": "string",
        "type": "string"
      },
      "ip_address": {
        "addr": "string",
        "type": "string"
      },
      "ipam_network_subnet": {
        "network_ref": "string",
        "subnet": {
          "ip_addr": {},
          "mask": 10
        },
        "subnet6": {
          "ip_addr": {},
          "mask": 2
        },
        "subnet6_uuid": "string",
        "subnet_uuid": "string"
      },
      "network_ref": "string",
      "placement_networks": [
        {
          "network_ref": "string",
          "subnet": {
            "ip_addr": {},
            "mask": 4
          },
          "subnet6": {
            "ip_addr": {},
            "mask": 7
          }
        },
        {
          "network_ref": "string",
          "subnet": {
            "ip_addr": {},
            "mask": 9
          },
          "subnet6": {
            "ip_addr": {},
            "mask": 4
          }
        },
        {
          "network_ref": "string",
          "subnet": {
            "ip_addr": {},
            "mask": 2
          },
          "subnet6": {
            "ip_addr": {},
            "mask": 6
          }
        },
        {
          "network_ref": "string",
          "subnet": {
            "ip_addr": {},
            "mask": 2
          },
          "subnet6": {
            "ip_addr": {},
            "mask": 7
          }
        },
        {
          "network_ref": "string",
          "subnet": {
            "ip_addr": {},
            "mask": 1
          },
          "subnet6": {
            "ip_addr": {},
            "mask": 9
          }
        }
      ],
      "port_uuid": "string",
      "prefix_length": 32,
      "subnet": {
        "ip_addr": {},
        "mask": 1
      },
      "subnet6": {
        "ip_addr": {},
        "mask": 7
      },
      "subnet6_uuid": "string",
      "subnet_uuid": "string",
      "vip_id": "string"
    },
    {
      "auto_allocate_floating_ip": false,
      "auto_allocate_ip": true,
      "auto_allocate_ip_type": "V4_ONLY",
      "availability_zone": "string",
      "avi_allocated_fip": false,
      "avi_allocated_vip": false,
      "discovered_networks": [
        {
          "network_ref": "string",
          "subnet": [
            {
              "ip_addr": {},
              "mask": 7
            },
            {
              "ip_addr": {},
              "mask": 10
            }
          ],
          "subnet6": [
            {
              "ip_addr": {},
              "mask": 1
            },
            {
              "ip_addr": {},
              "mask": 5
            },
            {
              "ip_addr": {},
              "mask": 9
            },
            {
              "ip_addr": {},
              "mask": 6
            }
          ]
        },
        {
          "network_ref": "string",
          "subnet": [
            {
              "ip_addr": {},
              "mask": 6
            },
            {
              "ip_addr": {},
              "mask": 7
            },
            {
              "ip_addr": {},
              "mask": 10
            },
            {
              "ip_addr": {},
              "mask": 4
            },
            {
              "ip_addr": {},
              "mask": 6
            },
            {
              "ip_addr": {},
              "mask": 5
            },
            {
              "ip_addr": {},
              "mask": 3
            }
          ],
          "subnet6": [
            {
              "ip_addr": {},
              "mask": 8
            },
            {
              "ip_addr": {},
              "mask": 8
            },
            {
              "ip_addr": {},
              "mask": 7
            }
          ]
        },
        {
          "network_ref": "string",
          "subnet": [
            {
              "ip_addr": {},
              "mask": 9
            },
            {
              "ip_addr": {},
              "mask": 4
            },
            {
              "ip_addr": {},
              "mask": 6
            },
            {
              "ip_addr": {},
              "mask": 10
            },
            {
              "ip_addr": {},
              "mask": 2
            },
            {
              "ip_addr": {},
              "mask": 7
            },
            {
              "ip_addr": {},
              "mask": 1
            },
            {
              "ip_addr": {},
              "mask": 4
            }
          ],
          "subnet6": [
            {
              "ip_addr": {},
              "mask": 2
            },
            {
              "ip_addr": {},
              "mask": 5
            }
          ]
        },
        {
          "network_ref": "string",
          "subnet": [
            {
              "ip_addr": {},
              "mask": 9
            },
            {
              "ip_addr": {},
              "mask": 2
            },
            {
              "ip_addr": {},
              "mask": 5
            },
            {
              "ip_addr": {},
              "mask": 2
            },
            {
              "ip_addr": {},
              "mask": 9
            }
          ],
          "subnet6": [
            {
              "ip_addr": {},
              "mask": 8
            },
            {
              "ip_addr": {},
              "mask": 9
            },
            {
              "ip_addr": {},
              "mask": 7
            },
            {
              "ip_addr": {},
              "mask": 2
            },
            {
              "ip_addr": {},
              "mask": 7
            }
          ]
        },
        {
          "network_ref": "string",
          "subnet": [
            {
              "ip_addr": {},
              "mask": 5
            },
            {
              "ip_addr": {},
              "mask": 4
            },
            {
              "ip_addr": {},
              "mask": 2
            }
          ],
          "subnet6": [
            {
              "ip_addr": {},
              "mask": 5
            },
            {
              "ip_addr": {},
              "mask": 6
            },
            {
              "ip_addr": {},
              "mask": 10
            },
            {
              "ip_addr": {},
              "mask": 8
            },
            {
              "ip_addr": {},
              "mask": 5
            },
            {
              "ip_addr": {},
              "mask": 8
            },
            {
              "ip_addr": {},
              "mask": 4
            },
            {
              "ip_addr": {},
              "mask": 7
            },
            {
              "ip_addr": {},
              "mask": 3
            }
          ]
        },
        {
          "network_ref": "string",
          "subnet": [
            {
              "ip_addr": {},
              "mask": 8
            },
            {
              "ip_addr": {},
              "mask": 1
            },
            {
              "ip_addr": {},
              "mask": 9
            },
            {
              "ip_addr": {},
              "mask": 7
            },
            {
              "ip_addr": {},
              "mask": 4
            },
            {
              "ip_addr": {},
              "mask": 6
            }
          ],
          "subnet6": [
            {
              "ip_addr": {},
              "mask": 5
            },
            {
              "ip_addr": {},
              "mask": 4
            },
            {
              "ip_addr": {},
              "mask": 8
            },
            {
              "ip_addr": {},
              "mask": 4
            },
            {
              "ip_addr": {},
              "mask": 4
            },
            {
              "ip_addr": {},
              "mask": 7
            },
            {
              "ip_addr": {},
              "mask": 2
            },
            {
              "ip_addr": {},
              "mask": 2
            },
            {
              "ip_addr": {},
              "mask": 5
            },
            {
              "ip_addr": {},
              "mask": 7
            }
          ]
        },
        {
          "network_ref": "string",
          "subnet": [
            {
              "ip_addr": {},
              "mask": 3
            },
            {
              "ip_addr": {},
              "mask": 6
            },
            {
              "ip_addr": {},
              "mask": 7
            }
          ],
          "subnet6": [
            {
              "ip_addr": {},
              "mask": 9
            },
            {
              "ip_addr": {},
              "mask": 5
            },
            {
              "ip_addr": {},
              "mask": 7
            },
            {
              "ip_addr": {},
              "mask": 9
            },
            {
              "ip_addr": {},
              "mask": 6
            },
            {
              "ip_addr": {},
              "mask": 5
            },
            {
              "ip_addr": {},
              "mask": 1
            },
            {
              "ip_addr": {},
              "mask": 5
            },
            {
              "ip_addr": {},
              "mask": 2
            }
          ]
        }
      ],
      "enabled": true,
      "floating_ip": {
        "addr": "string",
        "type": "string"
      },
      "floating_ip6": {
        "addr": "string",
        "type": "string"
      },
      "floating_subnet6_uuid": "string",
      "floating_subnet_uuid": "string",
      "ip6_address": {
        "addr": "string",
        "type": "string"
      },
      "ip_address": {
        "addr": "string",
        "type": "string"
      },
      "ipam_network_subnet": {
        "network_ref": "string",
        "subnet": {
          "ip_addr": {},
          "mask": 5
        },
        "subnet6": {
          "ip_addr": {},
          "mask": 9
        },
        "subnet6_uuid": "string",
        "subnet_uuid": "string"
      },
      "network_ref": "string",
      "placement_networks": [
        {
          "network_ref": "string",
          "subnet": {
            "ip_addr": {},
            "mask": 1
          },
          "subnet6": {
            "ip_addr": {},
            "mask": 6
          }
        },
        {
          "network_ref": "string",
          "subnet": {
            "ip_addr": {},
            "mask": 3
          },
          "subnet6": {
            "ip_addr": {},
            "mask": 8
          }
        },
        {
          "network_ref": "string",
          "subnet": {
            "ip_addr": {},
            "mask": 7
          },
          "subnet6": {
            "ip_addr": {},
            "mask": 4
          }
        },
        {
          "network_ref": "string",
          "subnet": {
            "ip_addr": {},
            "mask": 4
          },
          "subnet6": {
            "ip_addr": {},
            "mask": 6
          }
        },
        {
          "network_ref": "string",
          "subnet": {
            "ip_addr": {},
            "mask": 2
          },
          "subnet6": {
            "ip_addr": {},
            "mask": 4
          }
        }
      ],
      "port_uuid": "string",
      "prefix_length": 32,
      "subnet": {
        "ip_addr": {},
        "mask": 8
      },
      "subnet6": {
        "ip_addr": {},
        "mask": 5
      },
      "subnet6_uuid": "string",
      "subnet_uuid": "string",
      "vip_id": "string"
    },
    {
      "auto_allocate_floating_ip": true,
      "auto_allocate_ip": true,
      "auto_allocate_ip_type": "V4_ONLY",
      "availability_zone": "string",
      "avi_allocated_fip": false,
      "avi_allocated_vip": true,
      "discovered_networks": [
        {
          "network_ref": "string",
          "subnet": [
            {
              "ip_addr": {},
              "mask": 6
            },
            {
              "ip_addr": {},
              "mask": 3
            },
            {
              "ip_addr": {},
              "mask": 8
            },
            {
              "ip_addr": {},
              "mask": 1
            },
            {
              "ip_addr": {},
              "mask": 10
            }
          ],
          "subnet6": [
            {
              "ip_addr": {},
              "mask": 3
            },
            {
              "ip_addr": {},
              "mask": 2
            },
            {
              "ip_addr": {},
              "mask": 3
            },
            {
              "ip_addr": {},
              "mask": 3
            },
            {
              "ip_addr": {},
              "mask": 7
            },
            {
              "ip_addr": {},
              "mask": 2
            },
            {
              "ip_addr": {},
              "mask": 1
            },
            {
              "ip_addr": {},
              "mask": 3
            },
            {
              "ip_addr": {},
              "mask": 9
            },
            {
              "ip_addr": {},
              "mask": 2
            }
          ]
        },
        {
          "network_ref": "string",
          "subnet": [
            {
              "ip_addr": {},
              "mask": 1
            },
            {
              "ip_addr": {},
              "mask": 4
            },
            {
              "ip_addr": {},
              "mask": 5
            },
            {
              "ip_addr": {},
              "mask": 2
            },
            {
              "ip_addr": {},
              "mask": 2
            }
          ],
          "subnet6": [
            {
              "ip_addr": {},
              "mask": 7
            }
          ]
        },
        {
          "network_ref": "string",
          "subnet": [
            {
              "ip_addr": {},
              "mask": 4
            },
            {
              "ip_addr": {},
              "mask": 9
            },
            {
              "ip_addr": {},
              "mask": 4
            },
            {
              "ip_addr": {},
              "mask": 2
            },
            {
              "ip_addr": {},
              "mask": 3
            },
            {
              "ip_addr": {},
              "mask": 1
            },
            {
              "ip_addr": {},
              "mask": 9
            },
            {
              "ip_addr": {},
              "mask": 5
            }
          ],
          "subnet6": [
            {
              "ip_addr": {},
              "mask": 3
            },
            {
              "ip_addr": {},
              "mask": 3
            },
            {
              "ip_addr": {},
              "mask": 2
            },
            {
              "ip_addr": {},
              "mask": 4
            },
            {
              "ip_addr": {},
              "mask": 7
            },
            {
              "ip_addr": {},
              "mask": 4
            },
            {
              "ip_addr": {},
              "mask": 9
            },
            {
              "ip_addr": {},
              "mask": 5
            },
            {
              "ip_addr": {},
              "mask": 8
            },
            {
              "ip_addr": {},
              "mask": 6
            }
          ]
        },
        {
          "network_ref": "string",
          "subnet": [
            {
              "ip_addr": {},
              "mask": 2
            },
            {
              "ip_addr": {},
              "mask": 5
            },
            {
              "ip_addr": {},
              "mask": 1
            },
            {
              "ip_addr": {},
              "mask": 5
            },
            {
              "ip_addr": {},
              "mask": 3
            },
            {
              "ip_addr": {},
              "mask": 8
            },
            {
              "ip_addr": {},
              "mask": 6
            },
            {
              "ip_addr": {},
              "mask": 9
            },
            {
              "ip_addr": {},
              "mask": 1
            },
            {
              "ip_addr": {},
              "mask": 9
            }
          ],
          "subnet6": [
            {
              "ip_addr": {},
              "mask": 5
            }
          ]
        },
        {
          "network_ref": "string",
          "subnet": [
            {
              "ip_addr": {},
              "mask": 8
            },
            {
              "ip_addr": {},
              "mask": 4
            },
            {
              "ip_addr": {},
              "mask": 8
            },
            {
              "ip_addr": {},
              "mask": 8
            },
            {
              "ip_addr": {},
              "mask": 4
            }
          ],
          "subnet6": [
            {
              "ip_addr": {},
              "mask": 7
            },
            {
              "ip_addr": {},
              "mask": 4
            },
            {
              "ip_addr": {},
              "mask": 7
            },
            {
              "ip_addr": {},
              "mask": 6
            },
            {
              "ip_addr": {},
              "mask": 3
            },
            {
              "ip_addr": {},
              "mask": 9
            },
            {
              "ip_addr": {},
              "mask": 1
            },
            {
              "ip_addr": {},
              "mask": 10
            }
          ]
        },
        {
          "network_ref": "string",
          "subnet": [
            {
              "ip_addr": {},
              "mask": 5
            },
            {
              "ip_addr": {},
              "mask": 7
            }
          ],
          "subnet6": [
            {
              "ip_addr": {},
              "mask": 4
            },
            {
              "ip_addr": {},
              "mask": 9
            },
            {
              "ip_addr": {},
              "mask": 7
            },
            {
              "ip_addr": {},
              "mask": 6
            },
            {
              "ip_addr": {},
              "mask": 1
            },
            {
              "ip_addr": {},
              "mask": 5
            },
            {
              "ip_addr": {},
              "mask": 1
            },
            {
              "ip_addr": {},
              "mask": 4
            },
            {
              "ip_addr": {},
              "mask": 8
            }
          ]
        },
        {
          "network_ref": "string",
          "subnet": [
            {
              "ip_addr": {},
              "mask": 5
            },
            {
              "ip_addr": {},
              "mask": 2
            },
            {
              "ip_addr": {},
              "mask": 10
            },
            {
              "ip_addr": {},
              "mask": 3
            },
            {
              "ip_addr": {},
              "mask": 3
            }
          ],
          "subnet6": [
            {
              "ip_addr": {},
              "mask": 10
            },
            {
              "ip_addr": {},
              "mask": 10
            },
            {
              "ip_addr": {},
              "mask": 6
            },
            {
              "ip_addr": {},
              "mask": 4
            },
            {
              "ip_addr": {},
              "mask": 1
            },
            {
              "ip_addr": {},
              "mask": 4
            },
            {
              "ip_addr": {},
              "mask": 3
            },
            {
              "ip_addr": {},
              "mask": 7
            },
            {
              "ip_addr": {},
              "mask": 10
            },
            {
              "ip_addr": {},
              "mask": 8
            }
          ]
        }
      ],
      "enabled": true,
      "floating_ip": {
        "addr": "string",
        "type": "string"
      },
      "floating_ip6": {
        "addr": "string",
        "type": "string"
      },
      "floating_subnet6_uuid": "string",
      "floating_subnet_uuid": "string",
      "ip6_address": {
        "addr": "string",
        "type": "string"
      },
      "ip_address": {
        "addr": "string",
        "type": "string"
      },
      "ipam_network_subnet": {
        "network_ref": "string",
        "subnet": {
          "ip_addr": {},
          "mask": 5
        },
        "subnet6": {
          "ip_addr": {},
          "mask": 2
        },
        "subnet6_uuid": "string",
        "subnet_uuid": "string"
      },
      "network_ref": "string",
      "placement_networks": [
        {
          "network_ref": "string",
          "subnet": {
            "ip_addr": {},
            "mask": 8
          },
          "subnet6": {
            "ip_addr": {},
            "mask": 4
          }
        },
        {
          "network_ref": "string",
          "subnet": {
            "ip_addr": {},
            "mask": 4
          },
          "subnet6": {
            "ip_addr": {},
            "mask": 10
          }
        },
        {
          "network_ref": "string",
          "subnet": {
            "ip_addr": {},
            "mask": 10
          },
          "subnet6": {
            "ip_addr": {},
            "mask": 1
          }
        },
        {
          "network_ref": "string",
          "subnet": {
            "ip_addr": {},
            "mask": 5
          },
          "subnet6": {
            "ip_addr": {},
            "mask": 4
          }
        }
      ],
      "port_uuid": "string",
      "prefix_length": 32,
      "subnet": {
        "ip_addr": {},
        "mask": 8
      },
      "subnet6": {
        "ip_addr": {},
        "mask": 5
      },
      "subnet6_uuid": "string",
      "subnet_uuid": "string",
      "vip_id": "string"
    },
    {
      "auto_allocate_floating_ip": true,
      "auto_allocate_ip": true,
      "auto_allocate_ip_type": "V4_ONLY",
      "availability_zone": "string",
      "avi_allocated_fip": false,
      "avi_allocated_vip": true,
      "discovered_networks": [
        {
          "network_ref": "string",
          "subnet": [
            {
              "ip_addr": {},
              "mask": 2
            },
            {
              "ip_addr": {},
              "mask": 9
            },
            {
              "ip_addr": {},
              "mask": 3
            },
            {
              "ip_addr": {},
              "mask": 2
            },
            {
              "ip_addr": {},
              "mask": 8
            }
          ],
          "subnet6": [
            {
              "ip_addr": {},
              "mask": 7
            },
            {
              "ip_addr": {},
              "mask": 8
            },
            {
              "ip_addr": {},
              "mask": 6
            },
            {
              "ip_addr": {},
              "mask": 1
            },
            {
              "ip_addr": {},
              "mask": 6
            },
            {
              "ip_addr": {},
              "mask": 8
            },
            {
              "ip_addr": {},
              "mask": 8
            },
            {
              "ip_addr": {},
              "mask": 8
            }
          ]
        },
        {
          "network_ref": "string",
          "subnet": [
            {
              "ip_addr": {},
              "mask": 4
            },
            {
              "ip_addr": {},
              "mask": 2
            },
            {
              "ip_addr": {},
              "mask": 7
            },
            {
              "ip_addr": {},
              "mask": 6
            },
            {
              "ip_addr": {},
              "mask": 4
            },
            {
              "ip_addr": {},
              "mask": 6
            },
            {
              "ip_addr": {},
              "mask": 6
            },
            {
              "ip_addr": {},
              "mask": 2
            },
            {
              "ip_addr": {},
              "mask": 9
            },
            {
              "ip_addr": {},
              "mask": 6
            }
          ],
          "subnet6": [
            {
              "ip_addr": {},
              "mask": 2
            }
          ]
        },
        {
          "network_ref": "string",
          "subnet": [
            {
              "ip_addr": {},
              "mask": 8
            },
            {
              "ip_addr": {},
              "mask": 3
            },
            {
              "ip_addr": {},
              "mask": 7
            },
            {
              "ip_addr": {},
              "mask": 7
            },
            {
              "ip_addr": {},
              "mask": 4
            },
            {
              "ip_addr": {},
              "mask": 9
            },
            {
              "ip_addr": {},
              "mask": 2
            },
            {
              "ip_addr": {},
              "mask": 10
            },
            {
              "ip_addr": {},
              "mask": 8
            },
            {
              "ip_addr": {},
              "mask": 9
            }
          ],
          "subnet6": [
            {
              "ip_addr": {},
              "mask": 3
            },
            {
              "ip_addr": {},
              "mask": 7
            },
            {
              "ip_addr": {},
              "mask": 7
            },
            {
              "ip_addr": {},
              "mask": 1
            },
            {
              "ip_addr": {},
              "mask": 2
            },
            {
              "ip_addr": {},
              "mask": 1
            },
            {
              "ip_addr": {},
              "mask": 9
            },
            {
              "ip_addr": {},
              "mask": 1
            },
            {
              "ip_addr": {},
              "mask": 10
            },
            {
              "ip_addr": {},
              "mask": 5
            }
          ]
        },
        {
          "network_ref": "string",
          "subnet": [
            {
              "ip_addr": {},
              "mask": 3
            },
            {
              "ip_addr": {},
              "mask": 3
            },
            {
              "ip_addr": {},
              "mask": 8
            },
            {
              "ip_addr": {},
              "mask": 3
            },
            {
              "ip_addr": {},
              "mask": 8
            },
            {
              "ip_addr": {},
              "mask": 5
            },
            {
              "ip_addr": {},
              "mask": 4
            },
            {
              "ip_addr": {},
              "mask": 8
            }
          ],
          "subnet6": [
            {
              "ip_addr": {},
              "mask": 3
            },
            {
              "ip_addr": {},
              "mask": 2
            },
            {
              "ip_addr": {},
              "mask": 10
            }
          ]
        },
        {
          "network_ref": "string",
          "subnet": [
            {
              "ip_addr": {},
              "mask": 9
            },
            {
              "ip_addr": {},
              "mask": 6
            },
            {
              "ip_addr": {},
              "mask": 7
            },
            {
              "ip_addr": {},
              "mask": 7
            },
            {
              "ip_addr": {},
              "mask": 4
            },
            {
              "ip_addr": {},
              "mask": 8
            },
            {
              "ip_addr": {},
              "mask": 4
            },
            {
              "ip_addr": {},
              "mask": 4
            }
          ],
          "subnet6": [
            {
              "ip_addr": {},
              "mask": 9
            },
            {
              "ip_addr": {},
              "mask": 5
            },
            {
              "ip_addr": {},
              "mask": 4
            },
            {
              "ip_addr": {},
              "mask": 2
            },
            {
              "ip_addr": {},
              "mask": 7
            },
            {
              "ip_addr": {},
              "mask": 9
            },
            {
              "ip_addr": {},
              "mask": 8
            },
            {
              "ip_addr": {},
              "mask": 9
            }
          ]
        }
      ],
      "enabled": true,
      "floating_ip": {
        "addr": "string",
        "type": "string"
      },
      "floating_ip6": {
        "addr": "string",
        "type": "string"
      },
      "floating_subnet6_uuid": "string",
      "floating_subnet_uuid": "string",
      "ip6_address": {
        "addr": "string",
        "type": "string"
      },
      "ip_address": {
        "addr": "string",
        "type": "string"
      },
      "ipam_network_subnet": {
        "network_ref": "string",
        "subnet": {
          "ip_addr": {},
          "mask": 1
        },
        "subnet6": {
          "ip_addr": {},
          "mask": 9
        },
        "subnet6_uuid": "string",
        "subnet_uuid": "string"
      },
      "network_ref": "string",
      "placement_networks": [
        {
          "network_ref": "string",
          "subnet": {
            "ip_addr": {},
            "mask": 2
          },
          "subnet6": {
            "ip_addr": {},
            "mask": 8
          }
        },
        {
          "network_ref": "string",
          "subnet": {
            "ip_addr": {},
            "mask": 2
          },
          "subnet6": {
            "ip_addr": {},
            "mask": 7
          }
        },
        {
          "network_ref": "string",
          "subnet": {
            "ip_addr": {},
            "mask": 3
          },
          "subnet6": {
            "ip_addr": {},
            "mask": 8
          }
        },
        {
          "network_ref": "string",
          "subnet": {
            "ip_addr": {},
            "mask": 5
          },
          "subnet6": {
            "ip_addr": {},
            "mask": 1
          }
        },
        {
          "network_ref": "string",
          "subnet": {
            "ip_addr": {},
            "mask": 5
          },
          "subnet6": {
            "ip_addr": {},
            "mask": 5
          }
        },
        {
          "network_ref": "string",
          "subnet": {
            "ip_addr": {},
            "mask": 10
          },
          "subnet6": {
            "ip_addr": {},
            "mask": 10
          }
        }
      ],
      "port_uuid": "string",
      "prefix_length": 32,
      "subnet": {
        "ip_addr": {},
        "mask": 6
      },
      "subnet6": {
        "ip_addr": {},
        "mask": 3
      },
      "subnet6_uuid": "string",
      "subnet_uuid": "string",
      "vip_id": "string"
    }
  ],
  "vrf_context_ref": "string",
  "vsvip_cloud_config_cksum": "string"
}