{
  "_last_modified": "string",
  "authentication_policy": {
    "auth_profile_ref": "string",
    "authn_rules": [
      {
        "action": {},
        "enable": true,
        "index": 2,
        "match": {},
        "name": "string"
      }
    ],
    "cookie_name": "string",
    "cookie_timeout": 60,
    "default_auth_profile_ref": "string",
    "entity_id": "string",
    "key": [
      {
        "aes_key": "string",
        "hmac_key": "string",
        "name": "string"
      },
      {
        "aes_key": "string",
        "hmac_key": "string",
        "name": "string"
      },
      {
        "aes_key": "string",
        "hmac_key": "string",
        "name": "string"
      },
      {
        "aes_key": "string",
        "hmac_key": "string",
        "name": "string"
      },
      {
        "aes_key": "string",
        "hmac_key": "string",
        "name": "string"
      },
      {
        "aes_key": "string",
        "hmac_key": "string",
        "name": "string"
      }
    ],
    "single_signon_url": "string",
    "sp_metadata": "string"
  },
  "authorization_policy": {
    "authz_rules": [
      {
        "action": {},
        "enable": true,
        "index": 10,
        "match": {},
        "name": "string"
      },
      {
        "action": {},
        "enable": true,
        "index": 1,
        "match": {},
        "name": "string"
      },
      {
        "action": {},
        "enable": true,
        "index": 7,
        "match": {},
        "name": "string"
      },
      {
        "action": {},
        "enable": true,
        "index": 6,
        "match": {},
        "name": "string"
      },
      {
        "action": {},
        "enable": true,
        "index": 2,
        "match": {},
        "name": "string"
      },
      {
        "action": {},
        "enable": true,
        "index": 2,
        "match": {},
        "name": "string"
      }
    ]
  },
  "name": "string",
  "tenant_ref": "string",
  "type": "SSO_TYPE_SAML",
  "url": "string",
  "uuid": "string"
}