{
  "logs": [
    {
      "time-stamp": "string",
      "time-stamp-val": 10,
      "severity": "WARNING",
      "origin": "string",
      "long-description": "string",
      "short-description": "string",
      "user": "string"
    },
    {
      "time-stamp": "string",
      "time-stamp-val": 3,
      "severity": "DEBUG",
      "origin": "string",
      "long-description": "string",
      "short-description": "string",
      "user": "string"
    },
    {
      "time-stamp": "string",
      "time-stamp-val": 4,
      "severity": "UNKNOWN",
      "origin": "string",
      "long-description": "string",
      "short-description": "string",
      "user": "string"
    },
    {
      "time-stamp": "string",
      "time-stamp-val": 2,
      "severity": "WARNING",
      "origin": "string",
      "long-description": "string",
      "short-description": "string",
      "user": "string"
    },
    {
      "time-stamp": "string",
      "time-stamp-val": 8,
      "severity": "INFO",
      "origin": "string",
      "long-description": "string",
      "short-description": "string",
      "user": "string"
    }
  ]
}