{
  "actions": [
    {
      "name": "aboutInfo",
      "protocol": "REST",
      "method": "GET",
      "entitypath": "{base_path}/{version}/about?{query}",
      "requestSchema": "schema.json",
      "responseSchema": "schema.json",
      "timeout": 0,
      "sendEmpty": false,
      "sendGetBody": false,
      "requestDatatype": "JSON",
      "responseDatatype": "JSON",
      "headers": {},
      "responseObjects": [
        {
          "type": "default",
          "key": "",
          "mockFile": "mockdatafiles/aboutInfo-default.json"
        }
      ]
    },
    {
      "name": "getXmlSchemaByName",
      "protocol": "REST",
      "method": "GET",
      "entitypath": "{base_path}/{version}/schema/{pathv1}?{query}",
      "requestSchema": "schema.json",
      "responseSchema": "schema.json",
      "timeout": 0,
      "sendEmpty": false,
      "sendGetBody": false,
      "requestDatatype": "JSON",
      "responseDatatype": "JSON",
      "headers": {},
      "responseObjects": [
        {
          "type": "default",
          "key": "",
          "mockFile": "mockdatafiles/getXmlSchemaByName-default.json"
        }
      ]
    },
    {
      "name": "enumerateServices",
      "protocol": "REST",
      "method": "GET",
      "entitypath": "{base_path}/{version}/?{query}",
      "requestSchema": "schema.json",
      "responseSchema": "schema.json",
      "timeout": 0,
      "sendEmpty": false,
      "sendGetBody": false,
      "requestDatatype": "JSON",
      "responseDatatype": "JSON",
      "headers": {},
      "responseObjects": [
        {
          "type": "default",
          "key": "",
          "mockFile": "mockdatafiles/enumerateServices-default.json"
        }
      ]
    },
    {
      "name": "docs",
      "protocol": "REST",
      "method": "GET",
      "entitypath": "{base_path}/{version}/docs?{query}",
      "requestSchema": "schema.json",
      "responseSchema": "schema.json",
      "timeout": 0,
      "sendEmpty": false,
      "sendGetBody": false,
      "requestDatatype": "JSON",
      "responseDatatype": "JSON",
      "headers": {},
      "responseObjects": [
        {
          "type": "default",
          "key": "",
          "mockFile": ""
        }
      ]
    },
    {
      "name": "healthStatus",
      "protocol": "REST",
      "method": "GET",
      "entitypath": "{base_path}/{version}/healthstatus?{query}",
      "requestSchema": "schema.json",
      "responseSchema": "schema.json",
      "timeout": 0,
      "sendEmpty": false,
      "sendGetBody": false,
      "requestDatatype": "JSON",
      "responseDatatype": "JSON",
      "headers": {},
      "responseObjects": [
        {
          "type": "default",
          "key": "",
          "mockFile": "mockdatafiles/healthStatus-default.json"
        }
      ]
    },
    {
      "name": "getXmlSchema",
      "protocol": "REST",
      "method": "GET",
      "entitypath": "{base_path}/{version}/schema?{query}",
      "requestSchema": "schema.json",
      "responseSchema": "schema.json",
      "timeout": 0,
      "sendEmpty": false,
      "sendGetBody": false,
      "requestDatatype": "JSON",
      "responseDatatype": "JSON",
      "headers": {},
      "responseObjects": [
        {
          "type": "default",
          "key": "",
          "mockFile": "mockdatafiles/getXmlSchema-default.json"
        }
      ]
    },
    {
      "name": "status",
      "protocol": "REST",
      "method": "GET",
      "entitypath": "{base_path}/{version}/status?{query}",
      "requestSchema": "schema.json",
      "responseSchema": "schema.json",
      "timeout": 0,
      "sendEmpty": false,
      "sendGetBody": false,
      "requestDatatype": "JSON",
      "responseDatatype": "JSON",
      "headers": {},
      "responseObjects": [
        {
          "type": "default",
          "key": "",
          "mockFile": "mockdatafiles/status-default.json"
        }
      ]
    },
    {
      "name": "supportedApiVersions",
      "protocol": "REST",
      "method": "GET",
      "entitypath": "{base_path}/{version}/versions?{query}",
      "requestSchema": "schema.json",
      "responseSchema": "schema.json",
      "timeout": 0,
      "sendEmpty": false,
      "sendGetBody": false,
      "requestDatatype": "JSON",
      "responseDatatype": "JSON",
      "headers": {},
      "responseObjects": [
        {
          "type": "default",
          "key": "",
          "mockFile": "mockdatafiles/supportedApiVersions-default.json"
        }
      ]
    }
  ]
}