{
  "$id": "schema.json",
  "type": "object",
  "schema": "http://json-schema.org/draft-07/schema#",
  "translate": true,
  "dynamicfields": true,
  "properties": {
    "ph_request_type": {
      "type": "string",
      "description": "type of request (internal to adapter)",
      "default": "getPermissionsForAction",
      "enum": [
        "getPermissionsForAction",
        "insertPermissionsForAction",
        "deletePermissionsForAction",
        "executeActionById",
        "getAction",
        "getPermissionRuleByRuleIdForAction",
        "updatePermissionRuleByRuleIdForAction",
        "deletePermissionRuleByRuleIdForAction",
        "executeActionByName",
        "exportActionByActionId",
        "deleteActionByActionId",
        "listAllActions",
        "importAction"
      ],
      "external_name": "ph_request_type"
    },
    "bodyFormData": {
      "type": ["object", "string"],
      "description": "",
      "parse": false,
      "encode": false,
      "encrypt": {
        "type": "AES",
        "key": ""
      },
      "external_name": "body"
    }
  },
  "definitions": {}
}