{
  "namespace": "string",
  "type": [
    {
      "icon-href": "string",
      "name": "string",
      "attribute": [
        {
          "display-name": "string",
          "name": "string",
          "description": "string",
          "possible-result-type": "string"
        },
        {
          "display-name": "string",
          "name": "string",
          "description": "string",
          "possible-result-type": "string"
        },
        {
          "display-name": "string",
          "name": "string",
          "description": "string",
          "possible-result-type": "string"
        }
      ],
      "relation": [
        {
          "display-name": "string",
          "name": "string",
          "type": "string"
        },
        {
          "display-name": "string",
          "name": "string",
          "type": "string"
        },
        {
          "display-name": "string",
          "name": "string",
          "type": "string"
        },
        {
          "display-name": "string",
          "name": "string",
          "type": "string"
        },
        {
          "display-name": "string",
          "name": "string",
          "type": "string"
        },
        {
          "display-name": "string",
          "name": "string",
          "type": "string"
        },
        {
          "display-name": "string",
          "name": "string",
          "type": "string"
        },
        {
          "display-name": "string",
          "name": "string",
          "type": "string"
        },
        {
          "display-name": "string",
          "name": "string",
          "type": "string"
        }
      ]
    },
    {
      "icon-href": "string",
      "name": "string",
      "attribute": [
        {
          "display-name": "string",
          "name": "string",
          "description": "string",
          "possible-result-type": "string"
        },
        {
          "display-name": "string",
          "name": "string",
          "description": "string",
          "possible-result-type": "string"
        },
        {
          "display-name": "string",
          "name": "string",
          "description": "string",
          "possible-result-type": "string"
        },
        {
          "display-name": "string",
          "name": "string",
          "description": "string",
          "possible-result-type": "string"
        }
      ],
      "relation": [
        {
          "display-name": "string",
          "name": "string",
          "type": "string"
        },
        {
          "display-name": "string",
          "name": "string",
          "type": "string"
        },
        {
          "display-name": "string",
          "name": "string",
          "type": "string"
        },
        {
          "display-name": "string",
          "name": "string",
          "type": "string"
        },
        {
          "display-name": "string",
          "name": "string",
          "type": "string"
        },
        {
          "display-name": "string",
          "name": "string",
          "type": "string"
        }
      ]
    }
  ]
}