{
  "name": "string",
  "description": "string",
  "href": "string",
  "id": "string",
  "relations": {
    "total": 6,
    "start": 3,
    "link": [
      {
        "rel": "string",
        "attribute": [
          {
            "displayValue": "string",
            "name": "string",
            "value": "string"
          },
          {
            "displayValue": "string",
            "name": "string",
            "value": "string"
          },
          {
            "displayValue": "string",
            "name": "string",
            "value": "string"
          }
        ],
        "href": "string",
        "type": "string"
      },
      {
        "rel": "string",
        "attribute": [
          {
            "displayValue": "string",
            "name": "string",
            "value": "string"
          },
          {
            "displayValue": "string",
            "name": "string",
            "value": "string"
          },
          {
            "displayValue": "string",
            "name": "string",
            "value": "string"
          },
          {
            "displayValue": "string",
            "name": "string",
            "value": "string"
          },
          {
            "displayValue": "string",
            "name": "string",
            "value": "string"
          },
          {
            "displayValue": "string",
            "name": "string",
            "value": "string"
          },
          {
            "displayValue": "string",
            "name": "string",
            "value": "string"
          },
          {
            "displayValue": "string",
            "name": "string",
            "value": "string"
          },
          {
            "displayValue": "string",
            "name": "string",
            "value": "string"
          },
          {
            "displayValue": "string",
            "name": "string",
            "value": "string"
          }
        ],
        "href": "string",
        "type": "string"
      },
      {
        "rel": "string",
        "attribute": [
          {
            "displayValue": "string",
            "name": "string",
            "value": "string"
          }
        ],
        "href": "string",
        "type": "string"
      },
      {
        "rel": "string",
        "attribute": [
          {
            "displayValue": "string",
            "name": "string",
            "value": "string"
          },
          {
            "displayValue": "string",
            "name": "string",
            "value": "string"
          }
        ],
        "href": "string",
        "type": "string"
      }
    ]
  },
  "steps": [
    {
      "hidden": false,
      "display-name": "string",
      "elements": [
        {
          "hidden": true,
          "display-name": "string",
          "description": "string",
          "messages": [
            {
              "severity": "ERROR",
              "Details": "string",
              "code": "string",
              "Summary": "string"
            },
            {
              "severity": "INFO",
              "Details": "string",
              "code": "string",
              "Summary": "string"
            },
            {
              "severity": "WARN",
              "Details": "string",
              "code": "string",
              "Summary": "string"
            },
            {
              "severity": "INFO",
              "Details": "string",
              "code": "string",
              "Summary": "string"
            },
            {
              "severity": "ERROR",
              "Details": "string",
              "code": "string",
              "Summary": "string"
            },
            {
              "severity": "WARN",
              "Details": "string",
              "code": "string",
              "Summary": "string"
            },
            {
              "severity": "ERROR",
              "Details": "string",
              "code": "string",
              "Summary": "string"
            },
            {
              "severity": "WARN",
              "Details": "string",
              "code": "string",
              "Summary": "string"
            },
            {
              "severity": "INFO",
              "Details": "string",
              "code": "string",
              "Summary": "string"
            },
            {
              "severity": "INFO",
              "Details": "string",
              "code": "string",
              "Summary": "string"
            }
          ],
          "id": "string"
        },
        {
          "hidden": false,
          "display-name": "string",
          "description": "string",
          "messages": [
            {
              "severity": "ERROR",
              "Details": "string",
              "code": "string",
              "Summary": "string"
            },
            {
              "severity": "WARN",
              "Details": "string",
              "code": "string",
              "Summary": "string"
            },
            {
              "severity": "INFO",
              "Details": "string",
              "code": "string",
              "Summary": "string"
            },
            {
              "severity": "INFO",
              "Details": "string",
              "code": "string",
              "Summary": "string"
            },
            {
              "severity": "WARN",
              "Details": "string",
              "code": "string",
              "Summary": "string"
            },
            {
              "severity": "WARN",
              "Details": "string",
              "code": "string",
              "Summary": "string"
            },
            {
              "severity": "ERROR",
              "Details": "string",
              "code": "string",
              "Summary": "string"
            }
          ],
          "id": "string"
        },
        {
          "hidden": true,
          "display-name": "string",
          "description": "string",
          "messages": [
            {
              "severity": "INFO",
              "Details": "string",
              "code": "string",
              "Summary": "string"
            },
            {
              "severity": "INFO",
              "Details": "string",
              "code": "string",
              "Summary": "string"
            },
            {
              "severity": "WARN",
              "Details": "string",
              "code": "string",
              "Summary": "string"
            }
          ],
          "id": "string"
        }
      ],
      "description": "string",
      "messages": [
        {
          "severity": "ERROR",
          "Details": "string",
          "code": "string",
          "Summary": "string"
        },
        {
          "severity": "INFO",
          "Details": "string",
          "code": "string",
          "Summary": "string"
        },
        {
          "severity": "WARN",
          "Details": "string",
          "code": "string",
          "Summary": "string"
        },
        {
          "severity": "INFO",
          "Details": "string",
          "code": "string",
          "Summary": "string"
        },
        {
          "severity": "INFO",
          "Details": "string",
          "code": "string",
          "Summary": "string"
        },
        {
          "severity": "ERROR",
          "Details": "string",
          "code": "string",
          "Summary": "string"
        },
        {
          "severity": "ERROR",
          "Details": "string",
          "code": "string",
          "Summary": "string"
        }
      ],
      "readOnly": false,
      "id": "string"
    },
    {
      "hidden": false,
      "display-name": "string",
      "elements": [
        {
          "hidden": true,
          "display-name": "string",
          "description": "string",
          "messages": [
            {
              "severity": "ERROR",
              "Details": "string",
              "code": "string",
              "Summary": "string"
            }
          ],
          "id": "string"
        },
        {
          "hidden": true,
          "display-name": "string",
          "description": "string",
          "messages": [
            {
              "severity": "ERROR",
              "Details": "string",
              "code": "string",
              "Summary": "string"
            },
            {
              "severity": "ERROR",
              "Details": "string",
              "code": "string",
              "Summary": "string"
            },
            {
              "severity": "INFO",
              "Details": "string",
              "code": "string",
              "Summary": "string"
            },
            {
              "severity": "ERROR",
              "Details": "string",
              "code": "string",
              "Summary": "string"
            },
            {
              "severity": "ERROR",
              "Details": "string",
              "code": "string",
              "Summary": "string"
            },
            {
              "severity": "WARN",
              "Details": "string",
              "code": "string",
              "Summary": "string"
            },
            {
              "severity": "INFO",
              "Details": "string",
              "code": "string",
              "Summary": "string"
            },
            {
              "severity": "ERROR",
              "Details": "string",
              "code": "string",
              "Summary": "string"
            },
            {
              "severity": "WARN",
              "Details": "string",
              "code": "string",
              "Summary": "string"
            }
          ],
          "id": "string"
        },
        {
          "hidden": false,
          "display-name": "string",
          "description": "string",
          "messages": [
            {
              "severity": "WARN",
              "Details": "string",
              "code": "string",
              "Summary": "string"
            },
            {
              "severity": "ERROR",
              "Details": "string",
              "code": "string",
              "Summary": "string"
            },
            {
              "severity": "ERROR",
              "Details": "string",
              "code": "string",
              "Summary": "string"
            },
            {
              "severity": "ERROR",
              "Details": "string",
              "code": "string",
              "Summary": "string"
            },
            {
              "severity": "ERROR",
              "Details": "string",
              "code": "string",
              "Summary": "string"
            }
          ],
          "id": "string"
        }
      ],
      "description": "string",
      "messages": [
        {
          "severity": "WARN",
          "Details": "string",
          "code": "string",
          "Summary": "string"
        },
        {
          "severity": "WARN",
          "Details": "string",
          "code": "string",
          "Summary": "string"
        },
        {
          "severity": "ERROR",
          "Details": "string",
          "code": "string",
          "Summary": "string"
        }
      ],
      "readOnly": false,
      "id": "string"
    },
    {
      "hidden": false,
      "display-name": "string",
      "elements": [
        {
          "hidden": false,
          "display-name": "string",
          "description": "string",
          "messages": [
            {
              "severity": "INFO",
              "Details": "string",
              "code": "string",
              "Summary": "string"
            },
            {
              "severity": "INFO",
              "Details": "string",
              "code": "string",
              "Summary": "string"
            }
          ],
          "id": "string"
        },
        {
          "hidden": true,
          "display-name": "string",
          "description": "string",
          "messages": [
            {
              "severity": "INFO",
              "Details": "string",
              "code": "string",
              "Summary": "string"
            },
            {
              "severity": "INFO",
              "Details": "string",
              "code": "string",
              "Summary": "string"
            },
            {
              "severity": "INFO",
              "Details": "string",
              "code": "string",
              "Summary": "string"
            },
            {
              "severity": "INFO",
              "Details": "string",
              "code": "string",
              "Summary": "string"
            },
            {
              "severity": "INFO",
              "Details": "string",
              "code": "string",
              "Summary": "string"
            },
            {
              "severity": "INFO",
              "Details": "string",
              "code": "string",
              "Summary": "string"
            }
          ],
          "id": "string"
        },
        {
          "hidden": false,
          "display-name": "string",
          "description": "string",
          "messages": [
            {
              "severity": "ERROR",
              "Details": "string",
              "code": "string",
              "Summary": "string"
            },
            {
              "severity": "INFO",
              "Details": "string",
              "code": "string",
              "Summary": "string"
            },
            {
              "severity": "ERROR",
              "Details": "string",
              "code": "string",
              "Summary": "string"
            },
            {
              "severity": "WARN",
              "Details": "string",
              "code": "string",
              "Summary": "string"
            },
            {
              "severity": "WARN",
              "Details": "string",
              "code": "string",
              "Summary": "string"
            },
            {
              "severity": "WARN",
              "Details": "string",
              "code": "string",
              "Summary": "string"
            },
            {
              "severity": "INFO",
              "Details": "string",
              "code": "string",
              "Summary": "string"
            },
            {
              "severity": "WARN",
              "Details": "string",
              "code": "string",
              "Summary": "string"
            },
            {
              "severity": "INFO",
              "Details": "string",
              "code": "string",
              "Summary": "string"
            },
            {
              "severity": "ERROR",
              "Details": "string",
              "code": "string",
              "Summary": "string"
            }
          ],
          "id": "string"
        },
        {
          "hidden": false,
          "display-name": "string",
          "description": "string",
          "messages": [
            {
              "severity": "INFO",
              "Details": "string",
              "code": "string",
              "Summary": "string"
            },
            {
              "severity": "INFO",
              "Details": "string",
              "code": "string",
              "Summary": "string"
            },
            {
              "severity": "ERROR",
              "Details": "string",
              "code": "string",
              "Summary": "string"
            },
            {
              "severity": "WARN",
              "Details": "string",
              "code": "string",
              "Summary": "string"
            },
            {
              "severity": "ERROR",
              "Details": "string",
              "code": "string",
              "Summary": "string"
            }
          ],
          "id": "string"
        },
        {
          "hidden": true,
          "display-name": "string",
          "description": "string",
          "messages": [
            {
              "severity": "WARN",
              "Details": "string",
              "code": "string",
              "Summary": "string"
            }
          ],
          "id": "string"
        },
        {
          "hidden": true,
          "display-name": "string",
          "description": "string",
          "messages": [
            {
              "severity": "INFO",
              "Details": "string",
              "code": "string",
              "Summary": "string"
            },
            {
              "severity": "ERROR",
              "Details": "string",
              "code": "string",
              "Summary": "string"
            },
            {
              "severity": "WARN",
              "Details": "string",
              "code": "string",
              "Summary": "string"
            },
            {
              "severity": "ERROR",
              "Details": "string",
              "code": "string",
              "Summary": "string"
            },
            {
              "severity": "WARN",
              "Details": "string",
              "code": "string",
              "Summary": "string"
            },
            {
              "severity": "ERROR",
              "Details": "string",
              "code": "string",
              "Summary": "string"
            }
          ],
          "id": "string"
        },
        {
          "hidden": true,
          "display-name": "string",
          "description": "string",
          "messages": [
            {
              "severity": "WARN",
              "Details": "string",
              "code": "string",
              "Summary": "string"
            },
            {
              "severity": "WARN",
              "Details": "string",
              "code": "string",
              "Summary": "string"
            },
            {
              "severity": "WARN",
              "Details": "string",
              "code": "string",
              "Summary": "string"
            },
            {
              "severity": "ERROR",
              "Details": "string",
              "code": "string",
              "Summary": "string"
            },
            {
              "severity": "INFO",
              "Details": "string",
              "code": "string",
              "Summary": "string"
            }
          ],
          "id": "string"
        },
        {
          "hidden": false,
          "display-name": "string",
          "description": "string",
          "messages": [
            {
              "severity": "ERROR",
              "Details": "string",
              "code": "string",
              "Summary": "string"
            },
            {
              "severity": "ERROR",
              "Details": "string",
              "code": "string",
              "Summary": "string"
            },
            {
              "severity": "WARN",
              "Details": "string",
              "code": "string",
              "Summary": "string"
            },
            {
              "severity": "WARN",
              "Details": "string",
              "code": "string",
              "Summary": "string"
            },
            {
              "severity": "INFO",
              "Details": "string",
              "code": "string",
              "Summary": "string"
            },
            {
              "severity": "ERROR",
              "Details": "string",
              "code": "string",
              "Summary": "string"
            }
          ],
          "id": "string"
        }
      ],
      "description": "string",
      "messages": [
        {
          "severity": "ERROR",
          "Details": "string",
          "code": "string",
          "Summary": "string"
        }
      ],
      "readOnly": false,
      "id": "string"
    }
  ],
  "inputParameters": [
    {
      "scope": "TOKEN",
      "name": "string",
      "encrypt-value": true,
      "description": "string",
      "type": "string",
      "value": {
        "objectType": "string"
      },
      "updated": true
    },
    {
      "scope": "LOCAL",
      "name": "string",
      "encrypt-value": false,
      "description": "string",
      "type": "string",
      "value": {
        "objectType": "string"
      },
      "updated": true
    },
    {
      "scope": "LOCAL",
      "name": "string",
      "encrypt-value": false,
      "description": "string",
      "type": "string",
      "value": {
        "objectType": "string"
      },
      "updated": false
    }
  ],
  "outputParameters": [
    {
      "scope": "LOCAL",
      "name": "string",
      "encrypt-value": true,
      "description": "string",
      "type": "string",
      "value": {
        "objectType": "string"
      },
      "updated": true
    }
  ]
}