{
  "principal": "string",
  "rights": "string",
  "href": "string",
  "relations": {
    "total": 2,
    "start": 4,
    "link": [
      {
        "rel": "string",
        "attribute": [
          {
            "displayValue": "string",
            "name": "string",
            "value": "string"
          },
          {
            "displayValue": "string",
            "name": "string",
            "value": "string"
          },
          {
            "displayValue": "string",
            "name": "string",
            "value": "string"
          },
          {
            "displayValue": "string",
            "name": "string",
            "value": "string"
          },
          {
            "displayValue": "string",
            "name": "string",
            "value": "string"
          },
          {
            "displayValue": "string",
            "name": "string",
            "value": "string"
          },
          {
            "displayValue": "string",
            "name": "string",
            "value": "string"
          },
          {
            "displayValue": "string",
            "name": "string",
            "value": "string"
          },
          {
            "displayValue": "string",
            "name": "string",
            "value": "string"
          },
          {
            "displayValue": "string",
            "name": "string",
            "value": "string"
          }
        ],
        "href": "string",
        "type": "string"
      }
    ]
  }
}