{
  "$id": "schema.json",
  "type": "object",
  "schema": "http://json-schema.org/draft-07/schema#",
  "translate": true,
  "dynamicfields": true,
  "properties": {
    "ph_request_type": {
      "type": "string",
      "description": "type of request (internal to adapter)",
      "default": "packageDetails",
      "enum": [
        "packageDetails",
        "createPackage",
        "deletePackage",
        "updatePackage",
        "deleteResourceElement",
        "getImportPackageDetails",
        "addConfigurationElementCategoryToPackage",
        "listAllPackages",
        "importPackage",
        "getPermissionRuleByRuleIdForPackage",
        "updatePermissionRuleByRuleIdForPackage",
        "deletePermissionRuleByRuleIdForPackage",
        "deleteConfigurationElement",
        "addRecourceElementToPackage",
        "addWorkflowToPackage",
        "addConfigurationElementToPackage",
        "getPermissionsForObjectPackage",
        "insertPermissionsForPackage",
        "deletePermissionsForPackage",
        "addActionsToPackage",
        "importPackageExtended",
        "addActionToPackage",
        "rebuildPackage",
        "deleteWorkflowElement",
        "addWorkflowCategoryToPackage",
        "deleteActionElement",
        "addRecourceCategoryToPackage"
      ],
      "external_name": "ph_request_type"
    },
    "bodyFormData": {
      "type": ["object", "string"],
      "description": "",
      "parse": false,
      "encode": false,
      "encrypt": {
        "type": "AES",
        "key": ""
      },
      "external_name": "body"
    }
  },
  "definitions": {}
}