{
  "permissions": [
    {
      "principal": "string",
      "rights": "string",
      "href": "string",
      "relations": {
        "total": 5,
        "start": 3,
        "link": [
          {
            "rel": "string",
            "attribute": [
              {
                "displayValue": "string",
                "name": "string",
                "value": "string"
              },
              {
                "displayValue": "string",
                "name": "string",
                "value": "string"
              },
              {
                "displayValue": "string",
                "name": "string",
                "value": "string"
              },
              {
                "displayValue": "string",
                "name": "string",
                "value": "string"
              },
              {
                "displayValue": "string",
                "name": "string",
                "value": "string"
              },
              {
                "displayValue": "string",
                "name": "string",
                "value": "string"
              },
              {
                "displayValue": "string",
                "name": "string",
                "value": "string"
              },
              {
                "displayValue": "string",
                "name": "string",
                "value": "string"
              }
            ],
            "href": "string",
            "type": "string"
          },
          {
            "rel": "string",
            "attribute": [
              {
                "displayValue": "string",
                "name": "string",
                "value": "string"
              },
              {
                "displayValue": "string",
                "name": "string",
                "value": "string"
              },
              {
                "displayValue": "string",
                "name": "string",
                "value": "string"
              },
              {
                "displayValue": "string",
                "name": "string",
                "value": "string"
              },
              {
                "displayValue": "string",
                "name": "string",
                "value": "string"
              },
              {
                "displayValue": "string",
                "name": "string",
                "value": "string"
              }
            ],
            "href": "string",
            "type": "string"
          },
          {
            "rel": "string",
            "attribute": [
              {
                "displayValue": "string",
                "name": "string",
                "value": "string"
              },
              {
                "displayValue": "string",
                "name": "string",
                "value": "string"
              },
              {
                "displayValue": "string",
                "name": "string",
                "value": "string"
              },
              {
                "displayValue": "string",
                "name": "string",
                "value": "string"
              },
              {
                "displayValue": "string",
                "name": "string",
                "value": "string"
              }
            ],
            "href": "string",
            "type": "string"
          },
          {
            "rel": "string",
            "attribute": [
              {
                "displayValue": "string",
                "name": "string",
                "value": "string"
              },
              {
                "displayValue": "string",
                "name": "string",
                "value": "string"
              },
              {
                "displayValue": "string",
                "name": "string",
                "value": "string"
              }
            ],
            "href": "string",
            "type": "string"
          },
          {
            "rel": "string",
            "attribute": [
              {
                "displayValue": "string",
                "name": "string",
                "value": "string"
              }
            ],
            "href": "string",
            "type": "string"
          },
          {
            "rel": "string",
            "attribute": [
              {
                "displayValue": "string",
                "name": "string",
                "value": "string"
              },
              {
                "displayValue": "string",
                "name": "string",
                "value": "string"
              },
              {
                "displayValue": "string",
                "name": "string",
                "value": "string"
              },
              {
                "displayValue": "string",
                "name": "string",
                "value": "string"
              },
              {
                "displayValue": "string",
                "name": "string",
                "value": "string"
              },
              {
                "displayValue": "string",
                "name": "string",
                "value": "string"
              }
            ],
            "href": "string",
            "type": "string"
          },
          {
            "rel": "string",
            "attribute": [
              {
                "displayValue": "string",
                "name": "string",
                "value": "string"
              },
              {
                "displayValue": "string",
                "name": "string",
                "value": "string"
              },
              {
                "displayValue": "string",
                "name": "string",
                "value": "string"
              },
              {
                "displayValue": "string",
                "name": "string",
                "value": "string"
              },
              {
                "displayValue": "string",
                "name": "string",
                "value": "string"
              },
              {
                "displayValue": "string",
                "name": "string",
                "value": "string"
              },
              {
                "displayValue": "string",
                "name": "string",
                "value": "string"
              },
              {
                "displayValue": "string",
                "name": "string",
                "value": "string"
              },
              {
                "displayValue": "string",
                "name": "string",
                "value": "string"
              },
              {
                "displayValue": "string",
                "name": "string",
                "value": "string"
              }
            ],
            "href": "string",
            "type": "string"
          }
        ]
      }
    },
    {
      "principal": "string",
      "rights": "string",
      "href": "string",
      "relations": {
        "total": 3,
        "start": 10,
        "link": [
          {
            "rel": "string",
            "attribute": [
              {
                "displayValue": "string",
                "name": "string",
                "value": "string"
              },
              {
                "displayValue": "string",
                "name": "string",
                "value": "string"
              },
              {
                "displayValue": "string",
                "name": "string",
                "value": "string"
              },
              {
                "displayValue": "string",
                "name": "string",
                "value": "string"
              },
              {
                "displayValue": "string",
                "name": "string",
                "value": "string"
              },
              {
                "displayValue": "string",
                "name": "string",
                "value": "string"
              }
            ],
            "href": "string",
            "type": "string"
          },
          {
            "rel": "string",
            "attribute": [
              {
                "displayValue": "string",
                "name": "string",
                "value": "string"
              },
              {
                "displayValue": "string",
                "name": "string",
                "value": "string"
              }
            ],
            "href": "string",
            "type": "string"
          }
        ]
      }
    },
    {
      "principal": "string",
      "rights": "string",
      "href": "string",
      "relations": {
        "total": 10,
        "start": 5,
        "link": [
          {
            "rel": "string",
            "attribute": [
              {
                "displayValue": "string",
                "name": "string",
                "value": "string"
              },
              {
                "displayValue": "string",
                "name": "string",
                "value": "string"
              },
              {
                "displayValue": "string",
                "name": "string",
                "value": "string"
              },
              {
                "displayValue": "string",
                "name": "string",
                "value": "string"
              }
            ],
            "href": "string",
            "type": "string"
          },
          {
            "rel": "string",
            "attribute": [
              {
                "displayValue": "string",
                "name": "string",
                "value": "string"
              },
              {
                "displayValue": "string",
                "name": "string",
                "value": "string"
              },
              {
                "displayValue": "string",
                "name": "string",
                "value": "string"
              },
              {
                "displayValue": "string",
                "name": "string",
                "value": "string"
              },
              {
                "displayValue": "string",
                "name": "string",
                "value": "string"
              }
            ],
            "href": "string",
            "type": "string"
          },
          {
            "rel": "string",
            "attribute": [
              {
                "displayValue": "string",
                "name": "string",
                "value": "string"
              },
              {
                "displayValue": "string",
                "name": "string",
                "value": "string"
              },
              {
                "displayValue": "string",
                "name": "string",
                "value": "string"
              },
              {
                "displayValue": "string",
                "name": "string",
                "value": "string"
              },
              {
                "displayValue": "string",
                "name": "string",
                "value": "string"
              },
              {
                "displayValue": "string",
                "name": "string",
                "value": "string"
              },
              {
                "displayValue": "string",
                "name": "string",
                "value": "string"
              },
              {
                "displayValue": "string",
                "name": "string",
                "value": "string"
              },
              {
                "displayValue": "string",
                "name": "string",
                "value": "string"
              },
              {
                "displayValue": "string",
                "name": "string",
                "value": "string"
              }
            ],
            "href": "string",
            "type": "string"
          },
          {
            "rel": "string",
            "attribute": [
              {
                "displayValue": "string",
                "name": "string",
                "value": "string"
              },
              {
                "displayValue": "string",
                "name": "string",
                "value": "string"
              }
            ],
            "href": "string",
            "type": "string"
          },
          {
            "rel": "string",
            "attribute": [
              {
                "displayValue": "string",
                "name": "string",
                "value": "string"
              }
            ],
            "href": "string",
            "type": "string"
          },
          {
            "rel": "string",
            "attribute": [
              {
                "displayValue": "string",
                "name": "string",
                "value": "string"
              },
              {
                "displayValue": "string",
                "name": "string",
                "value": "string"
              }
            ],
            "href": "string",
            "type": "string"
          },
          {
            "rel": "string",
            "attribute": [
              {
                "displayValue": "string",
                "name": "string",
                "value": "string"
              },
              {
                "displayValue": "string",
                "name": "string",
                "value": "string"
              },
              {
                "displayValue": "string",
                "name": "string",
                "value": "string"
              }
            ],
            "href": "string",
            "type": "string"
          },
          {
            "rel": "string",
            "attribute": [
              {
                "displayValue": "string",
                "name": "string",
                "value": "string"
              },
              {
                "displayValue": "string",
                "name": "string",
                "value": "string"
              },
              {
                "displayValue": "string",
                "name": "string",
                "value": "string"
              },
              {
                "displayValue": "string",
                "name": "string",
                "value": "string"
              },
              {
                "displayValue": "string",
                "name": "string",
                "value": "string"
              },
              {
                "displayValue": "string",
                "name": "string",
                "value": "string"
              }
            ],
            "href": "string",
            "type": "string"
          },
          {
            "rel": "string",
            "attribute": [
              {
                "displayValue": "string",
                "name": "string",
                "value": "string"
              }
            ],
            "href": "string",
            "type": "string"
          },
          {
            "rel": "string",
            "attribute": [
              {
                "displayValue": "string",
                "name": "string",
                "value": "string"
              },
              {
                "displayValue": "string",
                "name": "string",
                "value": "string"
              },
              {
                "displayValue": "string",
                "name": "string",
                "value": "string"
              },
              {
                "displayValue": "string",
                "name": "string",
                "value": "string"
              },
              {
                "displayValue": "string",
                "name": "string",
                "value": "string"
              },
              {
                "displayValue": "string",
                "name": "string",
                "value": "string"
              },
              {
                "displayValue": "string",
                "name": "string",
                "value": "string"
              }
            ],
            "href": "string",
            "type": "string"
          }
        ]
      }
    },
    {
      "principal": "string",
      "rights": "string",
      "href": "string",
      "relations": {
        "total": 2,
        "start": 5,
        "link": [
          {
            "rel": "string",
            "attribute": [
              {
                "displayValue": "string",
                "name": "string",
                "value": "string"
              },
              {
                "displayValue": "string",
                "name": "string",
                "value": "string"
              },
              {
                "displayValue": "string",
                "name": "string",
                "value": "string"
              },
              {
                "displayValue": "string",
                "name": "string",
                "value": "string"
              },
              {
                "displayValue": "string",
                "name": "string",
                "value": "string"
              }
            ],
            "href": "string",
            "type": "string"
          },
          {
            "rel": "string",
            "attribute": [
              {
                "displayValue": "string",
                "name": "string",
                "value": "string"
              },
              {
                "displayValue": "string",
                "name": "string",
                "value": "string"
              },
              {
                "displayValue": "string",
                "name": "string",
                "value": "string"
              },
              {
                "displayValue": "string",
                "name": "string",
                "value": "string"
              },
              {
                "displayValue": "string",
                "name": "string",
                "value": "string"
              },
              {
                "displayValue": "string",
                "name": "string",
                "value": "string"
              },
              {
                "displayValue": "string",
                "name": "string",
                "value": "string"
              }
            ],
            "href": "string",
            "type": "string"
          },
          {
            "rel": "string",
            "attribute": [
              {
                "displayValue": "string",
                "name": "string",
                "value": "string"
              },
              {
                "displayValue": "string",
                "name": "string",
                "value": "string"
              },
              {
                "displayValue": "string",
                "name": "string",
                "value": "string"
              }
            ],
            "href": "string",
            "type": "string"
          },
          {
            "rel": "string",
            "attribute": [
              {
                "displayValue": "string",
                "name": "string",
                "value": "string"
              },
              {
                "displayValue": "string",
                "name": "string",
                "value": "string"
              },
              {
                "displayValue": "string",
                "name": "string",
                "value": "string"
              },
              {
                "displayValue": "string",
                "name": "string",
                "value": "string"
              },
              {
                "displayValue": "string",
                "name": "string",
                "value": "string"
              },
              {
                "displayValue": "string",
                "name": "string",
                "value": "string"
              },
              {
                "displayValue": "string",
                "name": "string",
                "value": "string"
              },
              {
                "displayValue": "string",
                "name": "string",
                "value": "string"
              },
              {
                "displayValue": "string",
                "name": "string",
                "value": "string"
              },
              {
                "displayValue": "string",
                "name": "string",
                "value": "string"
              }
            ],
            "href": "string",
            "type": "string"
          },
          {
            "rel": "string",
            "attribute": [
              {
                "displayValue": "string",
                "name": "string",
                "value": "string"
              },
              {
                "displayValue": "string",
                "name": "string",
                "value": "string"
              },
              {
                "displayValue": "string",
                "name": "string",
                "value": "string"
              },
              {
                "displayValue": "string",
                "name": "string",
                "value": "string"
              },
              {
                "displayValue": "string",
                "name": "string",
                "value": "string"
              },
              {
                "displayValue": "string",
                "name": "string",
                "value": "string"
              },
              {
                "displayValue": "string",
                "name": "string",
                "value": "string"
              },
              {
                "displayValue": "string",
                "name": "string",
                "value": "string"
              },
              {
                "displayValue": "string",
                "name": "string",
                "value": "string"
              }
            ],
            "href": "string",
            "type": "string"
          },
          {
            "rel": "string",
            "attribute": [
              {
                "displayValue": "string",
                "name": "string",
                "value": "string"
              },
              {
                "displayValue": "string",
                "name": "string",
                "value": "string"
              },
              {
                "displayValue": "string",
                "name": "string",
                "value": "string"
              },
              {
                "displayValue": "string",
                "name": "string",
                "value": "string"
              }
            ],
            "href": "string",
            "type": "string"
          },
          {
            "rel": "string",
            "attribute": [
              {
                "displayValue": "string",
                "name": "string",
                "value": "string"
              },
              {
                "displayValue": "string",
                "name": "string",
                "value": "string"
              },
              {
                "displayValue": "string",
                "name": "string",
                "value": "string"
              },
              {
                "displayValue": "string",
                "name": "string",
                "value": "string"
              },
              {
                "displayValue": "string",
                "name": "string",
                "value": "string"
              }
            ],
            "href": "string",
            "type": "string"
          }
        ]
      }
    },
    {
      "principal": "string",
      "rights": "string",
      "href": "string",
      "relations": {
        "total": 8,
        "start": 5,
        "link": [
          {
            "rel": "string",
            "attribute": [
              {
                "displayValue": "string",
                "name": "string",
                "value": "string"
              },
              {
                "displayValue": "string",
                "name": "string",
                "value": "string"
              }
            ],
            "href": "string",
            "type": "string"
          },
          {
            "rel": "string",
            "attribute": [
              {
                "displayValue": "string",
                "name": "string",
                "value": "string"
              },
              {
                "displayValue": "string",
                "name": "string",
                "value": "string"
              },
              {
                "displayValue": "string",
                "name": "string",
                "value": "string"
              },
              {
                "displayValue": "string",
                "name": "string",
                "value": "string"
              },
              {
                "displayValue": "string",
                "name": "string",
                "value": "string"
              },
              {
                "displayValue": "string",
                "name": "string",
                "value": "string"
              },
              {
                "displayValue": "string",
                "name": "string",
                "value": "string"
              }
            ],
            "href": "string",
            "type": "string"
          },
          {
            "rel": "string",
            "attribute": [
              {
                "displayValue": "string",
                "name": "string",
                "value": "string"
              },
              {
                "displayValue": "string",
                "name": "string",
                "value": "string"
              }
            ],
            "href": "string",
            "type": "string"
          },
          {
            "rel": "string",
            "attribute": [
              {
                "displayValue": "string",
                "name": "string",
                "value": "string"
              },
              {
                "displayValue": "string",
                "name": "string",
                "value": "string"
              },
              {
                "displayValue": "string",
                "name": "string",
                "value": "string"
              },
              {
                "displayValue": "string",
                "name": "string",
                "value": "string"
              },
              {
                "displayValue": "string",
                "name": "string",
                "value": "string"
              },
              {
                "displayValue": "string",
                "name": "string",
                "value": "string"
              }
            ],
            "href": "string",
            "type": "string"
          },
          {
            "rel": "string",
            "attribute": [
              {
                "displayValue": "string",
                "name": "string",
                "value": "string"
              },
              {
                "displayValue": "string",
                "name": "string",
                "value": "string"
              },
              {
                "displayValue": "string",
                "name": "string",
                "value": "string"
              },
              {
                "displayValue": "string",
                "name": "string",
                "value": "string"
              },
              {
                "displayValue": "string",
                "name": "string",
                "value": "string"
              }
            ],
            "href": "string",
            "type": "string"
          },
          {
            "rel": "string",
            "attribute": [
              {
                "displayValue": "string",
                "name": "string",
                "value": "string"
              },
              {
                "displayValue": "string",
                "name": "string",
                "value": "string"
              },
              {
                "displayValue": "string",
                "name": "string",
                "value": "string"
              },
              {
                "displayValue": "string",
                "name": "string",
                "value": "string"
              },
              {
                "displayValue": "string",
                "name": "string",
                "value": "string"
              },
              {
                "displayValue": "string",
                "name": "string",
                "value": "string"
              },
              {
                "displayValue": "string",
                "name": "string",
                "value": "string"
              },
              {
                "displayValue": "string",
                "name": "string",
                "value": "string"
              },
              {
                "displayValue": "string",
                "name": "string",
                "value": "string"
              },
              {
                "displayValue": "string",
                "name": "string",
                "value": "string"
              }
            ],
            "href": "string",
            "type": "string"
          },
          {
            "rel": "string",
            "attribute": [
              {
                "displayValue": "string",
                "name": "string",
                "value": "string"
              },
              {
                "displayValue": "string",
                "name": "string",
                "value": "string"
              },
              {
                "displayValue": "string",
                "name": "string",
                "value": "string"
              },
              {
                "displayValue": "string",
                "name": "string",
                "value": "string"
              },
              {
                "displayValue": "string",
                "name": "string",
                "value": "string"
              },
              {
                "displayValue": "string",
                "name": "string",
                "value": "string"
              },
              {
                "displayValue": "string",
                "name": "string",
                "value": "string"
              },
              {
                "displayValue": "string",
                "name": "string",
                "value": "string"
              }
            ],
            "href": "string",
            "type": "string"
          },
          {
            "rel": "string",
            "attribute": [
              {
                "displayValue": "string",
                "name": "string",
                "value": "string"
              },
              {
                "displayValue": "string",
                "name": "string",
                "value": "string"
              },
              {
                "displayValue": "string",
                "name": "string",
                "value": "string"
              },
              {
                "displayValue": "string",
                "name": "string",
                "value": "string"
              },
              {
                "displayValue": "string",
                "name": "string",
                "value": "string"
              },
              {
                "displayValue": "string",
                "name": "string",
                "value": "string"
              },
              {
                "displayValue": "string",
                "name": "string",
                "value": "string"
              }
            ],
            "href": "string",
            "type": "string"
          },
          {
            "rel": "string",
            "attribute": [
              {
                "displayValue": "string",
                "name": "string",
                "value": "string"
              },
              {
                "displayValue": "string",
                "name": "string",
                "value": "string"
              },
              {
                "displayValue": "string",
                "name": "string",
                "value": "string"
              },
              {
                "displayValue": "string",
                "name": "string",
                "value": "string"
              },
              {
                "displayValue": "string",
                "name": "string",
                "value": "string"
              },
              {
                "displayValue": "string",
                "name": "string",
                "value": "string"
              },
              {
                "displayValue": "string",
                "name": "string",
                "value": "string"
              },
              {
                "displayValue": "string",
                "name": "string",
                "value": "string"
              }
            ],
            "href": "string",
            "type": "string"
          },
          {
            "rel": "string",
            "attribute": [
              {
                "displayValue": "string",
                "name": "string",
                "value": "string"
              },
              {
                "displayValue": "string",
                "name": "string",
                "value": "string"
              },
              {
                "displayValue": "string",
                "name": "string",
                "value": "string"
              },
              {
                "displayValue": "string",
                "name": "string",
                "value": "string"
              },
              {
                "displayValue": "string",
                "name": "string",
                "value": "string"
              },
              {
                "displayValue": "string",
                "name": "string",
                "value": "string"
              },
              {
                "displayValue": "string",
                "name": "string",
                "value": "string"
              },
              {
                "displayValue": "string",
                "name": "string",
                "value": "string"
              },
              {
                "displayValue": "string",
                "name": "string",
                "value": "string"
              },
              {
                "displayValue": "string",
                "name": "string",
                "value": "string"
              }
            ],
            "href": "string",
            "type": "string"
          }
        ]
      }
    },
    {
      "principal": "string",
      "rights": "string",
      "href": "string",
      "relations": {
        "total": 8,
        "start": 9,
        "link": [
          {
            "rel": "string",
            "attribute": [
              {
                "displayValue": "string",
                "name": "string",
                "value": "string"
              },
              {
                "displayValue": "string",
                "name": "string",
                "value": "string"
              }
            ],
            "href": "string",
            "type": "string"
          },
          {
            "rel": "string",
            "attribute": [
              {
                "displayValue": "string",
                "name": "string",
                "value": "string"
              },
              {
                "displayValue": "string",
                "name": "string",
                "value": "string"
              },
              {
                "displayValue": "string",
                "name": "string",
                "value": "string"
              },
              {
                "displayValue": "string",
                "name": "string",
                "value": "string"
              },
              {
                "displayValue": "string",
                "name": "string",
                "value": "string"
              },
              {
                "displayValue": "string",
                "name": "string",
                "value": "string"
              }
            ],
            "href": "string",
            "type": "string"
          },
          {
            "rel": "string",
            "attribute": [
              {
                "displayValue": "string",
                "name": "string",
                "value": "string"
              },
              {
                "displayValue": "string",
                "name": "string",
                "value": "string"
              }
            ],
            "href": "string",
            "type": "string"
          },
          {
            "rel": "string",
            "attribute": [
              {
                "displayValue": "string",
                "name": "string",
                "value": "string"
              },
              {
                "displayValue": "string",
                "name": "string",
                "value": "string"
              },
              {
                "displayValue": "string",
                "name": "string",
                "value": "string"
              }
            ],
            "href": "string",
            "type": "string"
          }
        ]
      }
    },
    {
      "principal": "string",
      "rights": "string",
      "href": "string",
      "relations": {
        "total": 1,
        "start": 1,
        "link": [
          {
            "rel": "string",
            "attribute": [
              {
                "displayValue": "string",
                "name": "string",
                "value": "string"
              },
              {
                "displayValue": "string",
                "name": "string",
                "value": "string"
              }
            ],
            "href": "string",
            "type": "string"
          },
          {
            "rel": "string",
            "attribute": [
              {
                "displayValue": "string",
                "name": "string",
                "value": "string"
              },
              {
                "displayValue": "string",
                "name": "string",
                "value": "string"
              },
              {
                "displayValue": "string",
                "name": "string",
                "value": "string"
              },
              {
                "displayValue": "string",
                "name": "string",
                "value": "string"
              }
            ],
            "href": "string",
            "type": "string"
          },
          {
            "rel": "string",
            "attribute": [
              {
                "displayValue": "string",
                "name": "string",
                "value": "string"
              },
              {
                "displayValue": "string",
                "name": "string",
                "value": "string"
              },
              {
                "displayValue": "string",
                "name": "string",
                "value": "string"
              },
              {
                "displayValue": "string",
                "name": "string",
                "value": "string"
              },
              {
                "displayValue": "string",
                "name": "string",
                "value": "string"
              },
              {
                "displayValue": "string",
                "name": "string",
                "value": "string"
              },
              {
                "displayValue": "string",
                "name": "string",
                "value": "string"
              }
            ],
            "href": "string",
            "type": "string"
          },
          {
            "rel": "string",
            "attribute": [
              {
                "displayValue": "string",
                "name": "string",
                "value": "string"
              },
              {
                "displayValue": "string",
                "name": "string",
                "value": "string"
              },
              {
                "displayValue": "string",
                "name": "string",
                "value": "string"
              },
              {
                "displayValue": "string",
                "name": "string",
                "value": "string"
              },
              {
                "displayValue": "string",
                "name": "string",
                "value": "string"
              },
              {
                "displayValue": "string",
                "name": "string",
                "value": "string"
              },
              {
                "displayValue": "string",
                "name": "string",
                "value": "string"
              },
              {
                "displayValue": "string",
                "name": "string",
                "value": "string"
              },
              {
                "displayValue": "string",
                "name": "string",
                "value": "string"
              }
            ],
            "href": "string",
            "type": "string"
          },
          {
            "rel": "string",
            "attribute": [
              {
                "displayValue": "string",
                "name": "string",
                "value": "string"
              },
              {
                "displayValue": "string",
                "name": "string",
                "value": "string"
              },
              {
                "displayValue": "string",
                "name": "string",
                "value": "string"
              },
              {
                "displayValue": "string",
                "name": "string",
                "value": "string"
              },
              {
                "displayValue": "string",
                "name": "string",
                "value": "string"
              },
              {
                "displayValue": "string",
                "name": "string",
                "value": "string"
              },
              {
                "displayValue": "string",
                "name": "string",
                "value": "string"
              },
              {
                "displayValue": "string",
                "name": "string",
                "value": "string"
              }
            ],
            "href": "string",
            "type": "string"
          },
          {
            "rel": "string",
            "attribute": [
              {
                "displayValue": "string",
                "name": "string",
                "value": "string"
              },
              {
                "displayValue": "string",
                "name": "string",
                "value": "string"
              },
              {
                "displayValue": "string",
                "name": "string",
                "value": "string"
              },
              {
                "displayValue": "string",
                "name": "string",
                "value": "string"
              },
              {
                "displayValue": "string",
                "name": "string",
                "value": "string"
              },
              {
                "displayValue": "string",
                "name": "string",
                "value": "string"
              }
            ],
            "href": "string",
            "type": "string"
          }
        ]
      }
    },
    {
      "principal": "string",
      "rights": "string",
      "href": "string",
      "relations": {
        "total": 10,
        "start": 2,
        "link": [
          {
            "rel": "string",
            "attribute": [
              {
                "displayValue": "string",
                "name": "string",
                "value": "string"
              },
              {
                "displayValue": "string",
                "name": "string",
                "value": "string"
              },
              {
                "displayValue": "string",
                "name": "string",
                "value": "string"
              },
              {
                "displayValue": "string",
                "name": "string",
                "value": "string"
              },
              {
                "displayValue": "string",
                "name": "string",
                "value": "string"
              }
            ],
            "href": "string",
            "type": "string"
          },
          {
            "rel": "string",
            "attribute": [
              {
                "displayValue": "string",
                "name": "string",
                "value": "string"
              },
              {
                "displayValue": "string",
                "name": "string",
                "value": "string"
              },
              {
                "displayValue": "string",
                "name": "string",
                "value": "string"
              },
              {
                "displayValue": "string",
                "name": "string",
                "value": "string"
              },
              {
                "displayValue": "string",
                "name": "string",
                "value": "string"
              },
              {
                "displayValue": "string",
                "name": "string",
                "value": "string"
              },
              {
                "displayValue": "string",
                "name": "string",
                "value": "string"
              },
              {
                "displayValue": "string",
                "name": "string",
                "value": "string"
              },
              {
                "displayValue": "string",
                "name": "string",
                "value": "string"
              },
              {
                "displayValue": "string",
                "name": "string",
                "value": "string"
              }
            ],
            "href": "string",
            "type": "string"
          },
          {
            "rel": "string",
            "attribute": [
              {
                "displayValue": "string",
                "name": "string",
                "value": "string"
              },
              {
                "displayValue": "string",
                "name": "string",
                "value": "string"
              },
              {
                "displayValue": "string",
                "name": "string",
                "value": "string"
              },
              {
                "displayValue": "string",
                "name": "string",
                "value": "string"
              },
              {
                "displayValue": "string",
                "name": "string",
                "value": "string"
              },
              {
                "displayValue": "string",
                "name": "string",
                "value": "string"
              },
              {
                "displayValue": "string",
                "name": "string",
                "value": "string"
              },
              {
                "displayValue": "string",
                "name": "string",
                "value": "string"
              }
            ],
            "href": "string",
            "type": "string"
          },
          {
            "rel": "string",
            "attribute": [
              {
                "displayValue": "string",
                "name": "string",
                "value": "string"
              },
              {
                "displayValue": "string",
                "name": "string",
                "value": "string"
              }
            ],
            "href": "string",
            "type": "string"
          },
          {
            "rel": "string",
            "attribute": [
              {
                "displayValue": "string",
                "name": "string",
                "value": "string"
              },
              {
                "displayValue": "string",
                "name": "string",
                "value": "string"
              },
              {
                "displayValue": "string",
                "name": "string",
                "value": "string"
              },
              {
                "displayValue": "string",
                "name": "string",
                "value": "string"
              },
              {
                "displayValue": "string",
                "name": "string",
                "value": "string"
              }
            ],
            "href": "string",
            "type": "string"
          },
          {
            "rel": "string",
            "attribute": [
              {
                "displayValue": "string",
                "name": "string",
                "value": "string"
              },
              {
                "displayValue": "string",
                "name": "string",
                "value": "string"
              },
              {
                "displayValue": "string",
                "name": "string",
                "value": "string"
              },
              {
                "displayValue": "string",
                "name": "string",
                "value": "string"
              },
              {
                "displayValue": "string",
                "name": "string",
                "value": "string"
              }
            ],
            "href": "string",
            "type": "string"
          }
        ]
      }
    },
    {
      "principal": "string",
      "rights": "string",
      "href": "string",
      "relations": {
        "total": 7,
        "start": 10,
        "link": [
          {
            "rel": "string",
            "attribute": [
              {
                "displayValue": "string",
                "name": "string",
                "value": "string"
              },
              {
                "displayValue": "string",
                "name": "string",
                "value": "string"
              },
              {
                "displayValue": "string",
                "name": "string",
                "value": "string"
              },
              {
                "displayValue": "string",
                "name": "string",
                "value": "string"
              },
              {
                "displayValue": "string",
                "name": "string",
                "value": "string"
              }
            ],
            "href": "string",
            "type": "string"
          },
          {
            "rel": "string",
            "attribute": [
              {
                "displayValue": "string",
                "name": "string",
                "value": "string"
              },
              {
                "displayValue": "string",
                "name": "string",
                "value": "string"
              },
              {
                "displayValue": "string",
                "name": "string",
                "value": "string"
              },
              {
                "displayValue": "string",
                "name": "string",
                "value": "string"
              },
              {
                "displayValue": "string",
                "name": "string",
                "value": "string"
              },
              {
                "displayValue": "string",
                "name": "string",
                "value": "string"
              },
              {
                "displayValue": "string",
                "name": "string",
                "value": "string"
              }
            ],
            "href": "string",
            "type": "string"
          },
          {
            "rel": "string",
            "attribute": [
              {
                "displayValue": "string",
                "name": "string",
                "value": "string"
              },
              {
                "displayValue": "string",
                "name": "string",
                "value": "string"
              },
              {
                "displayValue": "string",
                "name": "string",
                "value": "string"
              },
              {
                "displayValue": "string",
                "name": "string",
                "value": "string"
              },
              {
                "displayValue": "string",
                "name": "string",
                "value": "string"
              },
              {
                "displayValue": "string",
                "name": "string",
                "value": "string"
              },
              {
                "displayValue": "string",
                "name": "string",
                "value": "string"
              }
            ],
            "href": "string",
            "type": "string"
          },
          {
            "rel": "string",
            "attribute": [
              {
                "displayValue": "string",
                "name": "string",
                "value": "string"
              }
            ],
            "href": "string",
            "type": "string"
          },
          {
            "rel": "string",
            "attribute": [
              {
                "displayValue": "string",
                "name": "string",
                "value": "string"
              },
              {
                "displayValue": "string",
                "name": "string",
                "value": "string"
              },
              {
                "displayValue": "string",
                "name": "string",
                "value": "string"
              },
              {
                "displayValue": "string",
                "name": "string",
                "value": "string"
              }
            ],
            "href": "string",
            "type": "string"
          },
          {
            "rel": "string",
            "attribute": [
              {
                "displayValue": "string",
                "name": "string",
                "value": "string"
              },
              {
                "displayValue": "string",
                "name": "string",
                "value": "string"
              }
            ],
            "href": "string",
            "type": "string"
          },
          {
            "rel": "string",
            "attribute": [
              {
                "displayValue": "string",
                "name": "string",
                "value": "string"
              },
              {
                "displayValue": "string",
                "name": "string",
                "value": "string"
              },
              {
                "displayValue": "string",
                "name": "string",
                "value": "string"
              }
            ],
            "href": "string",
            "type": "string"
          },
          {
            "rel": "string",
            "attribute": [
              {
                "displayValue": "string",
                "name": "string",
                "value": "string"
              },
              {
                "displayValue": "string",
                "name": "string",
                "value": "string"
              },
              {
                "displayValue": "string",
                "name": "string",
                "value": "string"
              },
              {
                "displayValue": "string",
                "name": "string",
                "value": "string"
              },
              {
                "displayValue": "string",
                "name": "string",
                "value": "string"
              },
              {
                "displayValue": "string",
                "name": "string",
                "value": "string"
              },
              {
                "displayValue": "string",
                "name": "string",
                "value": "string"
              },
              {
                "displayValue": "string",
                "name": "string",
                "value": "string"
              },
              {
                "displayValue": "string",
                "name": "string",
                "value": "string"
              }
            ],
            "href": "string",
            "type": "string"
          },
          {
            "rel": "string",
            "attribute": [
              {
                "displayValue": "string",
                "name": "string",
                "value": "string"
              },
              {
                "displayValue": "string",
                "name": "string",
                "value": "string"
              },
              {
                "displayValue": "string",
                "name": "string",
                "value": "string"
              },
              {
                "displayValue": "string",
                "name": "string",
                "value": "string"
              },
              {
                "displayValue": "string",
                "name": "string",
                "value": "string"
              },
              {
                "displayValue": "string",
                "name": "string",
                "value": "string"
              },
              {
                "displayValue": "string",
                "name": "string",
                "value": "string"
              },
              {
                "displayValue": "string",
                "name": "string",
                "value": "string"
              },
              {
                "displayValue": "string",
                "name": "string",
                "value": "string"
              }
            ],
            "href": "string",
            "type": "string"
          },
          {
            "rel": "string",
            "attribute": [
              {
                "displayValue": "string",
                "name": "string",
                "value": "string"
              }
            ],
            "href": "string",
            "type": "string"
          }
        ]
      }
    }
  ]
}