{
  "actions": [
    {
      "name": "getServerConfiguration",
      "protocol": "REST",
      "method": "GET",
      "entitypath": "{base_path}/{version}/server-configuration?{query}",
      "requestSchema": "schema.json",
      "responseSchema": "schema.json",
      "timeout": 0,
      "sendEmpty": false,
      "sendGetBody": false,
      "requestDatatype": "JSON",
      "responseDatatype": "JSON",
      "headers": {},
      "responseObjects": [
        {
          "type": "default",
          "key": "",
          "mockFile": "mockdatafiles/getServerConfiguration-default.json"
        }
      ]
    },
    {
      "name": "importServerConfiguration",
      "protocol": "REST",
      "method": "POST",
      "entitypath": "{base_path}/{version}/server-configuration?{query}",
      "requestSchema": "schema.json",
      "responseSchema": "schema.json",
      "timeout": 0,
      "sendEmpty": false,
      "requestDatatype": "JSON",
      "responseDatatype": "JSON",
      "headers": {},
      "responseObjects": [
        {
          "type": "default",
          "key": "",
          "mockFile": ""
        }
      ]
    },
    {
      "name": "getScriptingApi",
      "protocol": "REST",
      "method": "GET",
      "entitypath": "{base_path}/{version}/server-configuration/api?{query}",
      "requestSchema": "schema.json",
      "responseSchema": "schema.json",
      "timeout": 0,
      "sendEmpty": false,
      "sendGetBody": false,
      "requestDatatype": "JSON",
      "responseDatatype": "JSON",
      "headers": {},
      "responseObjects": [
        {
          "type": "default",
          "key": "",
          "mockFile": "mockdatafiles/getScriptingApi-default.json"
        }
      ]
    },
    {
      "name": "getO11nTypes",
      "protocol": "REST",
      "method": "GET",
      "entitypath": "{base_path}/{version}/server-configuration/types?{query}",
      "requestSchema": "schema.json",
      "responseSchema": "schema.json",
      "timeout": 0,
      "sendEmpty": false,
      "sendGetBody": false,
      "requestDatatype": "JSON",
      "responseDatatype": "JSON",
      "headers": {},
      "responseObjects": [
        {
          "type": "default",
          "key": "",
          "mockFile": "mockdatafiles/getO11nTypes-default.json"
        }
      ]
    },
    {
      "name": "getCategoryDetails",
      "protocol": "REST",
      "method": "GET",
      "entitypath": "{base_path}/{version}/server-configuration/api/category/{pathv1}?{query}",
      "requestSchema": "schema.json",
      "responseSchema": "schema.json",
      "timeout": 0,
      "sendEmpty": false,
      "sendGetBody": false,
      "requestDatatype": "JSON",
      "responseDatatype": "JSON",
      "headers": {},
      "responseObjects": [
        {
          "type": "default",
          "key": "",
          "mockFile": "mockdatafiles/getCategoryDetails-default.json"
        }
      ]
    },
    {
      "name": "getPluginApi",
      "protocol": "REST",
      "method": "GET",
      "entitypath": "{base_path}/{version}/server-configuration/api/plugins/{pathv1}/{pathv2}/{pathv3}?{query}",
      "requestSchema": "schema.json",
      "responseSchema": "schema.json",
      "timeout": 0,
      "sendEmpty": false,
      "sendGetBody": false,
      "requestDatatype": "JSON",
      "responseDatatype": "JSON",
      "headers": {},
      "responseObjects": [
        {
          "type": "default",
          "key": "",
          "mockFile": "mockdatafiles/getPluginApi-default.json"
        }
      ]
    },
    {
      "name": "getSettings",
      "protocol": "REST",
      "method": "GET",
      "entitypath": "{base_path}/{version}/server-configuration/settings?{query}",
      "requestSchema": "schema.json",
      "responseSchema": "schema.json",
      "timeout": 0,
      "sendEmpty": false,
      "sendGetBody": false,
      "requestDatatype": "JSON",
      "responseDatatype": "JSON",
      "headers": {},
      "responseObjects": [
        {
          "type": "default",
          "key": "",
          "mockFile": ""
        }
      ]
    }
  ]
}