{
  "tag": [
    {
      "owner": "string",
      "name": "string",
      "global": true,
      "href": "string",
      "objectHref": "string",
      "relations": {
        "total": 1,
        "start": 9,
        "link": [
          {
            "rel": "string",
            "attribute": [
              {
                "displayValue": "string",
                "name": "string",
                "value": "string"
              },
              {
                "displayValue": "string",
                "name": "string",
                "value": "string"
              },
              {
                "displayValue": "string",
                "name": "string",
                "value": "string"
              },
              {
                "displayValue": "string",
                "name": "string",
                "value": "string"
              },
              {
                "displayValue": "string",
                "name": "string",
                "value": "string"
              },
              {
                "displayValue": "string",
                "name": "string",
                "value": "string"
              },
              {
                "displayValue": "string",
                "name": "string",
                "value": "string"
              },
              {
                "displayValue": "string",
                "name": "string",
                "value": "string"
              },
              {
                "displayValue": "string",
                "name": "string",
                "value": "string"
              }
            ],
            "href": "string",
            "type": "string"
          },
          {
            "rel": "string",
            "attribute": [
              {
                "displayValue": "string",
                "name": "string",
                "value": "string"
              },
              {
                "displayValue": "string",
                "name": "string",
                "value": "string"
              },
              {
                "displayValue": "string",
                "name": "string",
                "value": "string"
              },
              {
                "displayValue": "string",
                "name": "string",
                "value": "string"
              },
              {
                "displayValue": "string",
                "name": "string",
                "value": "string"
              },
              {
                "displayValue": "string",
                "name": "string",
                "value": "string"
              },
              {
                "displayValue": "string",
                "name": "string",
                "value": "string"
              },
              {
                "displayValue": "string",
                "name": "string",
                "value": "string"
              },
              {
                "displayValue": "string",
                "name": "string",
                "value": "string"
              }
            ],
            "href": "string",
            "type": "string"
          },
          {
            "rel": "string",
            "attribute": [
              {
                "displayValue": "string",
                "name": "string",
                "value": "string"
              },
              {
                "displayValue": "string",
                "name": "string",
                "value": "string"
              },
              {
                "displayValue": "string",
                "name": "string",
                "value": "string"
              }
            ],
            "href": "string",
            "type": "string"
          },
          {
            "rel": "string",
            "attribute": [
              {
                "displayValue": "string",
                "name": "string",
                "value": "string"
              },
              {
                "displayValue": "string",
                "name": "string",
                "value": "string"
              },
              {
                "displayValue": "string",
                "name": "string",
                "value": "string"
              },
              {
                "displayValue": "string",
                "name": "string",
                "value": "string"
              },
              {
                "displayValue": "string",
                "name": "string",
                "value": "string"
              },
              {
                "displayValue": "string",
                "name": "string",
                "value": "string"
              },
              {
                "displayValue": "string",
                "name": "string",
                "value": "string"
              }
            ],
            "href": "string",
            "type": "string"
          }
        ]
      },
      "value": "string"
    },
    {
      "owner": "string",
      "name": "string",
      "global": true,
      "href": "string",
      "objectHref": "string",
      "relations": {
        "total": 6,
        "start": 8,
        "link": [
          {
            "rel": "string",
            "attribute": [
              {
                "displayValue": "string",
                "name": "string",
                "value": "string"
              }
            ],
            "href": "string",
            "type": "string"
          }
        ]
      },
      "value": "string"
    },
    {
      "owner": "string",
      "name": "string",
      "global": false,
      "href": "string",
      "objectHref": "string",
      "relations": {
        "total": 1,
        "start": 8,
        "link": [
          {
            "rel": "string",
            "attribute": [
              {
                "displayValue": "string",
                "name": "string",
                "value": "string"
              },
              {
                "displayValue": "string",
                "name": "string",
                "value": "string"
              },
              {
                "displayValue": "string",
                "name": "string",
                "value": "string"
              },
              {
                "displayValue": "string",
                "name": "string",
                "value": "string"
              },
              {
                "displayValue": "string",
                "name": "string",
                "value": "string"
              },
              {
                "displayValue": "string",
                "name": "string",
                "value": "string"
              },
              {
                "displayValue": "string",
                "name": "string",
                "value": "string"
              },
              {
                "displayValue": "string",
                "name": "string",
                "value": "string"
              },
              {
                "displayValue": "string",
                "name": "string",
                "value": "string"
              }
            ],
            "href": "string",
            "type": "string"
          },
          {
            "rel": "string",
            "attribute": [
              {
                "displayValue": "string",
                "name": "string",
                "value": "string"
              },
              {
                "displayValue": "string",
                "name": "string",
                "value": "string"
              },
              {
                "displayValue": "string",
                "name": "string",
                "value": "string"
              },
              {
                "displayValue": "string",
                "name": "string",
                "value": "string"
              },
              {
                "displayValue": "string",
                "name": "string",
                "value": "string"
              },
              {
                "displayValue": "string",
                "name": "string",
                "value": "string"
              },
              {
                "displayValue": "string",
                "name": "string",
                "value": "string"
              },
              {
                "displayValue": "string",
                "name": "string",
                "value": "string"
              }
            ],
            "href": "string",
            "type": "string"
          },
          {
            "rel": "string",
            "attribute": [
              {
                "displayValue": "string",
                "name": "string",
                "value": "string"
              },
              {
                "displayValue": "string",
                "name": "string",
                "value": "string"
              },
              {
                "displayValue": "string",
                "name": "string",
                "value": "string"
              },
              {
                "displayValue": "string",
                "name": "string",
                "value": "string"
              },
              {
                "displayValue": "string",
                "name": "string",
                "value": "string"
              }
            ],
            "href": "string",
            "type": "string"
          }
        ]
      },
      "value": "string"
    },
    {
      "owner": "string",
      "name": "string",
      "global": false,
      "href": "string",
      "objectHref": "string",
      "relations": {
        "total": 7,
        "start": 3,
        "link": [
          {
            "rel": "string",
            "attribute": [
              {
                "displayValue": "string",
                "name": "string",
                "value": "string"
              },
              {
                "displayValue": "string",
                "name": "string",
                "value": "string"
              },
              {
                "displayValue": "string",
                "name": "string",
                "value": "string"
              },
              {
                "displayValue": "string",
                "name": "string",
                "value": "string"
              },
              {
                "displayValue": "string",
                "name": "string",
                "value": "string"
              },
              {
                "displayValue": "string",
                "name": "string",
                "value": "string"
              }
            ],
            "href": "string",
            "type": "string"
          },
          {
            "rel": "string",
            "attribute": [
              {
                "displayValue": "string",
                "name": "string",
                "value": "string"
              },
              {
                "displayValue": "string",
                "name": "string",
                "value": "string"
              },
              {
                "displayValue": "string",
                "name": "string",
                "value": "string"
              },
              {
                "displayValue": "string",
                "name": "string",
                "value": "string"
              },
              {
                "displayValue": "string",
                "name": "string",
                "value": "string"
              },
              {
                "displayValue": "string",
                "name": "string",
                "value": "string"
              },
              {
                "displayValue": "string",
                "name": "string",
                "value": "string"
              },
              {
                "displayValue": "string",
                "name": "string",
                "value": "string"
              },
              {
                "displayValue": "string",
                "name": "string",
                "value": "string"
              }
            ],
            "href": "string",
            "type": "string"
          },
          {
            "rel": "string",
            "attribute": [
              {
                "displayValue": "string",
                "name": "string",
                "value": "string"
              }
            ],
            "href": "string",
            "type": "string"
          },
          {
            "rel": "string",
            "attribute": [
              {
                "displayValue": "string",
                "name": "string",
                "value": "string"
              },
              {
                "displayValue": "string",
                "name": "string",
                "value": "string"
              },
              {
                "displayValue": "string",
                "name": "string",
                "value": "string"
              },
              {
                "displayValue": "string",
                "name": "string",
                "value": "string"
              },
              {
                "displayValue": "string",
                "name": "string",
                "value": "string"
              }
            ],
            "href": "string",
            "type": "string"
          },
          {
            "rel": "string",
            "attribute": [
              {
                "displayValue": "string",
                "name": "string",
                "value": "string"
              },
              {
                "displayValue": "string",
                "name": "string",
                "value": "string"
              }
            ],
            "href": "string",
            "type": "string"
          },
          {
            "rel": "string",
            "attribute": [
              {
                "displayValue": "string",
                "name": "string",
                "value": "string"
              },
              {
                "displayValue": "string",
                "name": "string",
                "value": "string"
              }
            ],
            "href": "string",
            "type": "string"
          }
        ]
      },
      "value": "string"
    },
    {
      "owner": "string",
      "name": "string",
      "global": false,
      "href": "string",
      "objectHref": "string",
      "relations": {
        "total": 7,
        "start": 6,
        "link": [
          {
            "rel": "string",
            "attribute": [
              {
                "displayValue": "string",
                "name": "string",
                "value": "string"
              },
              {
                "displayValue": "string",
                "name": "string",
                "value": "string"
              },
              {
                "displayValue": "string",
                "name": "string",
                "value": "string"
              },
              {
                "displayValue": "string",
                "name": "string",
                "value": "string"
              },
              {
                "displayValue": "string",
                "name": "string",
                "value": "string"
              },
              {
                "displayValue": "string",
                "name": "string",
                "value": "string"
              },
              {
                "displayValue": "string",
                "name": "string",
                "value": "string"
              },
              {
                "displayValue": "string",
                "name": "string",
                "value": "string"
              }
            ],
            "href": "string",
            "type": "string"
          },
          {
            "rel": "string",
            "attribute": [
              {
                "displayValue": "string",
                "name": "string",
                "value": "string"
              },
              {
                "displayValue": "string",
                "name": "string",
                "value": "string"
              },
              {
                "displayValue": "string",
                "name": "string",
                "value": "string"
              }
            ],
            "href": "string",
            "type": "string"
          },
          {
            "rel": "string",
            "attribute": [
              {
                "displayValue": "string",
                "name": "string",
                "value": "string"
              },
              {
                "displayValue": "string",
                "name": "string",
                "value": "string"
              },
              {
                "displayValue": "string",
                "name": "string",
                "value": "string"
              },
              {
                "displayValue": "string",
                "name": "string",
                "value": "string"
              },
              {
                "displayValue": "string",
                "name": "string",
                "value": "string"
              },
              {
                "displayValue": "string",
                "name": "string",
                "value": "string"
              },
              {
                "displayValue": "string",
                "name": "string",
                "value": "string"
              }
            ],
            "href": "string",
            "type": "string"
          },
          {
            "rel": "string",
            "attribute": [
              {
                "displayValue": "string",
                "name": "string",
                "value": "string"
              },
              {
                "displayValue": "string",
                "name": "string",
                "value": "string"
              },
              {
                "displayValue": "string",
                "name": "string",
                "value": "string"
              },
              {
                "displayValue": "string",
                "name": "string",
                "value": "string"
              },
              {
                "displayValue": "string",
                "name": "string",
                "value": "string"
              },
              {
                "displayValue": "string",
                "name": "string",
                "value": "string"
              },
              {
                "displayValue": "string",
                "name": "string",
                "value": "string"
              }
            ],
            "href": "string",
            "type": "string"
          }
        ]
      },
      "value": "string"
    },
    {
      "owner": "string",
      "name": "string",
      "global": false,
      "href": "string",
      "objectHref": "string",
      "relations": {
        "total": 1,
        "start": 6,
        "link": [
          {
            "rel": "string",
            "attribute": [
              {
                "displayValue": "string",
                "name": "string",
                "value": "string"
              },
              {
                "displayValue": "string",
                "name": "string",
                "value": "string"
              },
              {
                "displayValue": "string",
                "name": "string",
                "value": "string"
              },
              {
                "displayValue": "string",
                "name": "string",
                "value": "string"
              },
              {
                "displayValue": "string",
                "name": "string",
                "value": "string"
              }
            ],
            "href": "string",
            "type": "string"
          },
          {
            "rel": "string",
            "attribute": [
              {
                "displayValue": "string",
                "name": "string",
                "value": "string"
              },
              {
                "displayValue": "string",
                "name": "string",
                "value": "string"
              },
              {
                "displayValue": "string",
                "name": "string",
                "value": "string"
              }
            ],
            "href": "string",
            "type": "string"
          },
          {
            "rel": "string",
            "attribute": [
              {
                "displayValue": "string",
                "name": "string",
                "value": "string"
              },
              {
                "displayValue": "string",
                "name": "string",
                "value": "string"
              },
              {
                "displayValue": "string",
                "name": "string",
                "value": "string"
              },
              {
                "displayValue": "string",
                "name": "string",
                "value": "string"
              },
              {
                "displayValue": "string",
                "name": "string",
                "value": "string"
              },
              {
                "displayValue": "string",
                "name": "string",
                "value": "string"
              },
              {
                "displayValue": "string",
                "name": "string",
                "value": "string"
              },
              {
                "displayValue": "string",
                "name": "string",
                "value": "string"
              },
              {
                "displayValue": "string",
                "name": "string",
                "value": "string"
              }
            ],
            "href": "string",
            "type": "string"
          },
          {
            "rel": "string",
            "attribute": [
              {
                "displayValue": "string",
                "name": "string",
                "value": "string"
              },
              {
                "displayValue": "string",
                "name": "string",
                "value": "string"
              },
              {
                "displayValue": "string",
                "name": "string",
                "value": "string"
              },
              {
                "displayValue": "string",
                "name": "string",
                "value": "string"
              },
              {
                "displayValue": "string",
                "name": "string",
                "value": "string"
              }
            ],
            "href": "string",
            "type": "string"
          },
          {
            "rel": "string",
            "attribute": [
              {
                "displayValue": "string",
                "name": "string",
                "value": "string"
              },
              {
                "displayValue": "string",
                "name": "string",
                "value": "string"
              },
              {
                "displayValue": "string",
                "name": "string",
                "value": "string"
              },
              {
                "displayValue": "string",
                "name": "string",
                "value": "string"
              },
              {
                "displayValue": "string",
                "name": "string",
                "value": "string"
              },
              {
                "displayValue": "string",
                "name": "string",
                "value": "string"
              },
              {
                "displayValue": "string",
                "name": "string",
                "value": "string"
              },
              {
                "displayValue": "string",
                "name": "string",
                "value": "string"
              },
              {
                "displayValue": "string",
                "name": "string",
                "value": "string"
              },
              {
                "displayValue": "string",
                "name": "string",
                "value": "string"
              }
            ],
            "href": "string",
            "type": "string"
          },
          {
            "rel": "string",
            "attribute": [
              {
                "displayValue": "string",
                "name": "string",
                "value": "string"
              },
              {
                "displayValue": "string",
                "name": "string",
                "value": "string"
              },
              {
                "displayValue": "string",
                "name": "string",
                "value": "string"
              },
              {
                "displayValue": "string",
                "name": "string",
                "value": "string"
              },
              {
                "displayValue": "string",
                "name": "string",
                "value": "string"
              },
              {
                "displayValue": "string",
                "name": "string",
                "value": "string"
              },
              {
                "displayValue": "string",
                "name": "string",
                "value": "string"
              },
              {
                "displayValue": "string",
                "name": "string",
                "value": "string"
              },
              {
                "displayValue": "string",
                "name": "string",
                "value": "string"
              },
              {
                "displayValue": "string",
                "name": "string",
                "value": "string"
              }
            ],
            "href": "string",
            "type": "string"
          },
          {
            "rel": "string",
            "attribute": [
              {
                "displayValue": "string",
                "name": "string",
                "value": "string"
              },
              {
                "displayValue": "string",
                "name": "string",
                "value": "string"
              },
              {
                "displayValue": "string",
                "name": "string",
                "value": "string"
              },
              {
                "displayValue": "string",
                "name": "string",
                "value": "string"
              }
            ],
            "href": "string",
            "type": "string"
          },
          {
            "rel": "string",
            "attribute": [
              {
                "displayValue": "string",
                "name": "string",
                "value": "string"
              },
              {
                "displayValue": "string",
                "name": "string",
                "value": "string"
              },
              {
                "displayValue": "string",
                "name": "string",
                "value": "string"
              },
              {
                "displayValue": "string",
                "name": "string",
                "value": "string"
              },
              {
                "displayValue": "string",
                "name": "string",
                "value": "string"
              },
              {
                "displayValue": "string",
                "name": "string",
                "value": "string"
              },
              {
                "displayValue": "string",
                "name": "string",
                "value": "string"
              },
              {
                "displayValue": "string",
                "name": "string",
                "value": "string"
              }
            ],
            "href": "string",
            "type": "string"
          },
          {
            "rel": "string",
            "attribute": [
              {
                "displayValue": "string",
                "name": "string",
                "value": "string"
              },
              {
                "displayValue": "string",
                "name": "string",
                "value": "string"
              }
            ],
            "href": "string",
            "type": "string"
          },
          {
            "rel": "string",
            "attribute": [
              {
                "displayValue": "string",
                "name": "string",
                "value": "string"
              },
              {
                "displayValue": "string",
                "name": "string",
                "value": "string"
              },
              {
                "displayValue": "string",
                "name": "string",
                "value": "string"
              },
              {
                "displayValue": "string",
                "name": "string",
                "value": "string"
              },
              {
                "displayValue": "string",
                "name": "string",
                "value": "string"
              },
              {
                "displayValue": "string",
                "name": "string",
                "value": "string"
              },
              {
                "displayValue": "string",
                "name": "string",
                "value": "string"
              },
              {
                "displayValue": "string",
                "name": "string",
                "value": "string"
              }
            ],
            "href": "string",
            "type": "string"
          }
        ]
      },
      "value": "string"
    },
    {
      "owner": "string",
      "name": "string",
      "global": true,
      "href": "string",
      "objectHref": "string",
      "relations": {
        "total": 10,
        "start": 4,
        "link": [
          {
            "rel": "string",
            "attribute": [
              {
                "displayValue": "string",
                "name": "string",
                "value": "string"
              },
              {
                "displayValue": "string",
                "name": "string",
                "value": "string"
              },
              {
                "displayValue": "string",
                "name": "string",
                "value": "string"
              },
              {
                "displayValue": "string",
                "name": "string",
                "value": "string"
              }
            ],
            "href": "string",
            "type": "string"
          },
          {
            "rel": "string",
            "attribute": [
              {
                "displayValue": "string",
                "name": "string",
                "value": "string"
              },
              {
                "displayValue": "string",
                "name": "string",
                "value": "string"
              },
              {
                "displayValue": "string",
                "name": "string",
                "value": "string"
              },
              {
                "displayValue": "string",
                "name": "string",
                "value": "string"
              },
              {
                "displayValue": "string",
                "name": "string",
                "value": "string"
              },
              {
                "displayValue": "string",
                "name": "string",
                "value": "string"
              },
              {
                "displayValue": "string",
                "name": "string",
                "value": "string"
              },
              {
                "displayValue": "string",
                "name": "string",
                "value": "string"
              },
              {
                "displayValue": "string",
                "name": "string",
                "value": "string"
              },
              {
                "displayValue": "string",
                "name": "string",
                "value": "string"
              }
            ],
            "href": "string",
            "type": "string"
          },
          {
            "rel": "string",
            "attribute": [
              {
                "displayValue": "string",
                "name": "string",
                "value": "string"
              }
            ],
            "href": "string",
            "type": "string"
          },
          {
            "rel": "string",
            "attribute": [
              {
                "displayValue": "string",
                "name": "string",
                "value": "string"
              },
              {
                "displayValue": "string",
                "name": "string",
                "value": "string"
              },
              {
                "displayValue": "string",
                "name": "string",
                "value": "string"
              },
              {
                "displayValue": "string",
                "name": "string",
                "value": "string"
              }
            ],
            "href": "string",
            "type": "string"
          },
          {
            "rel": "string",
            "attribute": [
              {
                "displayValue": "string",
                "name": "string",
                "value": "string"
              },
              {
                "displayValue": "string",
                "name": "string",
                "value": "string"
              },
              {
                "displayValue": "string",
                "name": "string",
                "value": "string"
              }
            ],
            "href": "string",
            "type": "string"
          },
          {
            "rel": "string",
            "attribute": [
              {
                "displayValue": "string",
                "name": "string",
                "value": "string"
              },
              {
                "displayValue": "string",
                "name": "string",
                "value": "string"
              },
              {
                "displayValue": "string",
                "name": "string",
                "value": "string"
              },
              {
                "displayValue": "string",
                "name": "string",
                "value": "string"
              },
              {
                "displayValue": "string",
                "name": "string",
                "value": "string"
              },
              {
                "displayValue": "string",
                "name": "string",
                "value": "string"
              },
              {
                "displayValue": "string",
                "name": "string",
                "value": "string"
              },
              {
                "displayValue": "string",
                "name": "string",
                "value": "string"
              },
              {
                "displayValue": "string",
                "name": "string",
                "value": "string"
              },
              {
                "displayValue": "string",
                "name": "string",
                "value": "string"
              }
            ],
            "href": "string",
            "type": "string"
          }
        ]
      },
      "value": "string"
    },
    {
      "owner": "string",
      "name": "string",
      "global": false,
      "href": "string",
      "objectHref": "string",
      "relations": {
        "total": 4,
        "start": 4,
        "link": [
          {
            "rel": "string",
            "attribute": [
              {
                "displayValue": "string",
                "name": "string",
                "value": "string"
              },
              {
                "displayValue": "string",
                "name": "string",
                "value": "string"
              },
              {
                "displayValue": "string",
                "name": "string",
                "value": "string"
              },
              {
                "displayValue": "string",
                "name": "string",
                "value": "string"
              },
              {
                "displayValue": "string",
                "name": "string",
                "value": "string"
              }
            ],
            "href": "string",
            "type": "string"
          }
        ]
      },
      "value": "string"
    }
  ]
}