{
  "protectedResources": [
    {
      "id": "string",
      "type": "string"
    },
    {
      "id": "string",
      "type": "string"
    },
    {
      "id": "string",
      "type": "string"
    },
    {
      "id": "string",
      "type": "string"
    }
  ],
  "authorizedEntities": [
    {
      "role": "MEMBER",
      "domain": "string",
      "name": "string",
      "id": "string",
      "type": "GROUP"
    },
    {
      "role": "MEMBER",
      "domain": "string",
      "name": "string",
      "id": "string",
      "type": "USER"
    },
    {
      "role": "MEMBER",
      "domain": "string",
      "name": "string",
      "id": "string",
      "type": "GROUP"
    },
    {
      "role": "ADMINISTRTATOR",
      "domain": "string",
      "name": "string",
      "id": "string",
      "type": "USER"
    },
    {
      "role": "MEMBER",
      "domain": "string",
      "name": "string",
      "id": "string",
      "type": "GROUP"
    }
  ],
  "description": "string",
  "id": "string",
  "label": "string"
}