{
  "config-entry": [
    {
      "plugin": false,
      "data": "string",
      "displayName": "string",
      "name": "string",
      "tooltip": "string",
      "description": "string",
      "remote": false,
      "title": "string",
      "enabled": false,
      "dependencies": "string"
    },
    {
      "plugin": false,
      "data": "string",
      "displayName": "string",
      "name": "string",
      "tooltip": "string",
      "description": "string",
      "remote": false,
      "title": "string",
      "enabled": false,
      "dependencies": "string"
    },
    {
      "plugin": false,
      "data": "string",
      "displayName": "string",
      "name": "string",
      "tooltip": "string",
      "description": "string",
      "remote": true,
      "title": "string",
      "enabled": true,
      "dependencies": "string"
    },
    {
      "plugin": false,
      "data": "string",
      "displayName": "string",
      "name": "string",
      "tooltip": "string",
      "description": "string",
      "remote": false,
      "title": "string",
      "enabled": true,
      "dependencies": "string"
    },
    {
      "plugin": false,
      "data": "string",
      "displayName": "string",
      "name": "string",
      "tooltip": "string",
      "description": "string",
      "remote": false,
      "title": "string",
      "enabled": true,
      "dependencies": "string"
    },
    {
      "plugin": true,
      "data": "string",
      "displayName": "string",
      "name": "string",
      "tooltip": "string",
      "description": "string",
      "remote": false,
      "title": "string",
      "enabled": true,
      "dependencies": "string"
    },
    {
      "plugin": false,
      "data": "string",
      "displayName": "string",
      "name": "string",
      "tooltip": "string",
      "description": "string",
      "remote": false,
      "title": "string",
      "enabled": true,
      "dependencies": "string"
    }
  ]
}