{
  "count": "2",
  "errorCode": "0",
  "offset": "1",
  "totalCount": "2",
  "items": [
    {
      "type": "file",
      "id": "DB4C832D0F144C0DD6310F451212FF6185DE5A6F9E67",
      "name": "textData13.txt",
      "parentID": "F9363F588099E137C5B2939E1212FF6185DE5A6F9E67",
      "createdTime": "2015-12-07T23:19:13Z",
      "modifiedTime": "2015-12-07T23:19:13Z",
      "createdBy": {
        "displayName": "User AA",
        "id": "U0EAA20910FAF3052ACB79E4T00000000001",
        "loginName": "userAALoginName",
        "type": "user"
      },
      "ownedBy": {
        "displayName": "User AA",
        "id": "U0EAA20910FAF3052ACB79E4T00000000001",
        "loginName": "userAALoginName",
        "type": "user"
      },
      "modifiedBy": {
        "displayName": "User AA",
        "id": "U0EAA20910FAF3052ACB79E4T00000000001",
        "loginName": "userAALoginName",
        "type": "user"
      },
      "metadata": {
        "items": [
          {
            "name": "MyMetaCollection",
            "fields": {
              "items": [
                {
                  "name": "IntField",
                  "type": "integer",
                  "value": "246"
                },
                {
                  "name": "DateField",
                  "type": "date",
                  "value": "2019-02-22T17:03:00.000Z"
                }
              ]
            }
          }
        ]
      },
      "size": "38",
      "version": "1"
    },
    {
      "type": "file",
      "id": "D242D99558418023F547247DB5D17B95F470BB4C11B8",
      "name": "textData15.txt",
      "parentID": "F9363F588099E137C5B2939E1212FF6185DE5A6F9E67",
      "createdTime": "2015-12-09T20:51:53Z",
      "modifiedTime": "2015-12-09T20:51:53Z",
      "createdBy": {
        "displayName": "User AA",
        "id": "U0EAA20910FAF3052ACB79E4T00000000001",
        "loginName": "userAALoginName",
        "type": "user"
      },
      "ownedBy": {
        "displayName": "User AA",
        "id": "U0EAA20910FAF3052ACB79E4T00000000001",
        "loginName": "userAALoginName",
        "type": "user"
      },
      "modifiedBy": {
        "displayName": "User AA",
        "id": "U0EAA20910FAF3052ACB79E4T00000000001",
        "loginName": "userAALoginName",
        "type": "user"
      },
      "metadata": {
        "items": []
      },
      "size": "50"
    }
  ]
}