{
  "items": [
    {
      "version": "1.2",
      "lifecycle": "active",
      "isLatest": "true",
      "catalog": {
        "links": [
          {
            "ref": "canonical",
            "href": "https://www.example.com/documents/api/1.2/metadata-catalog"
          }
        ]
      },
      "links": [
        {
          "ref": "canonical",
          "href": "https://www.example.com/documents/api/1.2"
        }
      ]
    }
  ]
}