{
  "actions": [
    {
      "name": "postDocumentsApi12FoldersFolderIdMetadataCollectionName",
      "protocol": "REST",
      "method": "POST",
      "entitypath": "{base_path}/{version}/documents/api/1.2/folders/{pathv1}/metadata/{pathv2}?{query}",
      "requestSchema": "schema.json",
      "responseSchema": "schema.json",
      "timeout": 0,
      "sendEmpty": false,
      "requestDatatype": "JSON",
      "responseDatatype": "JSON",
      "headers": {},
      "responseObjects": [
        {
          "type": "default",
          "key": "",
          "mockFile": "mockdatafiles/postDocumentsApi12FoldersFolderIdMetadataCollectionName-default.json"
        }
      ]
    },
    {
      "name": "postDocumentsApi12FoldersFolderIdMetadata",
      "protocol": "REST",
      "method": "POST",
      "entitypath": "{base_path}/{version}/documents/api/1.2/folders/{pathv1}/metadata?{query}",
      "requestSchema": "schema.json",
      "responseSchema": "schema.json",
      "timeout": 0,
      "sendEmpty": false,
      "requestDatatype": "JSON",
      "responseDatatype": "JSON",
      "headers": {},
      "responseObjects": [
        {
          "type": "default",
          "key": "",
          "mockFile": "mockdatafiles/postDocumentsApi12FoldersFolderIdMetadata-default.json"
        }
      ]
    },
    {
      "name": "getDocumentsApi12FoldersFolderIdMetadata",
      "protocol": "REST",
      "method": "GET",
      "entitypath": "{base_path}/{version}/documents/api/1.2/folders/{pathv1}/metadata?{query}",
      "requestSchema": "schema.json",
      "responseSchema": "schema.json",
      "timeout": 0,
      "sendEmpty": false,
      "sendGetBody": false,
      "requestDatatype": "JSON",
      "responseDatatype": "JSON",
      "headers": {},
      "responseObjects": [
        {
          "type": "default",
          "key": "",
          "mockFile": "mockdatafiles/getDocumentsApi12FoldersFolderIdMetadata-default.json"
        }
      ]
    },
    {
      "name": "deleteDocumentsApi12FoldersFolderIdMetadata",
      "protocol": "REST",
      "method": "DELETE",
      "entitypath": "{base_path}/{version}/documents/api/1.2/folders/{pathv1}/metadata?{query}",
      "requestSchema": "schema.json",
      "responseSchema": "schema.json",
      "timeout": 0,
      "sendEmpty": false,
      "requestDatatype": "JSON",
      "responseDatatype": "JSON",
      "headers": {},
      "responseObjects": [
        {
          "type": "default",
          "key": "",
          "mockFile": "mockdatafiles/deleteDocumentsApi12FoldersFolderIdMetadata-default.json"
        }
      ]
    },
    {
      "name": "getDocumentsApi12FoldersFolderIdMetadataFields",
      "protocol": "REST",
      "method": "GET",
      "entitypath": "{base_path}/{version}/documents/api/1.2/folders/{pathv1}/metadataFields?{query}",
      "requestSchema": "schema.json",
      "responseSchema": "schema.json",
      "timeout": 0,
      "sendEmpty": false,
      "sendGetBody": false,
      "requestDatatype": "JSON",
      "responseDatatype": "JSON",
      "headers": {},
      "responseObjects": [
        {
          "type": "default",
          "key": "",
          "mockFile": "mockdatafiles/getDocumentsApi12FoldersFolderIdMetadataFields-default.json"
        }
      ]
    },
    {
      "name": "postDocumentsApi12FoldersFolderIdBulkCreate",
      "protocol": "REST",
      "method": "POST",
      "entitypath": "{base_path}/{version}/documents/api/1.2/folders/{pathv1}/_bulkCreate?{query}",
      "requestSchema": "schema.json",
      "responseSchema": "schema.json",
      "timeout": 0,
      "sendEmpty": false,
      "requestDatatype": "JSON",
      "responseDatatype": "JSON",
      "headers": {},
      "responseObjects": [
        {
          "type": "default",
          "key": "",
          "mockFile": "mockdatafiles/postDocumentsApi12FoldersFolderIdBulkCreate-default.json"
        }
      ]
    },
    {
      "name": "postDocumentsApi12FoldersFolderIdDownload",
      "protocol": "REST",
      "method": "POST",
      "entitypath": "{base_path}/{version}/documents/api/1.2/folders/{pathv1}/_download?{query}",
      "requestSchema": "schema.json",
      "responseSchema": "schema.json",
      "timeout": 0,
      "sendEmpty": false,
      "requestDatatype": "JSON",
      "responseDatatype": "JSON",
      "headers": {},
      "responseObjects": [
        {
          "type": "default",
          "key": "",
          "mockFile": "mockdatafiles/postDocumentsApi12FoldersFolderIdDownload-default.json"
        }
      ]
    },
    {
      "name": "getDocumentsApi12FoldersFolderIdDownloadJobId",
      "protocol": "REST",
      "method": "GET",
      "entitypath": "{base_path}/{version}/documents/api/1.2/folders/{pathv1}/_download/{pathv2}?{query}",
      "requestSchema": "schema.json",
      "responseSchema": "schema.json",
      "timeout": 0,
      "sendEmpty": false,
      "sendGetBody": false,
      "requestDatatype": "JSON",
      "responseDatatype": "JSON",
      "headers": {},
      "responseObjects": [
        {
          "type": "default",
          "key": "",
          "mockFile": "mockdatafiles/getDocumentsApi12FoldersFolderIdDownloadJobId-default.json"
        }
      ]
    },
    {
      "name": "deleteDocumentsApi12FoldersFolderIdDownloadJobId",
      "protocol": "REST",
      "method": "DELETE",
      "entitypath": "{base_path}/{version}/documents/api/1.2/folders/{pathv1}/_download/{pathv2}?{query}",
      "requestSchema": "schema.json",
      "responseSchema": "schema.json",
      "timeout": 0,
      "sendEmpty": false,
      "requestDatatype": "JSON",
      "responseDatatype": "JSON",
      "headers": {},
      "responseObjects": [
        {
          "type": "default",
          "key": "",
          "mockFile": "mockdatafiles/deleteDocumentsApi12FoldersFolderIdDownloadJobId-default.json"
        }
      ]
    },
    {
      "name": "getDocumentsApi12FoldersFolderIdDownloadJobIdPackage",
      "protocol": "REST",
      "method": "GET",
      "entitypath": "{base_path}/{version}/documents/api/1.2/folders/{pathv1}/_download/{pathv2}/package?{query}",
      "requestSchema": "schema.json",
      "responseSchema": "schema.json",
      "timeout": 0,
      "sendEmpty": false,
      "sendGetBody": false,
      "requestDatatype": "JSON",
      "responseDatatype": "JSON",
      "headers": {},
      "responseObjects": [
        {
          "type": "default",
          "key": "",
          "mockFile": ""
        }
      ]
    },
    {
      "name": "getDocumentsApi12FoldersFolderId",
      "protocol": "REST",
      "method": "GET",
      "entitypath": "{base_path}/{version}/documents/api/1.2/folders/{pathv1}?{query}",
      "requestSchema": "schema.json",
      "responseSchema": "schema.json",
      "timeout": 0,
      "sendEmpty": false,
      "sendGetBody": false,
      "requestDatatype": "JSON",
      "responseDatatype": "JSON",
      "headers": {},
      "responseObjects": [
        {
          "type": "default",
          "key": "",
          "mockFile": "mockdatafiles/getDocumentsApi12FoldersFolderId-default.json"
        }
      ]
    },
    {
      "name": "postDocumentsApi12FoldersFolderId",
      "protocol": "REST",
      "method": "POST",
      "entitypath": "{base_path}/{version}/documents/api/1.2/folders/{pathv1}?{query}",
      "requestSchema": "schema.json",
      "responseSchema": "schema.json",
      "timeout": 0,
      "sendEmpty": false,
      "requestDatatype": "JSON",
      "responseDatatype": "JSON",
      "headers": {},
      "responseObjects": [
        {
          "type": "default",
          "key": "",
          "mockFile": "mockdatafiles/postDocumentsApi12FoldersFolderId-default.json"
        }
      ]
    },
    {
      "name": "putDocumentsApi12FoldersFolderId",
      "protocol": "REST",
      "method": "PUT",
      "entitypath": "{base_path}/{version}/documents/api/1.2/folders/{pathv1}?{query}",
      "requestSchema": "schema.json",
      "responseSchema": "schema.json",
      "timeout": 0,
      "sendEmpty": false,
      "requestDatatype": "JSON",
      "responseDatatype": "JSON",
      "headers": {},
      "responseObjects": [
        {
          "type": "default",
          "key": "",
          "mockFile": "mockdatafiles/putDocumentsApi12FoldersFolderId-default.json"
        }
      ]
    },
    {
      "name": "deleteDocumentsApi12FoldersFolderId",
      "protocol": "REST",
      "method": "DELETE",
      "entitypath": "{base_path}/{version}/documents/api/1.2/folders/{pathv1}?{query}",
      "requestSchema": "schema.json",
      "responseSchema": "schema.json",
      "timeout": 0,
      "sendEmpty": false,
      "requestDatatype": "JSON",
      "responseDatatype": "JSON",
      "headers": {},
      "responseObjects": [
        {
          "type": "default",
          "key": "",
          "mockFile": "mockdatafiles/deleteDocumentsApi12FoldersFolderId-default.json"
        }
      ]
    },
    {
      "name": "postDocumentsApi12FoldersFolderIdCopy",
      "protocol": "REST",
      "method": "POST",
      "entitypath": "{base_path}/{version}/documents/api/1.2/folders/{pathv1}/copy?{query}",
      "requestSchema": "schema.json",
      "responseSchema": "schema.json",
      "timeout": 0,
      "sendEmpty": false,
      "requestDatatype": "JSON",
      "responseDatatype": "JSON",
      "headers": {},
      "responseObjects": [
        {
          "type": "default",
          "key": "",
          "mockFile": "mockdatafiles/postDocumentsApi12FoldersFolderIdCopy-default.json"
        }
      ]
    },
    {
      "name": "postDocumentsApi12FoldersFolderIdMove",
      "protocol": "REST",
      "method": "POST",
      "entitypath": "{base_path}/{version}/documents/api/1.2/folders/{pathv1}/move?{query}",
      "requestSchema": "schema.json",
      "responseSchema": "schema.json",
      "timeout": 0,
      "sendEmpty": false,
      "requestDatatype": "JSON",
      "responseDatatype": "JSON",
      "headers": {},
      "responseObjects": [
        {
          "type": "default",
          "key": "",
          "mockFile": "mockdatafiles/postDocumentsApi12FoldersFolderIdMove-default.json"
        }
      ]
    },
    {
      "name": "getDocumentsApi12FoldersItems",
      "protocol": "REST",
      "method": "GET",
      "entitypath": "{base_path}/{version}/documents/api/1.2/folders/items?{query}",
      "requestSchema": "schema.json",
      "responseSchema": "schema.json",
      "timeout": 0,
      "sendEmpty": false,
      "sendGetBody": false,
      "requestDatatype": "JSON",
      "responseDatatype": "JSON",
      "headers": {},
      "responseObjects": [
        {
          "type": "default",
          "key": "",
          "mockFile": "mockdatafiles/getDocumentsApi12FoldersItems-default.json"
        }
      ]
    },
    {
      "name": "getDocumentsApi12FoldersFolderIdItems",
      "protocol": "REST",
      "method": "GET",
      "entitypath": "{base_path}/{version}/documents/api/1.2/folders/{pathv1}/items?{query}",
      "requestSchema": "schema.json",
      "responseSchema": "schema.json",
      "timeout": 0,
      "sendEmpty": false,
      "sendGetBody": false,
      "requestDatatype": "JSON",
      "responseDatatype": "JSON",
      "headers": {},
      "responseObjects": [
        {
          "type": "default",
          "key": "",
          "mockFile": "mockdatafiles/getDocumentsApi12FoldersFolderIdItems-default.json"
        }
      ]
    },
    {
      "name": "getDocumentsApi12FoldersSearchItems",
      "protocol": "REST",
      "method": "GET",
      "entitypath": "{base_path}/{version}/documents/api/1.2/folders/search/items?{query}",
      "requestSchema": "schema.json",
      "responseSchema": "schema.json",
      "timeout": 0,
      "sendEmpty": false,
      "sendGetBody": false,
      "requestDatatype": "JSON",
      "responseDatatype": "JSON",
      "headers": {},
      "responseObjects": [
        {
          "type": "default",
          "key": "",
          "mockFile": "mockdatafiles/getDocumentsApi12FoldersSearchItems-default.json"
        }
      ]
    },
    {
      "name": "getDocumentsApi12FoldersFolderIdSearchItems",
      "protocol": "REST",
      "method": "GET",
      "entitypath": "{base_path}/{version}/documents/api/1.2/folders/{pathv1}/search/items?{query}",
      "requestSchema": "schema.json",
      "responseSchema": "schema.json",
      "timeout": 0,
      "sendEmpty": false,
      "sendGetBody": false,
      "requestDatatype": "JSON",
      "responseDatatype": "JSON",
      "headers": {},
      "responseObjects": [
        {
          "type": "default",
          "key": "",
          "mockFile": "mockdatafiles/getDocumentsApi12FoldersFolderIdSearchItems-default.json"
        }
      ]
    },
    {
      "name": "getDocumentsApi12FoldersLists",
      "protocol": "REST",
      "method": "GET",
      "entitypath": "{base_path}/{version}/documents/api/1.2/folders/lists?{query}",
      "requestSchema": "schema.json",
      "responseSchema": "schema.json",
      "timeout": 0,
      "sendEmpty": false,
      "sendGetBody": false,
      "requestDatatype": "JSON",
      "responseDatatype": "JSON",
      "headers": {},
      "responseObjects": [
        {
          "type": "default",
          "key": "",
          "mockFile": "mockdatafiles/getDocumentsApi12FoldersLists-default.json"
        }
      ]
    },
    {
      "name": "getDocumentsApi12FoldersFolderIdTags",
      "protocol": "REST",
      "method": "GET",
      "entitypath": "{base_path}/{version}/documents/api/1.2/folders/{pathv1}/tags?{query}",
      "requestSchema": "schema.json",
      "responseSchema": "schema.json",
      "timeout": 0,
      "sendEmpty": false,
      "sendGetBody": false,
      "requestDatatype": "JSON",
      "responseDatatype": "JSON",
      "headers": {},
      "responseObjects": [
        {
          "type": "default",
          "key": "",
          "mockFile": "mockdatafiles/getDocumentsApi12FoldersFolderIdTags-default.json"
        }
      ]
    },
    {
      "name": "postDocumentsApi12FoldersFolderIdTags",
      "protocol": "REST",
      "method": "POST",
      "entitypath": "{base_path}/{version}/documents/api/1.2/folders/{pathv1}/tags?{query}",
      "requestSchema": "schema.json",
      "responseSchema": "schema.json",
      "timeout": 0,
      "sendEmpty": false,
      "requestDatatype": "JSON",
      "responseDatatype": "JSON",
      "headers": {},
      "responseObjects": [
        {
          "type": "default",
          "key": "",
          "mockFile": "mockdatafiles/postDocumentsApi12FoldersFolderIdTags-default.json"
        }
      ]
    },
    {
      "name": "putDocumentsApi12FoldersFolderIdTags",
      "protocol": "REST",
      "method": "PUT",
      "entitypath": "{base_path}/{version}/documents/api/1.2/folders/{pathv1}/tags?{query}",
      "requestSchema": "schema.json",
      "responseSchema": "schema.json",
      "timeout": 0,
      "sendEmpty": false,
      "requestDatatype": "JSON",
      "responseDatatype": "JSON",
      "headers": {},
      "responseObjects": [
        {
          "type": "default",
          "key": "",
          "mockFile": "mockdatafiles/putDocumentsApi12FoldersFolderIdTags-default.json"
        }
      ]
    },
    {
      "name": "deleteDocumentsApi12FoldersFolderIdTags",
      "protocol": "REST",
      "method": "DELETE",
      "entitypath": "{base_path}/{version}/documents/api/1.2/folders/{pathv1}/tags?{query}",
      "requestSchema": "schema.json",
      "responseSchema": "schema.json",
      "timeout": 0,
      "sendEmpty": false,
      "requestDatatype": "JSON",
      "responseDatatype": "JSON",
      "headers": {},
      "responseObjects": [
        {
          "type": "default",
          "key": "",
          "mockFile": "mockdatafiles/deleteDocumentsApi12FoldersFolderIdTags-default.json"
        }
      ]
    },
    {
      "name": "postDocumentsApi12FoldersFolderIdConversation",
      "protocol": "REST",
      "method": "POST",
      "entitypath": "{base_path}/{version}/documents/api/1.2/folders/{pathv1}/conversation?{query}",
      "requestSchema": "schema.json",
      "responseSchema": "schema.json",
      "timeout": 0,
      "sendEmpty": false,
      "requestDatatype": "JSON",
      "responseDatatype": "JSON",
      "headers": {},
      "responseObjects": [
        {
          "type": "default",
          "key": "",
          "mockFile": "mockdatafiles/postDocumentsApi12FoldersFolderIdConversation-default.json"
        }
      ]
    }
  ]
}