{
  "$id": "schema.json",
  "type": "object",
  "schema": "http://json-schema.org/draft-07/schema#",
  "translate": true,
  "dynamicfields": true,
  "properties": {
    "ph_request_type": {
      "type": "string",
      "description": "type of request (internal to adapter)",
      "default": "listQuotasForProjectsWithNonDefaultQuotaValues",
      "enum": [
        "listQuotasForProjectsWithNonDefaultQuotaValues",
        "listQuotasForAProject",
        "updateQuotaForAProject",
        "resetQuotaForAProject",
        "listDefaultQuotasForAProject"
      ],
      "external_name": "ph_request_type"
    },
    "projectId": {
      "type": "string",
      "description": "The ID of the project.",
      "parse": false,
      "encode": false,
      "encrypt": {
        "type": "AES",
        "key": ""
      },
      "external_name": "project_id"
    }
  },
  "definitions": {}
}