{
  "actions": [
    {
      "name": "listLocalIPs",
      "protocol": "REST",
      "method": "GET",
      "entitypath": {
        "v0": "{base_path}/{version}/v2.0/local_ips?{query}",
        "v1": "{base_path}/{version}/local_ips?{query}"
      },
      "requestSchema": "schema.json",
      "responseSchema": "schema.json",
      "timeout": 0,
      "sendEmpty": false,
      "sendGetBody": false,
      "requestDatatype": "JSON",
      "responseDatatype": "JSON",
      "headers": {},
      "responseObjects": [
        {
          "type": "default",
          "key": "",
          "mockFile": ""
        }
      ]
    },
    {
      "name": "createLocalIP",
      "protocol": "REST",
      "method": "POST",
      "entitypath": {
        "v0": "{base_path}/{version}/v2.0/local_ips?{query}",
        "v1": "{base_path}/{version}/local_ips?{query}"
      },
      "requestSchema": "schema.json",
      "responseSchema": "schema.json",
      "timeout": 0,
      "sendEmpty": false,
      "requestDatatype": "JSON",
      "responseDatatype": "JSON",
      "headers": {},
      "responseObjects": [
        {
          "type": "default",
          "key": "",
          "mockFile": ""
        }
      ]
    },
    {
      "name": "showLocalIPDetails",
      "protocol": "REST",
      "method": "GET",
      "entitypath": {
        "v0": "{base_path}/{version}/v2.0/local_ips/{pathv1}?{query}",
        "v1": "{base_path}/{version}/local_ips/{pathv1}?{query}"
      },
      "requestSchema": "schema.json",
      "responseSchema": "schema.json",
      "timeout": 0,
      "sendEmpty": false,
      "sendGetBody": false,
      "requestDatatype": "JSON",
      "responseDatatype": "JSON",
      "headers": {},
      "responseObjects": [
        {
          "type": "default",
          "key": "",
          "mockFile": ""
        }
      ]
    },
    {
      "name": "updateLocalIP",
      "protocol": "REST",
      "method": "PUT",
      "entitypath": {
        "v0": "{base_path}/{version}/v2.0/local_ips/{pathv1}?{query}",
        "v1": "{base_path}/{version}/local_ips/{pathv1}?{query}"
      },
      "requestSchema": "schema.json",
      "responseSchema": "schema.json",
      "timeout": 0,
      "sendEmpty": false,
      "requestDatatype": "JSON",
      "responseDatatype": "JSON",
      "headers": {},
      "responseObjects": [
        {
          "type": "default",
          "key": "",
          "mockFile": ""
        }
      ]
    },
    {
      "name": "deleteLocalIP",
      "protocol": "REST",
      "method": "DELETE",
      "entitypath": {
        "v0": "{base_path}/{version}/v2.0/local_ips/{pathv1}?{query}",
        "v1": "{base_path}/{version}/local_ips/{pathv1}?{query}"
      },
      "requestSchema": "schema.json",
      "responseSchema": "schema.json",
      "timeout": 0,
      "sendEmpty": false,
      "requestDatatype": "JSON",
      "responseDatatype": "JSON",
      "headers": {},
      "responseObjects": [
        {
          "type": "default",
          "key": "",
          "mockFile": ""
        }
      ]
    }
  ]
}