{
  "actions": [
    {
      "name": "listFlavors",
      "protocol": "REST",
      "method": "GET",
      "entitypath": {
        "v0": "{base_path}/{version}/v2.0/flavors?{query}",
        "v1": "{base_path}/{version}/flavors?{query}"
      },
      "requestSchema": "schema.json",
      "responseSchema": "schema.json",
      "timeout": 0,
      "sendEmpty": false,
      "sendGetBody": false,
      "requestDatatype": "JSON",
      "responseDatatype": "JSON",
      "headers": {},
      "responseObjects": [
        {
          "type": "default",
          "key": "",
          "mockFile": ""
        }
      ]
    },
    {
      "name": "createFlavor",
      "protocol": "REST",
      "method": "POST",
      "entitypath": {
        "v0": "{base_path}/{version}/v2.0/flavors?{query}",
        "v1": "{base_path}/{version}/flavors?{query}"
      },
      "requestSchema": "schema.json",
      "responseSchema": "schema.json",
      "timeout": 0,
      "sendEmpty": false,
      "requestDatatype": "JSON",
      "responseDatatype": "JSON",
      "headers": {},
      "responseObjects": [
        {
          "type": "default",
          "key": "",
          "mockFile": ""
        }
      ]
    },
    {
      "name": "showFlavorDetails",
      "protocol": "REST",
      "method": "GET",
      "entitypath": {
        "v0": "{base_path}/{version}/v2.0/flavors/{pathv1}?{query}",
        "v1": "{base_path}/{version}/flavors/{pathv1}?{query}"
      },
      "requestSchema": "schema.json",
      "responseSchema": "schema.json",
      "timeout": 0,
      "sendEmpty": false,
      "sendGetBody": false,
      "requestDatatype": "JSON",
      "responseDatatype": "JSON",
      "headers": {},
      "responseObjects": [
        {
          "type": "default",
          "key": "",
          "mockFile": ""
        }
      ]
    },
    {
      "name": "updateFlavor",
      "protocol": "REST",
      "method": "PUT",
      "entitypath": {
        "v0": "{base_path}/{version}/v2.0/flavors/{pathv1}?{query}",
        "v1": "{base_path}/{version}/flavors/{pathv1}?{query}"
      },
      "requestSchema": "schema.json",
      "responseSchema": "schema.json",
      "timeout": 0,
      "sendEmpty": false,
      "requestDatatype": "JSON",
      "responseDatatype": "JSON",
      "headers": {},
      "responseObjects": [
        {
          "type": "default",
          "key": "",
          "mockFile": ""
        }
      ]
    },
    {
      "name": "deleteFlavor",
      "protocol": "REST",
      "method": "DELETE",
      "entitypath": {
        "v0": "{base_path}/{version}/v2.0/flavors/{pathv1}?{query}",
        "v1": "{base_path}/{version}/flavors/{pathv1}?{query}"
      },
      "requestSchema": "schema.json",
      "responseSchema": "schema.json",
      "timeout": 0,
      "sendEmpty": false,
      "requestDatatype": "JSON",
      "responseDatatype": "JSON",
      "headers": {},
      "responseObjects": [
        {
          "type": "default",
          "key": "",
          "mockFile": ""
        }
      ]
    },
    {
      "name": "associateFlavorWithAServiceProfile",
      "protocol": "REST",
      "method": "POST",
      "entitypath": {
        "v0": "{base_path}/{version}/v2.0/flavors/{pathv1}/service_profiles?{query}",
        "v1": "{base_path}/{version}/flavors/{pathv1}/service_profiles?{query}"
      },
      "requestSchema": "schema.json",
      "responseSchema": "schema.json",
      "timeout": 0,
      "sendEmpty": false,
      "requestDatatype": "JSON",
      "responseDatatype": "JSON",
      "headers": {},
      "responseObjects": [
        {
          "type": "default",
          "key": "",
          "mockFile": ""
        }
      ]
    },
    {
      "name": "disassociateAFlavor",
      "protocol": "REST",
      "method": "DELETE",
      "entitypath": {
        "v0": "{base_path}/{version}/v2.0/flavors/{pathv1}/service_profiles/{pathv2}?{query}",
        "v1": "{base_path}/{version}/flavors/{pathv1}/service_profiles/{pathv2}?{query}"
      },
      "requestSchema": "schema.json",
      "responseSchema": "schema.json",
      "timeout": 0,
      "sendEmpty": false,
      "requestDatatype": "JSON",
      "responseDatatype": "JSON",
      "headers": {},
      "responseObjects": [
        {
          "type": "default",
          "key": "",
          "mockFile": ""
        }
      ]
    },
    {
      "name": "listServiceProfiles",
      "protocol": "REST",
      "method": "GET",
      "entitypath": {
        "v0": "{base_path}/{version}/v2.0/service_profiles?{query}",
        "v1": "{base_path}/{version}/service_profiles?{query}"
      },
      "requestSchema": "schema.json",
      "responseSchema": "schema.json",
      "timeout": 0,
      "sendEmpty": false,
      "sendGetBody": false,
      "requestDatatype": "JSON",
      "responseDatatype": "JSON",
      "headers": {},
      "responseObjects": [
        {
          "type": "default",
          "key": "",
          "mockFile": ""
        }
      ]
    },
    {
      "name": "createServiceProfile",
      "protocol": "REST",
      "method": "POST",
      "entitypath": {
        "v0": "{base_path}/{version}/v2.0/service_profiles?{query}",
        "v1": "{base_path}/{version}/service_profiles?{query}"
      },
      "requestSchema": "schema.json",
      "responseSchema": "schema.json",
      "timeout": 0,
      "sendEmpty": false,
      "requestDatatype": "JSON",
      "responseDatatype": "JSON",
      "headers": {},
      "responseObjects": [
        {
          "type": "default",
          "key": "",
          "mockFile": ""
        }
      ]
    },
    {
      "name": "showServiceProfileDetails",
      "protocol": "REST",
      "method": "GET",
      "entitypath": {
        "v0": "{base_path}/{version}/v2.0/service_profiles/{pathv1}?{query}",
        "v1": "{base_path}/{version}/service_profiles/{pathv1}?{query}"
      },
      "requestSchema": "schema.json",
      "responseSchema": "schema.json",
      "timeout": 0,
      "sendEmpty": false,
      "sendGetBody": false,
      "requestDatatype": "JSON",
      "responseDatatype": "JSON",
      "headers": {},
      "responseObjects": [
        {
          "type": "default",
          "key": "",
          "mockFile": ""
        }
      ]
    },
    {
      "name": "updateServiceProfile",
      "protocol": "REST",
      "method": "PUT",
      "entitypath": {
        "v0": "{base_path}/{version}/v2.0/service_profiles/{pathv1}?{query}",
        "v1": "{base_path}/{version}/service_profiles/{pathv1}?{query}"
      },
      "requestSchema": "schema.json",
      "responseSchema": "schema.json",
      "timeout": 0,
      "sendEmpty": false,
      "requestDatatype": "JSON",
      "responseDatatype": "JSON",
      "headers": {},
      "responseObjects": [
        {
          "type": "default",
          "key": "",
          "mockFile": ""
        }
      ]
    },
    {
      "name": "deleteServiceProfile",
      "protocol": "REST",
      "method": "DELETE",
      "entitypath": {
        "v0": "{base_path}/{version}/v2.0/service_profiles/{pathv1}?{query}",
        "v1": "{base_path}/{version}/service_profiles/{pathv1}?{query}"
      },
      "requestSchema": "schema.json",
      "responseSchema": "schema.json",
      "timeout": 0,
      "sendEmpty": false,
      "requestDatatype": "JSON",
      "responseDatatype": "JSON",
      "headers": {},
      "responseObjects": [
        {
          "type": "default",
          "key": "",
          "mockFile": ""
        }
      ]
    }
  ]
}