{
  "actions": [
    {
      "name": "listBandwidthLimitRulesForQoSPolicy",
      "protocol": "REST",
      "method": "GET",
      "entitypath": {
        "v0": "{base_path}/{version}/v2.0/qos/policies/{pathv1}/bandwidth_limit_rules?{query}",
        "v1": "{base_path}/{version}/qos/policies/{pathv1}/bandwidth_limit_rules?{query}"
      },
      "requestSchema": "schema.json",
      "responseSchema": "schema.json",
      "timeout": 0,
      "sendEmpty": false,
      "sendGetBody": false,
      "requestDatatype": "JSON",
      "responseDatatype": "JSON",
      "headers": {},
      "responseObjects": [
        {
          "type": "default",
          "key": "",
          "mockFile": ""
        }
      ]
    },
    {
      "name": "createBandwidthLimitRule",
      "protocol": "REST",
      "method": "POST",
      "entitypath": {
        "v0": "{base_path}/{version}/v2.0/qos/policies/{pathv1}/bandwidth_limit_rules?{query}",
        "v1": "{base_path}/{version}/qos/policies/{pathv1}/bandwidth_limit_rules?{query}"
      },
      "requestSchema": "schema.json",
      "responseSchema": "schema.json",
      "timeout": 0,
      "sendEmpty": false,
      "requestDatatype": "JSON",
      "responseDatatype": "JSON",
      "headers": {},
      "responseObjects": [
        {
          "type": "default",
          "key": "",
          "mockFile": ""
        }
      ]
    },
    {
      "name": "showBandwidthLimitRuleDetails",
      "protocol": "REST",
      "method": "GET",
      "entitypath": {
        "v0": "{base_path}/{version}/v2.0/qos/policies/{pathv1}/bandwidth_limit_rules/{pathv2}?{query}",
        "v1": "{base_path}/{version}/qos/policies/{pathv1}/bandwidth_limit_rules/{pathv2}?{query}"
      },
      "requestSchema": "schema.json",
      "responseSchema": "schema.json",
      "timeout": 0,
      "sendEmpty": false,
      "sendGetBody": false,
      "requestDatatype": "JSON",
      "responseDatatype": "JSON",
      "headers": {},
      "responseObjects": [
        {
          "type": "default",
          "key": "",
          "mockFile": ""
        }
      ]
    },
    {
      "name": "updateBandwidthLimitRule",
      "protocol": "REST",
      "method": "PUT",
      "entitypath": {
        "v0": "{base_path}/{version}/v2.0/qos/policies/{pathv1}/bandwidth_limit_rules/{pathv2}?{query}",
        "v1": "{base_path}/{version}/qos/policies/{pathv1}/bandwidth_limit_rules/{pathv2}?{query}"
      },
      "requestSchema": "schema.json",
      "responseSchema": "schema.json",
      "timeout": 0,
      "sendEmpty": false,
      "requestDatatype": "JSON",
      "responseDatatype": "JSON",
      "headers": {},
      "responseObjects": [
        {
          "type": "default",
          "key": "",
          "mockFile": ""
        }
      ]
    },
    {
      "name": "deleteBandwidthLimitRule",
      "protocol": "REST",
      "method": "DELETE",
      "entitypath": {
        "v0": "{base_path}/{version}/v2.0/qos/policies/{pathv1}/bandwidth_limit_rules/{pathv2}?{query}",
        "v1": "{base_path}/{version}/qos/policies/{pathv1}/bandwidth_limit_rules/{pathv2}?{query}"
      },
      "requestSchema": "schema.json",
      "responseSchema": "schema.json",
      "timeout": 0,
      "sendEmpty": false,
      "requestDatatype": "JSON",
      "responseDatatype": "JSON",
      "headers": {},
      "responseObjects": [
        {
          "type": "default",
          "key": "",
          "mockFile": ""
        }
      ]
    }
  ]
}