{
  "$id": "schema.json",
  "type": "object",
  "schema": "http://json-schema.org/draft-07/schema#",
  "translate": true,
  "dynamicfields": true,
  "properties": {
    "ph_request_type": {
      "type": "string",
      "description": "type of request (internal to adapter)",
      "default": "listRegisteredLimits",
      "enum": [
        "listRegisteredLimits",
        "createRegisteredLimits",
        "updateRegisteredLimit",
        "showRegisteredLimitDetails",
        "deleteRegisteredLimit",
        "getEnforcementModel",
        "listLimits",
        "createLimits",
        "updateLimit",
        "showLimitDetails",
        "deleteLimit"
      ],
      "external_name": "ph_request_type"
    },
    "serviceId": {
      "type": "string",
      "description": "Filters the response by a service ID.",
      "parse": false,
      "encode": false,
      "encrypt": {
        "type": "AES",
        "key": ""
      },
      "external_name": "service_id"
    },
    "regionId": {
      "type": "string",
      "description": "Filters the response by a region ID.",
      "parse": false,
      "encode": false,
      "encrypt": {
        "type": "AES",
        "key": ""
      },
      "external_name": "region_id"
    },
    "resourceName": {
      "type": "string",
      "description": "Filters the response by a specified resource name.",
      "parse": false,
      "encode": false,
      "encrypt": {
        "type": "AES",
        "key": ""
      },
      "external_name": "resource_name"
    },
    "registeredLimitId": {
      "type": "string",
      "description": "The registered limit ID.",
      "parse": false,
      "encode": false,
      "encrypt": {
        "type": "AES",
        "key": ""
      },
      "external_name": "registered_limit_id"
    },
    "projectId": {
      "type": "string",
      "description": "Filters the response by a project ID.",
      "parse": false,
      "encode": false,
      "encrypt": {
        "type": "AES",
        "key": ""
      },
      "external_name": "project_id"
    },
    "domainId": {
      "type": "string",
      "description": "Filters the response by a domain ID.",
      "parse": false,
      "encode": false,
      "encrypt": {
        "type": "AES",
        "key": ""
      },
      "external_name": "domain_id"
    },
    "limitId": {
      "type": "string",
      "description": "The limit ID.",
      "parse": false,
      "encode": false,
      "encrypt": {
        "type": "AES",
        "key": ""
      },
      "external_name": "limit_id"
    }
  },
  "definitions": {}
}