{
  "$id": "schema.json",
  "type": "object",
  "schema": "http://json-schema.org/draft-07/schema#",
  "translate": true,
  "dynamicfields": true,
  "properties": {
    "ph_request_type": {
      "type": "string",
      "description": "type of request (internal to adapter)",
      "default": "deleteImageFromStore",
      "enum": [
        "deleteImageFromStore"
      ],
      "external_name": "ph_request_type"
    },
    "storeId": {
      "type": "string",
      "description": "The ID of the store from which image is to be deleted.",
      "parse": false,
      "encode": false,
      "encrypt": {
        "type": "AES",
        "key": ""
      },
      "external_name": "store_id"
    },
    "imageId": {
      "type": "string",
      "description": "The UUID of the image.",
      "parse": false,
      "encode": false,
      "encrypt": {
        "type": "AES",
        "key": ""
      },
      "external_name": "image_id"
    }
  },
  "definitions": {}
}