{
  "actions": [
    {
      "name": "listAllBackEndStoragePools",
      "protocol": "REST",
      "method": "GET",
      "entitypath": "{base_path}/{version}/v3/{pathv1}/scheduler-stats/get_pools?{query}",
      "requestSchema": "schema.json",
      "responseSchema": "schema.json",
      "timeout": 0,
      "sendEmpty": false,
      "sendGetBody": false,
      "requestDatatype": "JSON",
      "responseDatatype": "JSON",
      "headers": {},
      "responseObjects": [
        {
          "type": "default",
          "key": "",
          "mockFile": ""
        }
      ]
    }
  ]
}