{
  "$id": "schema.json",
  "type": "object",
  "schema": "http://json-schema.org/draft-07/schema#",
  "translate": true,
  "dynamicfields": true,
  "properties": {
    "ph_request_type": {
      "type": "string",
      "description": "type of request (internal to adapter)",
      "default": "disassociateAQoSSpecificationFromAllAssociations",
      "enum": [
        "disassociateAQoSSpecificationFromAllAssociations",
        "unsetKeysInAQoSSpecification",
        "getAllAssociationsForAQoSSpecification",
        "associateQoSSpecificationWithAVolumeType",
        "disassociateQoSSpecificationFromAVolumeType",
        "showAQoSSpecificationDetails",
        "setKeysInAQoSSpecification",
        "deleteAQoSSpecification",
        "createAQoSSpecification",
        "listQoSSpecifications"
      ],
      "external_name": "ph_request_type"
    },
    "projectId": {
      "type": "string",
      "description": "The UUID of the project in a multi-tenancy cloud.",
      "parse": false,
      "encode": false,
      "encrypt": {
        "type": "AES",
        "key": ""
      },
      "external_name": "project_id"
    },
    "qosId": {
      "type": "string",
      "description": "The ID of the QoS specification.",
      "parse": false,
      "encode": false,
      "encrypt": {
        "type": "AES",
        "key": ""
      },
      "external_name": "qos_id"
    },
    "volTypeId": {
      "type": "string",
      "description": "A volume type ID.",
      "parse": false,
      "encode": false,
      "encrypt": {
        "type": "AES",
        "key": ""
      },
      "external_name": "vol_type_id"
    }
  },
  "definitions": {}
}