{
  "status": {
    "global": {
      "since": 2,
      "status": "string"
    },
    "ams": {
      "since": 10,
      "status": "string"
    }
  },
  "notes": {},
  "policy": "string",
  "frequency": 5,
  "regions": [
    "string"
  ],
  "region_scope": "string",
  "active": false,
  "rapid_recheck": false,
  "name": "string",
  "job_type": "string",
  "config": {
    "ssl": "string",
    "send": "string",
    "port": 2,
    "host": "string"
  },
  "rules": [
    {
      "value": "string",
      "comparison": "string",
      "key": "string"
    },
    {
      "value": "string",
      "comparison": "string",
      "key": "string"
    },
    {
      "value": "string",
      "comparison": "string",
      "key": "string"
    },
    {
      "value": "string",
      "comparison": "string",
      "key": "string"
    },
    {
      "value": "string",
      "comparison": "string",
      "key": "string"
    },
    {
      "value": "string",
      "comparison": "string",
      "key": "string"
    }
  ],
  "notify_delay": 8,
  "notify_repeat": 8,
  "notify_failback": true,
  "notify_regional": true,
  "notify_list": {},
  "id": "string"
}