{
  "sourcetype": "string",
  "id": "string",
  "config": {
    "api_key": "string",
    "secret_key": "string",
    "webhook_token": "string"
  },
  "feeds": [
    {},
    {},
    {},
    {},
    {}
  ],
  "name": "string",
  "status": "string"
}