{
  "permissions": {
    "dns": {
      "view_zones": true,
      "manage_zones": true,
      "zones_allow_by_default": true,
      "zones_deny": [
        {},
        {}
      ],
      "zones_allow": [
        {}
      ]
    },
    "data": {
      "push_to_datafeeds": true,
      "manage_datasources": true,
      "manage_datafeeds": true
    },
    "account": {
      "manage_payment_methods": false,
      "manage_plan": true,
      "manage_teams": false,
      "manage_apikeys": false,
      "manage_account_settings": true,
      "view_activity_log": true,
      "view_invoices": true,
      "manage_users": true
    },
    "monitoring": {
      "manage_lists": true,
      "manage_jobs": false,
      "view_jobs": true
    }
  },
  "teams": [
    {}
  ],
  "email": "string",
  "last_access": null,
  "notify": {
    "billing": false
  },
  "name": "string",
  "username": "string",
  "ip_whitelist_strict": true,
  "ip_whitelist": [
    {}
  ]
}