{
  "permissions": {
    "dns": {
      "zones_allow_by_default": true,
      "view_zones": true,
      "manage_zones": true,
      "zones_allow": [
        {},
        {},
        {},
        {},
        {},
        {},
        {}
      ]
    },
    "data": {
      "push_to_datafeeds": false,
      "manage_datasources": true,
      "manage_datafeeds": true
    },
    "account": {
      "manage_payment_methods": true,
      "manage_plan": true,
      "manage_teams": true,
      "manage_apikeys": true,
      "manage_account_settings": true,
      "view_activity_log": true,
      "view_invoices": false,
      "manage_users": true
    },
    "monitoring": {
      "manage_lists": true,
      "manage_jobs": true,
      "view_jobs": true
    }
  },
  "id": "string",
  "name": "string",
  "ip_whitelist": [
    {},
    {}
  ]
}