{
  "start": 5,
  "end": 6,
  "limit": 5,
  "page": 8,
  "total": 8,
  "results": [
    {
      "timestamp": 5,
      "site_id": "string",
      "for_site": true,
      "org_id": "string",
      "admin_id": "string",
      "admin_name": "string",
      "message": "string",
      "id": "string",
      "before": {
        "auth": {
          "type": "string"
        }
      },
      "after": {
        "auth": {
          "type": "string"
        }
      }
    },
    {
      "timestamp": 8,
      "site_id": "string",
      "for_site": true,
      "org_id": "string",
      "admin_id": "string",
      "admin_name": "string",
      "message": "string",
      "id": "string",
      "before": {
        "auth": {
          "type": "string"
        }
      },
      "after": {
        "auth": {
          "type": "string"
        }
      }
    },
    {
      "timestamp": 7,
      "site_id": "string",
      "for_site": true,
      "org_id": "string",
      "admin_id": "string",
      "admin_name": "string",
      "message": "string",
      "id": "string",
      "before": {
        "auth": {
          "type": "string"
        }
      },
      "after": {
        "auth": {
          "type": "string"
        }
      }
    },
    {
      "timestamp": 10,
      "site_id": "string",
      "for_site": false,
      "org_id": "string",
      "admin_id": "string",
      "admin_name": "string",
      "message": "string",
      "id": "string",
      "before": {
        "auth": {
          "type": "string"
        }
      },
      "after": {
        "auth": {
          "type": "string"
        }
      }
    },
    {
      "timestamp": 6,
      "site_id": "string",
      "for_site": true,
      "org_id": "string",
      "admin_id": "string",
      "admin_name": "string",
      "message": "string",
      "id": "string",
      "before": {
        "auth": {
          "type": "string"
        }
      },
      "after": {
        "auth": {
          "type": "string"
        }
      }
    },
    {
      "timestamp": 4,
      "site_id": "string",
      "for_site": true,
      "org_id": "string",
      "admin_id": "string",
      "admin_name": "string",
      "message": "string",
      "id": "string",
      "before": {
        "auth": {
          "type": "string"
        }
      },
      "after": {
        "auth": {
          "type": "string"
        }
      }
    },
    {
      "timestamp": 2,
      "site_id": "string",
      "for_site": false,
      "org_id": "string",
      "admin_id": "string",
      "admin_name": "string",
      "message": "string",
      "id": "string",
      "before": {
        "auth": {
          "type": "string"
        }
      },
      "after": {
        "auth": {
          "type": "string"
        }
      }
    },
    {
      "timestamp": 5,
      "site_id": "string",
      "for_site": true,
      "org_id": "string",
      "admin_id": "string",
      "admin_name": "string",
      "message": "string",
      "id": "string",
      "before": {
        "auth": {
          "type": "string"
        }
      },
      "after": {
        "auth": {
          "type": "string"
        }
      }
    },
    {
      "timestamp": 1,
      "site_id": "string",
      "for_site": true,
      "org_id": "string",
      "admin_id": "string",
      "admin_name": "string",
      "message": "string",
      "id": "string",
      "before": {
        "auth": {
          "type": "string"
        }
      },
      "after": {
        "auth": {
          "type": "string"
        }
      }
    }
  ]
}