{
  "distinct": "string",
  "end": 9,
  "limit": 9,
  "percentage": 9,
  "results": [
    {
      "count": 8,
      "type": "string"
    },
    {
      "count": 1,
      "type": "string"
    },
    {
      "count": 3,
      "type": "string"
    },
    {
      "count": 6,
      "type": "string"
    },
    {
      "count": 3,
      "type": "string"
    },
    {
      "count": 8,
      "type": "string"
    },
    {
      "count": 4,
      "type": "string"
    }
  ],
  "start": 5,
  "total": 5
}