[
  {
    "key": "string",
    "display": "string",
    "display_native": "string"
  },
  {
    "key": "string",
    "display": "string",
    "display_native": "string"
  },
  {
    "key": "string",
    "display": "string",
    "display_native": "string"
  }
]