{
  "$id": "schema.json",
  "type": "object",
  "schema": "http://json-schema.org/draft-07/schema#",
  "translate": true,
  "dynamicfields": true,
  "properties": {
    "ph_request_type": {
      "type": "string",
      "description": "type of request (internal to adapter)",
      "default": "processatriggersentbythealertservice",
      "enum": [
        "processatriggersentbythealertservice",
        "addanewruleREADpermissionrequiredonCloudEDITRULESpermissionrequiredonMachine",
        "deletearulegivenitsUUID",
        "renamearule",
        "updatearulegivenitsUUIDTheexpectedrequestbodyisthesameasfortheAddRuleEndpoint",
        "enableordisablearulePermitsOwnerstotemporarilydisableorreEnablearuleSevaluation"
      ],
      "external_name": "ph_request_type"
    },
    "triggerAfter": {
      "type": "object",
      "description": "an offset, which prevents an alert from actually being raised, unless\nthe threshold is exceeded for &#34;trigger_after&#34; consecutive evaluations",
      "parse": false,
      "encode": false,
      "encrypt": {
        "type": "AES",
        "key": ""
      },
      "external_name": "trigger_after"
    },
    "ruleId": {
      "type": "string",
      "description": "the UUID of the rule to be updated",
      "parse": false,
      "encode": false,
      "encrypt": {
        "type": "AES",
        "key": ""
      },
      "external_name": "rule_id"
    }
  },
  "definitions": {}
}