{
  "$id": "schema.json",
  "type": "object",
  "schema": "http://json-schema.org/draft-07/schema#",
  "translate": false,
  "dynamicfields": true,
  "properties": {
    "ph_request_type": {
      "type": "string",
      "description": "type of request (internal to adapter)",
      "default": "",
      "enum": [
        "getSiteDevices",
        "createSiteDevice",
        "getSiteDeviceRadioChannels",
        "countSiteDeviceConfigHistory",
        "searchSiteDeviceConfigHistory",
        "countSiteDevices",
        "countSiteDeviceEvents",
        "searchSiteDeviceEvents",
        "exportSiteDeviceInformation",
        "countSiteDeviceLastConfig",
        "searchSiteDeviceLastConfigs",
        "reprovisionSiteAllAps",
        "resetSiteAllApsToUseRrm",
        "multiRestartSiteDevices",
        "searchSiteDevices",
        "multiUpgradeSiteDevices",
        "getSiteAvailableDeviceVersions",
        "zeroizeSiteFipsAllAps",
        "getSiteDeviceConfigCmd",
        "deleteSiteDevice",
        "getSiteDevice",
        "updateSiteDevice",
        "getSiteDeviceIotPort",
        "setSiteDeviceIotPort",
        "startSiteLocateDevice",
        "restartSiteDevice",
        "uploadSiteDeviceSupportFile",
        "stopSiteLocateDevice",
        "upgradeSiteDevice",
        "deleteSiteVirtualChassis",
        "getSiteVirtualChassis",
        "createSiteVirtualChassis",
        "removeSiteVirtualChassisMember",
        "deleteSiteDeviceImage",
        "addSiteDeviceImage",
        "pollSiteSwitchStats",
        "createSiteEvpnTopology"
      ],
      "external_name": "ph_request_type"
    }
  },
  "definitions": {}
}