{
  "id": "string",
  "managedObjectId": "string",
  "rootCauseFaultyComponent": {
    "faultyNestedNsInstanceId": "string",
    "faultyResourceType": "string",
    "faultyNsVirtualLinkInstanceId": "string"
  },
  "rootCauseFaultyResource": {
    "faultyResource": {
      "vimId": "string",
      "resourceProviderId": "string",
      "resourceId": "string",
      "vimLevelResourceType": "string"
    },
    "faultyResourceType": "NETWORK"
  },
  "alarmRaisedTime": null,
  "alarmChangedTime": null,
  "alarmClearedTime": null,
  "alarmAcknowledgedTime": null,
  "ackState": "ACKNOWLEDGED",
  "perceivedSeverity": "CLEARED",
  "eventTime": null,
  "eventType": "EQUIPMENT_ALARM",
  "faultType": "string",
  "probableCause": "string",
  "isRootCause": false,
  "correlatedAlarmIds": [
    "string",
    "string",
    "string",
    "string",
    "string",
    "string",
    "string",
    "string"
  ],
  "faultDetails": "string",
  "_links": {
    "self": {
      "href": "string"
    }
  }
}