[
  {
    "id": "string",
    "pnfdId": "string",
    "pnfdName": "string",
    "pnfdersion": "string",
    "pnfdProvider": "string",
    "pnfdInvariantId": "string",
    "archiveSecurityOption": "OPTION_2",
    "signingCertificate": "string",
    "artifacts": [
      {
        "artifactPath": "string",
        "checksum": {
          "algorithm": "string",
          "hash": "string"
        },
        "nonManoArtifactSetId": "string",
        "metadata": {}
      },
      {
        "artifactPath": "string",
        "checksum": {
          "algorithm": "string",
          "hash": "string"
        },
        "nonManoArtifactSetId": "string",
        "metadata": {}
      },
      {
        "artifactPath": "string",
        "checksum": {
          "algorithm": "string",
          "hash": "string"
        },
        "nonManoArtifactSetId": "string",
        "metadata": {}
      },
      {
        "artifactPath": "string",
        "checksum": {
          "algorithm": "string",
          "hash": "string"
        },
        "nonManoArtifactSetId": "string",
        "metadata": {}
      },
      {
        "artifactPath": "string",
        "checksum": {
          "algorithm": "string",
          "hash": "string"
        },
        "nonManoArtifactSetId": "string",
        "metadata": {}
      },
      {
        "artifactPath": "string",
        "checksum": {
          "algorithm": "string",
          "hash": "string"
        },
        "nonManoArtifactSetId": "string",
        "metadata": {}
      },
      {
        "artifactPath": "string",
        "checksum": {
          "algorithm": "string",
          "hash": "string"
        },
        "nonManoArtifactSetId": "string",
        "metadata": {}
      },
      {
        "artifactPath": "string",
        "checksum": {
          "algorithm": "string",
          "hash": "string"
        },
        "nonManoArtifactSetId": "string",
        "metadata": {}
      },
      {
        "artifactPath": "string",
        "checksum": {
          "algorithm": "string",
          "hash": "string"
        },
        "nonManoArtifactSetId": "string",
        "metadata": {}
      }
    ],
    "pnfdOnboardingState": "UPLOADING",
    "onboardingFailureDetails": {
      "type": "string",
      "title": "string",
      "status": 5,
      "detail": "string",
      "instance": "string"
    },
    "pnfdUsageState": "NOT_IN_USE",
    "userDefinedData": {},
    "_links": {
      "self": {
        "href": "string"
      },
      "pnfd_content": {
        "href": "string"
      }
    }
  }
]