[
  {
    "id": "string",
    "objectType": "string",
    "objectInstanceIds": [
      "string",
      "string",
      "string",
      "string",
      "string",
      "string",
      "string",
      "string"
    ],
    "subObjectInstanceIds": [
      "string",
      "string",
      "string",
      "string"
    ],
    "criteria": {
      "performanceMetric": [
        "string",
        "string",
        "string",
        "string",
        "string",
        "string",
        "string",
        "string",
        "string",
        "string"
      ],
      "performanceMetricGroup": [
        "string",
        "string"
      ],
      "collectionPeriod": 6,
      "reportingPeriod": 6,
      "reportingBoundary": null
    },
    "callbackUri": "string",
    "reports": {
      "href": "string",
      "readyTime": null,
      "expiryTime": null,
      "fileSize": 6,
      "_links": {
        "self": {
          "href": "string"
        },
        "objects": [
          {
            "href": "string"
          }
        ]
      }
    }
  },
  {
    "id": "string",
    "objectType": "string",
    "objectInstanceIds": [
      "string",
      "string",
      "string",
      "string",
      "string"
    ],
    "subObjectInstanceIds": [
      "string",
      "string",
      "string",
      "string",
      "string",
      "string",
      "string"
    ],
    "criteria": {
      "performanceMetric": [
        "string",
        "string",
        "string"
      ],
      "performanceMetricGroup": [
        "string",
        "string",
        "string",
        "string",
        "string",
        "string",
        "string",
        "string",
        "string",
        "string"
      ],
      "collectionPeriod": 6,
      "reportingPeriod": 10,
      "reportingBoundary": null
    },
    "callbackUri": "string",
    "reports": {
      "href": "string",
      "readyTime": null,
      "expiryTime": null,
      "fileSize": 7,
      "_links": {
        "self": {
          "href": "string"
        },
        "objects": [
          {
            "href": "string"
          },
          {
            "href": "string"
          }
        ]
      }
    }
  }
]