{
  "entries": [
    {
      "objectType": "string",
      "objectInstanceId": "string",
      "subObjectInstanceId": "string",
      "performanceMetric": "string",
      "performanceValues": [
        {
          "timeStamp": "string",
          "value": {},
          "context": {}
        },
        {
          "timeStamp": "string",
          "value": {},
          "context": {}
        },
        {
          "timeStamp": "string",
          "value": {},
          "context": {}
        },
        {
          "timeStamp": "string",
          "value": {},
          "context": {}
        },
        {
          "timeStamp": "string",
          "value": {},
          "context": {}
        }
      ]
    },
    {
      "objectType": "string",
      "objectInstanceId": "string",
      "subObjectInstanceId": "string",
      "performanceMetric": "string",
      "performanceValues": [
        {
          "timeStamp": "string",
          "value": {},
          "context": {}
        }
      ]
    },
    {
      "objectType": "string",
      "objectInstanceId": "string",
      "subObjectInstanceId": "string",
      "performanceMetric": "string",
      "performanceValues": [
        {
          "timeStamp": "string",
          "value": {},
          "context": {}
        },
        {
          "timeStamp": "string",
          "value": {},
          "context": {}
        },
        {
          "timeStamp": "string",
          "value": {},
          "context": {}
        },
        {
          "timeStamp": "string",
          "value": {},
          "context": {}
        },
        {
          "timeStamp": "string",
          "value": {},
          "context": {}
        },
        {
          "timeStamp": "string",
          "value": {},
          "context": {}
        },
        {
          "timeStamp": "string",
          "value": {},
          "context": {}
        }
      ]
    },
    {
      "objectType": "string",
      "objectInstanceId": "string",
      "subObjectInstanceId": "string",
      "performanceMetric": "string",
      "performanceValues": [
        {
          "timeStamp": "string",
          "value": {},
          "context": {}
        },
        {
          "timeStamp": "string",
          "value": {},
          "context": {}
        },
        {
          "timeStamp": "string",
          "value": {},
          "context": {}
        },
        {
          "timeStamp": "string",
          "value": {},
          "context": {}
        }
      ]
    },
    {
      "objectType": "string",
      "objectInstanceId": "string",
      "subObjectInstanceId": "string",
      "performanceMetric": "string",
      "performanceValues": [
        {
          "timeStamp": "string",
          "value": {},
          "context": {}
        },
        {
          "timeStamp": "string",
          "value": {},
          "context": {}
        },
        {
          "timeStamp": "string",
          "value": {},
          "context": {}
        },
        {
          "timeStamp": "string",
          "value": {},
          "context": {}
        },
        {
          "timeStamp": "string",
          "value": {},
          "context": {}
        }
      ]
    }
  ]
}