[
  {
    "id": "string",
    "objectType": "string",
    "objectInstanceIds": [
      "string",
      "string"
    ],
    "subObjectInstanceIds": [
      "string",
      "string",
      "string",
      "string",
      "string",
      "string",
      "string",
      "string"
    ],
    "criteria": {
      "performanceMetric": [
        "string",
        "string"
      ],
      "performanceMetricGroup": [
        "string",
        "string",
        "string",
        "string",
        "string",
        "string",
        "string",
        "string"
      ],
      "collectionPeriod": 3,
      "reportingPeriod": 3,
      "reportingBoundary": "string"
    },
    "callbackUri": "string",
    "reports": {
      "href": "string",
      "readyTime": "string",
      "expiryTime": "string",
      "fileSize": 8
    },
    "_links": {
      "self": {
        "href": "string"
      },
      "objects": [
        {
          "href": "string"
        },
        {
          "href": "string"
        }
      ]
    }
  },
  {
    "id": "string",
    "objectType": "string",
    "objectInstanceIds": [
      "string",
      "string",
      "string",
      "string",
      "string",
      "string",
      "string"
    ],
    "subObjectInstanceIds": [
      "string"
    ],
    "criteria": {
      "performanceMetric": [
        "string",
        "string",
        "string",
        "string",
        "string",
        "string",
        "string",
        "string"
      ],
      "performanceMetricGroup": [
        "string",
        "string",
        "string",
        "string",
        "string",
        "string",
        "string",
        "string",
        "string",
        "string"
      ],
      "collectionPeriod": 9,
      "reportingPeriod": 8,
      "reportingBoundary": "string"
    },
    "callbackUri": "string",
    "reports": {
      "href": "string",
      "readyTime": "string",
      "expiryTime": "string",
      "fileSize": 8
    },
    "_links": {
      "self": {
        "href": "string"
      },
      "objects": [
        {
          "href": "string"
        }
      ]
    }
  },
  {
    "id": "string",
    "objectType": "string",
    "objectInstanceIds": [
      "string",
      "string",
      "string",
      "string",
      "string",
      "string",
      "string",
      "string"
    ],
    "subObjectInstanceIds": [
      "string"
    ],
    "criteria": {
      "performanceMetric": [
        "string",
        "string",
        "string"
      ],
      "performanceMetricGroup": [
        "string",
        "string",
        "string",
        "string",
        "string",
        "string"
      ],
      "collectionPeriod": 2,
      "reportingPeriod": 2,
      "reportingBoundary": "string"
    },
    "callbackUri": "string",
    "reports": {
      "href": "string",
      "readyTime": "string",
      "expiryTime": "string",
      "fileSize": 4
    },
    "_links": {
      "self": {
        "href": "string"
      },
      "objects": [
        {
          "href": "string"
        },
        {
          "href": "string"
        }
      ]
    }
  },
  {
    "id": "string",
    "objectType": "string",
    "objectInstanceIds": [
      "string",
      "string",
      "string",
      "string",
      "string"
    ],
    "subObjectInstanceIds": [
      "string",
      "string",
      "string",
      "string",
      "string",
      "string",
      "string",
      "string"
    ],
    "criteria": {
      "performanceMetric": [
        "string",
        "string",
        "string",
        "string",
        "string"
      ],
      "performanceMetricGroup": [
        "string",
        "string"
      ],
      "collectionPeriod": 2,
      "reportingPeriod": 4,
      "reportingBoundary": "string"
    },
    "callbackUri": "string",
    "reports": {
      "href": "string",
      "readyTime": "string",
      "expiryTime": "string",
      "fileSize": 8
    },
    "_links": {
      "self": {
        "href": "string"
      },
      "objects": [
        {
          "href": "string"
        },
        {
          "href": "string"
        },
        {
          "href": "string"
        },
        {
          "href": "string"
        },
        {
          "href": "string"
        },
        {
          "href": "string"
        },
        {
          "href": "string"
        },
        {
          "href": "string"
        },
        {
          "href": "string"
        },
        {
          "href": "string"
        }
      ]
    }
  }
]