{
  "id": "string",
  "objectType": "string",
  "objectInstanceIds": [
    "string",
    "string",
    "string",
    "string",
    "string",
    "string",
    "string"
  ],
  "subObjectInstanceIds": [
    "string",
    "string",
    "string",
    "string",
    "string",
    "string",
    "string",
    "string",
    "string"
  ],
  "criteria": {
    "performanceMetric": [
      "string",
      "string",
      "string",
      "string"
    ],
    "performanceMetricGroup": [
      "string",
      "string",
      "string",
      "string"
    ],
    "collectionPeriod": 2,
    "reportingPeriod": 8,
    "reportingBoundary": "string"
  },
  "callbackUri": "string",
  "reports": {
    "href": "string",
    "readyTime": "string",
    "expiryTime": "string",
    "fileSize": 10
  },
  "_links": {
    "self": {
      "href": "string"
    },
    "objects": [
      {
        "href": "string"
      },
      {
        "href": "string"
      },
      {
        "href": "string"
      },
      {
        "href": "string"
      },
      {
        "href": "string"
      },
      {
        "href": "string"
      }
    ]
  }
}