{
  "actions": [
    {
      "name": "getSubscriptions",
      "protocol": "REST",
      "method": "GET",
      "entitypath": "{base_path}/{version}/vnflcm/v1/subscriptions?{query}",
      "requestSchema": "schema.json",
      "responseSchema": "schema.json",
      "timeout": 0,
      "sendEmpty": false,
      "sendGetBody": false,
      "requestDatatype": "JSON",
      "responseDatatype": "JSON",
      "headers": {},
      "responseObjects": [
        {
          "type": "default",
          "key": "",
          "mockFile": "mockdatafiles/getSubscriptions-default.json"
        }
      ]
    },
    {
      "name": "postSubscriptions",
      "protocol": "REST",
      "method": "POST",
      "entitypath": "{base_path}/{version}/vnflcm/v1/subscriptions?{query}",
      "requestSchema": "schema.json",
      "responseSchema": "schema.json",
      "timeout": 0,
      "sendEmpty": false,
      "requestDatatype": "JSON",
      "responseDatatype": "JSON",
      "headers": {},
      "responseObjects": [
        {
          "type": "default",
          "key": "",
          "mockFile": "mockdatafiles/postSubscriptions-default.json"
        }
      ]
    },
    {
      "name": "getSubscriptionsSubscriptionId",
      "protocol": "REST",
      "method": "GET",
      "entitypath": "{base_path}/{version}/vnflcm/v1/subscriptions/{pathv1}?{query}",
      "requestSchema": "schema.json",
      "responseSchema": "schema.json",
      "timeout": 0,
      "sendEmpty": false,
      "sendGetBody": false,
      "requestDatatype": "JSON",
      "responseDatatype": "JSON",
      "headers": {},
      "responseObjects": [
        {
          "type": "default",
          "key": "",
          "mockFile": "mockdatafiles/getSubscriptionsSubscriptionId-default.json"
        }
      ]
    },
    {
      "name": "deleteSubscriptionsSubscriptionId",
      "protocol": "REST",
      "method": "DELETE",
      "entitypath": "{base_path}/{version}/vnflcm/v1/subscriptions/{pathv1}?{query}",
      "requestSchema": "schema.json",
      "responseSchema": "schema.json",
      "timeout": 0,
      "sendEmpty": false,
      "requestDatatype": "JSON",
      "responseDatatype": "JSON",
      "headers": {},
      "responseObjects": [
        {
          "type": "default",
          "key": "",
          "mockFile": ""
        }
      ]
    }
  ]
}