{
  "$id": "schema.json",
  "type": "object",
  "schema": "http://json-schema.org/draft-07/schema#",
  "translate": true,
  "dynamicfields": true,
  "properties": {
    "ph_request_type": {
      "type": "string",
      "description": "type of request (internal to adapter)",
      "default": "listJobsForAccount",
      "enum": [
        "listJobsForAccount",
        "createJob",
        "getJobById",
        "updateJobById",
        "deleteJobById",
        "triggerRun"
      ],
      "external_name": "ph_request_type"
    },
    "orderBy": {
      "type": "string",
      "description": "Field to order the result by. Use `-` to indicate reverse order.",
      "parse": false,
      "encode": false,
      "encrypt": {
        "type": "AES",
        "key": ""
      },
      "external_name": "order_by"
    },
    "projectId": {
      "type": "number",
      "description": "Numeric ID of the project containing jobs",
      "parse": false,
      "encode": false,
      "encrypt": {
        "type": "AES",
        "key": ""
      },
      "external_name": "project_id"
    }
  },
  "definitions": {}
}