{
  "_etag": 8,
  "_content_length": "string",
  "_schema": 10,
  "_created_on_utc": 7,
  "_updated_on_utc": 10,
  "_status_code": "string",
  "_request_id": "string",
  "count": 2,
  "items": [
    {},
    {},
    {},
    {},
    {},
    {},
    {},
    {},
    {}
  ]
}