{
  "_etag": 2,
  "_content_length": "string",
  "_schema": 3,
  "_created_on_utc": 7,
  "_updated_on_utc": 5,
  "_status_code": "string",
  "_request_id": "string",
  "count": 7,
  "items": [
    {
      "id": "string",
      "_etag": 7,
      "_schema": 4,
      "_created_on_utc": 2,
      "_updated_on_utc": 4,
      "_debug": null,
      "_info": null,
      "_warning": null,
      "_error": null,
      "name": "string",
      "description": "string",
      "network_id": "string",
      "link_bw_down": 5,
      "link_bw_up": 7,
      "bw_config_mode": "string",
      "bfd_mode": "string",
      "label_id": "string",
      "lqm_enabled": true,
      "bwc_enabled": true
    },
    {
      "id": "string",
      "_etag": 2,
      "_schema": 7,
      "_created_on_utc": 3,
      "_updated_on_utc": 7,
      "_debug": null,
      "_info": null,
      "_warning": null,
      "_error": null,
      "name": "string",
      "description": "string",
      "network_id": "string",
      "link_bw_down": 4,
      "link_bw_up": 3,
      "bw_config_mode": "string",
      "bfd_mode": "string",
      "label_id": "string",
      "lqm_enabled": true,
      "bwc_enabled": false
    },
    {
      "id": "string",
      "_etag": 4,
      "_schema": 8,
      "_created_on_utc": 6,
      "_updated_on_utc": 2,
      "_debug": null,
      "_info": null,
      "_warning": null,
      "_error": null,
      "name": "string",
      "description": "string",
      "network_id": "string",
      "link_bw_down": 3,
      "link_bw_up": 8,
      "bw_config_mode": "string",
      "bfd_mode": "string",
      "label_id": "string",
      "lqm_enabled": false,
      "bwc_enabled": false
    },
    {
      "id": "string",
      "_etag": 3,
      "_schema": 7,
      "_created_on_utc": 7,
      "_updated_on_utc": 2,
      "_debug": null,
      "_info": null,
      "_warning": null,
      "_error": null,
      "name": "string",
      "description": "string",
      "network_id": "string",
      "link_bw_down": 5,
      "link_bw_up": 9,
      "bw_config_mode": "string",
      "bfd_mode": "string",
      "label_id": "string",
      "lqm_enabled": false,
      "bwc_enabled": true
    },
    {
      "id": "string",
      "_etag": 9,
      "_schema": 7,
      "_created_on_utc": 2,
      "_updated_on_utc": 9,
      "_debug": null,
      "_info": null,
      "_warning": null,
      "_error": null,
      "name": "string",
      "description": "string",
      "network_id": "string",
      "link_bw_down": 5,
      "link_bw_up": 4,
      "bw_config_mode": "string",
      "bfd_mode": "string",
      "label_id": "string",
      "lqm_enabled": false,
      "bwc_enabled": true
    },
    {
      "id": "string",
      "_etag": 4,
      "_schema": 9,
      "_created_on_utc": 10,
      "_updated_on_utc": 9,
      "_debug": null,
      "_info": null,
      "_warning": null,
      "_error": null,
      "name": "string",
      "description": "string",
      "network_id": "string",
      "link_bw_down": 5,
      "link_bw_up": 7,
      "bw_config_mode": "string",
      "bfd_mode": "string",
      "label_id": "string",
      "lqm_enabled": true,
      "bwc_enabled": false
    },
    {
      "id": "string",
      "_etag": 2,
      "_schema": 5,
      "_created_on_utc": 10,
      "_updated_on_utc": 5,
      "_debug": null,
      "_info": null,
      "_warning": null,
      "_error": null,
      "name": "string",
      "description": "string",
      "network_id": "string",
      "link_bw_down": 10,
      "link_bw_up": 7,
      "bw_config_mode": "string",
      "bfd_mode": "string",
      "label_id": "string",
      "lqm_enabled": true,
      "bwc_enabled": true
    }
  ]
}