[
  {
    "id": "SSID1",
    "Enable": true,
    "SSID": "2.4G Primary",
    "SSIDAdvertisementEnabled": true,
    "BeaconType": "WPAand11i",
    "BasicEncryptionModes": "None",
    "BasicAuthenticationMode": "None",
    "WPAEncryptionModes": "AESEncryption",
    "IEEE11iEncryptionModes": "AESEncryption",
    "IEEE11iAuthenticationMode": "PSKAuthentication",
    "KeyPassphrase": "ATCadb#?!?_",
    "freqBand": "2.4GHz",
    "PRConfig": {
      "Enable": true,
      "SSID": "2.4G Primary",
      "SSIDAdvertisementEnabled": true,
      "BeaconType": "WPAand11i",
      "BasicEncryptionModes": "None",
      "BasicAuthenticationMode": "None",
      "WPAEncryptionModes": "AESEncryption",
      "IEEE11iEncryptionModes": "AESEncryption",
      "IEEE11iAuthenticationMode": "PSKAuthentication",
      "KeyPassphrase": "ATCadb#?!?_"
    },
    "isInL2Bridge": false
  }
]