{
  "actions": [
    {
      "name": "getBillingSubscribersSubscriberIdManagedServiceArlo",
      "protocol": "REST",
      "method": "GET",
      "entitypath": "{base_path}/{version}/billing/subscribers/{pathv1}/managed-service/arlo?{query}",
      "requestSchema": "schema.json",
      "responseSchema": "schema.json",
      "timeout": 0,
      "sendEmpty": false,
      "sendGetBody": false,
      "requestDatatype": "JSON",
      "responseDatatype": "JSON",
      "headers": {},
      "responseObjects": [
        {
          "type": "default",
          "key": "",
          "mockFile": ""
        }
      ]
    },
    {
      "name": "putBillingSubscribersSubscriberIdManagedServiceArlo",
      "protocol": "REST",
      "method": "PUT",
      "entitypath": "{base_path}/{version}/billing/subscribers/{pathv1}/managed-service/arlo?{query}",
      "requestSchema": "schema.json",
      "responseSchema": "schema.json",
      "timeout": 0,
      "sendEmpty": false,
      "requestDatatype": "JSON",
      "responseDatatype": "JSON",
      "headers": {},
      "responseObjects": [
        {
          "type": "default",
          "key": "",
          "mockFile": ""
        }
      ]
    },
    {
      "name": "postBillingSubscribersSubscriberIdManagedServiceArlo",
      "protocol": "REST",
      "method": "POST",
      "entitypath": "{base_path}/{version}/billing/subscribers/{pathv1}/managed-service/arlo?{query}",
      "requestSchema": "schema.json",
      "responseSchema": "schema.json",
      "timeout": 0,
      "sendEmpty": false,
      "requestDatatype": "JSON",
      "responseDatatype": "JSON",
      "headers": {},
      "responseObjects": [
        {
          "type": "default",
          "key": "",
          "mockFile": ""
        }
      ]
    },
    {
      "name": "deleteBillingSubscribersSubscriberIdManagedServiceArlo",
      "protocol": "REST",
      "method": "DELETE",
      "entitypath": "{base_path}/{version}/billing/subscribers/{pathv1}/managed-service/arlo?{query}",
      "requestSchema": "schema.json",
      "responseSchema": "schema.json",
      "timeout": 0,
      "sendEmpty": false,
      "requestDatatype": "JSON",
      "responseDatatype": "JSON",
      "headers": {},
      "responseObjects": [
        {
          "type": "default",
          "key": "",
          "mockFile": ""
        }
      ]
    }
  ]
}