{
  "value": [
    {
      "id": "string"
    },
    {
      "id": "string"
    },
    {
      "id": "string"
    },
    {
      "id": "string"
    },
    {
      "id": "string"
    },
    {
      "id": "string"
    },
    {
      "id": "string"
    }
  ],
  "nextLink": "string"
}