{
  "name": "string",
  "id": "string",
  "etag": "string",
  "type": "string",
  "location": "string",
  "tags": {},
  "properties": {
    "source": {
      "resourceId": "string",
      "port": 2
    },
    "destination": {
      "resourceId": "string",
      "address": "string",
      "port": 10
    },
    "autoStart": true,
    "monitoringIntervalInSeconds": 60,
    "endpoints": [
      {
        "name": "string",
        "resourceId": "string",
        "address": "string",
        "filter": {
          "type": "Include",
          "items": [
            {
              "type": "AgentAddress",
              "address": "string"
            }
          ]
        }
      },
      {
        "name": "string",
        "resourceId": "string",
        "address": "string",
        "filter": {
          "type": "Include",
          "items": [
            {
              "type": "AgentAddress",
              "address": "string"
            },
            {
              "type": "AgentAddress",
              "address": "string"
            },
            {
              "type": "AgentAddress",
              "address": "string"
            },
            {
              "type": "AgentAddress",
              "address": "string"
            },
            {
              "type": "AgentAddress",
              "address": "string"
            }
          ]
        }
      },
      {
        "name": "string",
        "resourceId": "string",
        "address": "string",
        "filter": {
          "type": "Include",
          "items": [
            {
              "type": "AgentAddress",
              "address": "string"
            }
          ]
        }
      },
      {
        "name": "string",
        "resourceId": "string",
        "address": "string",
        "filter": {
          "type": "Include",
          "items": [
            {
              "type": "AgentAddress",
              "address": "string"
            },
            {
              "type": "AgentAddress",
              "address": "string"
            },
            {
              "type": "AgentAddress",
              "address": "string"
            },
            {
              "type": "AgentAddress",
              "address": "string"
            },
            {
              "type": "AgentAddress",
              "address": "string"
            },
            {
              "type": "AgentAddress",
              "address": "string"
            },
            {
              "type": "AgentAddress",
              "address": "string"
            },
            {
              "type": "AgentAddress",
              "address": "string"
            },
            {
              "type": "AgentAddress",
              "address": "string"
            },
            {
              "type": "AgentAddress",
              "address": "string"
            }
          ]
        }
      },
      {
        "name": "string",
        "resourceId": "string",
        "address": "string",
        "filter": {
          "type": "Include",
          "items": [
            {
              "type": "AgentAddress",
              "address": "string"
            }
          ]
        }
      },
      {
        "name": "string",
        "resourceId": "string",
        "address": "string",
        "filter": {
          "type": "Include",
          "items": [
            {
              "type": "AgentAddress",
              "address": "string"
            },
            {
              "type": "AgentAddress",
              "address": "string"
            },
            {
              "type": "AgentAddress",
              "address": "string"
            }
          ]
        }
      },
      {
        "name": "string",
        "resourceId": "string",
        "address": "string",
        "filter": {
          "type": "Include",
          "items": [
            {
              "type": "AgentAddress",
              "address": "string"
            },
            {
              "type": "AgentAddress",
              "address": "string"
            },
            {
              "type": "AgentAddress",
              "address": "string"
            },
            {
              "type": "AgentAddress",
              "address": "string"
            },
            {
              "type": "AgentAddress",
              "address": "string"
            },
            {
              "type": "AgentAddress",
              "address": "string"
            }
          ]
        }
      },
      {
        "name": "string",
        "resourceId": "string",
        "address": "string",
        "filter": {
          "type": "Include",
          "items": [
            {
              "type": "AgentAddress",
              "address": "string"
            }
          ]
        }
      }
    ],
    "testConfigurations": [
      {
        "name": "string",
        "testFrequencySec": 8,
        "protocol": "Http",
        "preferredIPVersion": "IPv6",
        "httpConfiguration": {
          "port": 5,
          "method": "Get",
          "path": "string",
          "requestHeaders": [
            {
              "name": "string",
              "value": "string"
            },
            {
              "name": "string",
              "value": "string"
            },
            {
              "name": "string",
              "value": "string"
            },
            {
              "name": "string",
              "value": "string"
            },
            {
              "name": "string",
              "value": "string"
            },
            {
              "name": "string",
              "value": "string"
            }
          ],
          "validStatusCodeRanges": [
            "string",
            "string",
            "string",
            "string"
          ],
          "preferHTTPS": true
        },
        "tcpConfiguration": {
          "port": 5,
          "disableTraceRoute": false
        },
        "icmpConfiguration": {
          "disableTraceRoute": true
        },
        "successThreshold": {
          "checksFailedPercent": 9,
          "roundTripTimeMs": 7
        }
      },
      {
        "name": "string",
        "testFrequencySec": 2,
        "protocol": "Http",
        "preferredIPVersion": "IPv6",
        "httpConfiguration": {
          "port": 10,
          "method": "Get",
          "path": "string",
          "requestHeaders": [
            {
              "name": "string",
              "value": "string"
            },
            {
              "name": "string",
              "value": "string"
            },
            {
              "name": "string",
              "value": "string"
            },
            {
              "name": "string",
              "value": "string"
            },
            {
              "name": "string",
              "value": "string"
            },
            {
              "name": "string",
              "value": "string"
            },
            {
              "name": "string",
              "value": "string"
            },
            {
              "name": "string",
              "value": "string"
            },
            {
              "name": "string",
              "value": "string"
            },
            {
              "name": "string",
              "value": "string"
            }
          ],
          "validStatusCodeRanges": [
            "string",
            "string",
            "string",
            "string",
            "string",
            "string",
            "string",
            "string",
            "string",
            "string"
          ],
          "preferHTTPS": true
        },
        "tcpConfiguration": {
          "port": 1,
          "disableTraceRoute": true
        },
        "icmpConfiguration": {
          "disableTraceRoute": false
        },
        "successThreshold": {
          "checksFailedPercent": 6,
          "roundTripTimeMs": 7
        }
      },
      {
        "name": "string",
        "testFrequencySec": 1,
        "protocol": "Http",
        "preferredIPVersion": "IPv6",
        "httpConfiguration": {
          "port": 10,
          "method": "Get",
          "path": "string",
          "requestHeaders": [
            {
              "name": "string",
              "value": "string"
            },
            {
              "name": "string",
              "value": "string"
            },
            {
              "name": "string",
              "value": "string"
            },
            {
              "name": "string",
              "value": "string"
            },
            {
              "name": "string",
              "value": "string"
            },
            {
              "name": "string",
              "value": "string"
            },
            {
              "name": "string",
              "value": "string"
            }
          ],
          "validStatusCodeRanges": [
            "string",
            "string",
            "string",
            "string",
            "string"
          ],
          "preferHTTPS": true
        },
        "tcpConfiguration": {
          "port": 9,
          "disableTraceRoute": false
        },
        "icmpConfiguration": {
          "disableTraceRoute": true
        },
        "successThreshold": {
          "checksFailedPercent": 3,
          "roundTripTimeMs": 10
        }
      },
      {
        "name": "string",
        "testFrequencySec": 6,
        "protocol": "Icmp",
        "preferredIPVersion": "IPv6",
        "httpConfiguration": {
          "port": 6,
          "method": "Get",
          "path": "string",
          "requestHeaders": [
            {
              "name": "string",
              "value": "string"
            },
            {
              "name": "string",
              "value": "string"
            },
            {
              "name": "string",
              "value": "string"
            },
            {
              "name": "string",
              "value": "string"
            },
            {
              "name": "string",
              "value": "string"
            },
            {
              "name": "string",
              "value": "string"
            },
            {
              "name": "string",
              "value": "string"
            },
            {
              "name": "string",
              "value": "string"
            }
          ],
          "validStatusCodeRanges": [
            "string",
            "string",
            "string",
            "string",
            "string",
            "string",
            "string",
            "string",
            "string"
          ],
          "preferHTTPS": true
        },
        "tcpConfiguration": {
          "port": 6,
          "disableTraceRoute": true
        },
        "icmpConfiguration": {
          "disableTraceRoute": true
        },
        "successThreshold": {
          "checksFailedPercent": 6,
          "roundTripTimeMs": 5
        }
      }
    ],
    "testGroups": [
      {
        "name": "string",
        "disable": false,
        "testConfigurations": [
          "string",
          "string",
          "string",
          "string",
          "string",
          "string",
          "string",
          "string"
        ],
        "sources": [
          "string",
          "string",
          "string",
          "string",
          "string",
          "string",
          "string"
        ],
        "destinations": [
          "string",
          "string",
          "string"
        ]
      },
      {
        "name": "string",
        "disable": true,
        "testConfigurations": [
          "string",
          "string",
          "string",
          "string"
        ],
        "sources": [
          "string",
          "string",
          "string",
          "string",
          "string"
        ],
        "destinations": [
          "string",
          "string"
        ]
      },
      {
        "name": "string",
        "disable": true,
        "testConfigurations": [
          "string",
          "string",
          "string",
          "string",
          "string",
          "string",
          "string",
          "string",
          "string"
        ],
        "sources": [
          "string",
          "string",
          "string",
          "string",
          "string",
          "string",
          "string",
          "string",
          "string",
          "string"
        ],
        "destinations": [
          "string",
          "string",
          "string"
        ]
      },
      {
        "name": "string",
        "disable": false,
        "testConfigurations": [
          "string",
          "string",
          "string"
        ],
        "sources": [
          "string",
          "string"
        ],
        "destinations": [
          "string",
          "string",
          "string",
          "string",
          "string",
          "string",
          "string",
          "string"
        ]
      },
      {
        "name": "string",
        "disable": true,
        "testConfigurations": [
          "string",
          "string",
          "string",
          "string"
        ],
        "sources": [
          "string",
          "string",
          "string",
          "string"
        ],
        "destinations": [
          "string"
        ]
      },
      {
        "name": "string",
        "disable": true,
        "testConfigurations": [
          "string",
          "string",
          "string",
          "string"
        ],
        "sources": [
          "string",
          "string"
        ],
        "destinations": [
          "string",
          "string",
          "string",
          "string",
          "string"
        ]
      },
      {
        "name": "string",
        "disable": true,
        "testConfigurations": [
          "string",
          "string"
        ],
        "sources": [
          "string",
          "string",
          "string",
          "string",
          "string",
          "string",
          "string",
          "string",
          "string"
        ],
        "destinations": [
          "string",
          "string",
          "string",
          "string",
          "string",
          "string"
        ]
      }
    ],
    "outputs": [
      {
        "type": "Workspace",
        "workspaceSettings": {
          "workspaceResourceId": "string"
        }
      },
      {
        "type": "Workspace",
        "workspaceSettings": {
          "workspaceResourceId": "string"
        }
      }
    ],
    "notes": "string"
  }
}