{
  "$id": "schema.json",
  "type": "object",
  "schema": "http://json-schema.org/draft-07/schema#",
  "translate": true,
  "dynamicfields": true,
  "properties": {
    "ph_request_type": {
      "type": "string",
      "description": "type of request (internal to adapter)",
      "default": "expressRouteConnectionsCreateOrUpdate",
      "enum": [
        "expressRouteConnectionsCreateOrUpdate",
        "expressRouteConnectionsGet",
        "expressRouteConnectionsDelete",
        "expressRouteConnectionsList"
      ],
      "external_name": "ph_request_type"
    },
    "apiVersion": {
      "type": "string",
      "description": "Client API version.",
      "parse": false,
      "encode": false,
      "encrypt": {
        "type": "AES",
        "key": ""
      },
      "external_name": "api-version"
    }
  },
  "definitions": {}
}