{
  "value": [
    {
      "name": "string",
      "id": "string",
      "etag": "string",
      "properties": {
        "target": "string",
        "bytesToCapturePerPacket": 5,
        "totalBytesPerSession": 1073741824,
        "timeLimitInSeconds": 18000,
        "storageLocation": {
          "storageId": "string",
          "storagePath": "string",
          "filePath": "string"
        },
        "filters": [
          {
            "protocol": "Any",
            "localIPAddress": "string",
            "remoteIPAddress": "string",
            "localPort": "string",
            "remotePort": "string"
          },
          {
            "protocol": "Any",
            "localIPAddress": "string",
            "remoteIPAddress": "string",
            "localPort": "string",
            "remotePort": "string"
          },
          {
            "protocol": "Any",
            "localIPAddress": "string",
            "remoteIPAddress": "string",
            "localPort": "string",
            "remotePort": "string"
          },
          {
            "protocol": "Any",
            "localIPAddress": "string",
            "remoteIPAddress": "string",
            "localPort": "string",
            "remotePort": "string"
          }
        ]
      }
    },
    {
      "name": "string",
      "id": "string",
      "etag": "string",
      "properties": {
        "target": "string",
        "bytesToCapturePerPacket": 9,
        "totalBytesPerSession": 1073741824,
        "timeLimitInSeconds": 18000,
        "storageLocation": {
          "storageId": "string",
          "storagePath": "string",
          "filePath": "string"
        },
        "filters": [
          {
            "protocol": "Any",
            "localIPAddress": "string",
            "remoteIPAddress": "string",
            "localPort": "string",
            "remotePort": "string"
          },
          {
            "protocol": "Any",
            "localIPAddress": "string",
            "remoteIPAddress": "string",
            "localPort": "string",
            "remotePort": "string"
          },
          {
            "protocol": "Any",
            "localIPAddress": "string",
            "remoteIPAddress": "string",
            "localPort": "string",
            "remotePort": "string"
          },
          {
            "protocol": "Any",
            "localIPAddress": "string",
            "remoteIPAddress": "string",
            "localPort": "string",
            "remotePort": "string"
          }
        ]
      }
    },
    {
      "name": "string",
      "id": "string",
      "etag": "string",
      "properties": {
        "target": "string",
        "bytesToCapturePerPacket": 6,
        "totalBytesPerSession": 1073741824,
        "timeLimitInSeconds": 18000,
        "storageLocation": {
          "storageId": "string",
          "storagePath": "string",
          "filePath": "string"
        },
        "filters": [
          {
            "protocol": "Any",
            "localIPAddress": "string",
            "remoteIPAddress": "string",
            "localPort": "string",
            "remotePort": "string"
          },
          {
            "protocol": "Any",
            "localIPAddress": "string",
            "remoteIPAddress": "string",
            "localPort": "string",
            "remotePort": "string"
          },
          {
            "protocol": "Any",
            "localIPAddress": "string",
            "remoteIPAddress": "string",
            "localPort": "string",
            "remotePort": "string"
          },
          {
            "protocol": "Any",
            "localIPAddress": "string",
            "remoteIPAddress": "string",
            "localPort": "string",
            "remotePort": "string"
          },
          {
            "protocol": "Any",
            "localIPAddress": "string",
            "remoteIPAddress": "string",
            "localPort": "string",
            "remotePort": "string"
          },
          {
            "protocol": "Any",
            "localIPAddress": "string",
            "remoteIPAddress": "string",
            "localPort": "string",
            "remotePort": "string"
          }
        ]
      }
    },
    {
      "name": "string",
      "id": "string",
      "etag": "string",
      "properties": {
        "target": "string",
        "bytesToCapturePerPacket": 6,
        "totalBytesPerSession": 1073741824,
        "timeLimitInSeconds": 18000,
        "storageLocation": {
          "storageId": "string",
          "storagePath": "string",
          "filePath": "string"
        },
        "filters": [
          {
            "protocol": "Any",
            "localIPAddress": "string",
            "remoteIPAddress": "string",
            "localPort": "string",
            "remotePort": "string"
          },
          {
            "protocol": "Any",
            "localIPAddress": "string",
            "remoteIPAddress": "string",
            "localPort": "string",
            "remotePort": "string"
          },
          {
            "protocol": "Any",
            "localIPAddress": "string",
            "remoteIPAddress": "string",
            "localPort": "string",
            "remotePort": "string"
          },
          {
            "protocol": "Any",
            "localIPAddress": "string",
            "remoteIPAddress": "string",
            "localPort": "string",
            "remotePort": "string"
          },
          {
            "protocol": "Any",
            "localIPAddress": "string",
            "remoteIPAddress": "string",
            "localPort": "string",
            "remotePort": "string"
          },
          {
            "protocol": "Any",
            "localIPAddress": "string",
            "remoteIPAddress": "string",
            "localPort": "string",
            "remotePort": "string"
          }
        ]
      }
    },
    {
      "name": "string",
      "id": "string",
      "etag": "string",
      "properties": {
        "target": "string",
        "bytesToCapturePerPacket": 3,
        "totalBytesPerSession": 1073741824,
        "timeLimitInSeconds": 18000,
        "storageLocation": {
          "storageId": "string",
          "storagePath": "string",
          "filePath": "string"
        },
        "filters": [
          {
            "protocol": "Any",
            "localIPAddress": "string",
            "remoteIPAddress": "string",
            "localPort": "string",
            "remotePort": "string"
          },
          {
            "protocol": "Any",
            "localIPAddress": "string",
            "remoteIPAddress": "string",
            "localPort": "string",
            "remotePort": "string"
          },
          {
            "protocol": "Any",
            "localIPAddress": "string",
            "remoteIPAddress": "string",
            "localPort": "string",
            "remotePort": "string"
          },
          {
            "protocol": "Any",
            "localIPAddress": "string",
            "remoteIPAddress": "string",
            "localPort": "string",
            "remotePort": "string"
          },
          {
            "protocol": "Any",
            "localIPAddress": "string",
            "remoteIPAddress": "string",
            "localPort": "string",
            "remotePort": "string"
          },
          {
            "protocol": "Any",
            "localIPAddress": "string",
            "remoteIPAddress": "string",
            "localPort": "string",
            "remotePort": "string"
          },
          {
            "protocol": "Any",
            "localIPAddress": "string",
            "remoteIPAddress": "string",
            "localPort": "string",
            "remotePort": "string"
          }
        ]
      }
    },
    {
      "name": "string",
      "id": "string",
      "etag": "string",
      "properties": {
        "target": "string",
        "bytesToCapturePerPacket": 1,
        "totalBytesPerSession": 1073741824,
        "timeLimitInSeconds": 18000,
        "storageLocation": {
          "storageId": "string",
          "storagePath": "string",
          "filePath": "string"
        },
        "filters": [
          {
            "protocol": "Any",
            "localIPAddress": "string",
            "remoteIPAddress": "string",
            "localPort": "string",
            "remotePort": "string"
          },
          {
            "protocol": "Any",
            "localIPAddress": "string",
            "remoteIPAddress": "string",
            "localPort": "string",
            "remotePort": "string"
          },
          {
            "protocol": "Any",
            "localIPAddress": "string",
            "remoteIPAddress": "string",
            "localPort": "string",
            "remotePort": "string"
          },
          {
            "protocol": "Any",
            "localIPAddress": "string",
            "remoteIPAddress": "string",
            "localPort": "string",
            "remotePort": "string"
          },
          {
            "protocol": "Any",
            "localIPAddress": "string",
            "remoteIPAddress": "string",
            "localPort": "string",
            "remotePort": "string"
          },
          {
            "protocol": "Any",
            "localIPAddress": "string",
            "remoteIPAddress": "string",
            "localPort": "string",
            "remotePort": "string"
          },
          {
            "protocol": "Any",
            "localIPAddress": "string",
            "remoteIPAddress": "string",
            "localPort": "string",
            "remotePort": "string"
          },
          {
            "protocol": "Any",
            "localIPAddress": "string",
            "remoteIPAddress": "string",
            "localPort": "string",
            "remotePort": "string"
          },
          {
            "protocol": "Any",
            "localIPAddress": "string",
            "remoteIPAddress": "string",
            "localPort": "string",
            "remotePort": "string"
          },
          {
            "protocol": "Any",
            "localIPAddress": "string",
            "remoteIPAddress": "string",
            "localPort": "string",
            "remotePort": "string"
          }
        ]
      }
    },
    {
      "name": "string",
      "id": "string",
      "etag": "string",
      "properties": {
        "target": "string",
        "bytesToCapturePerPacket": 3,
        "totalBytesPerSession": 1073741824,
        "timeLimitInSeconds": 18000,
        "storageLocation": {
          "storageId": "string",
          "storagePath": "string",
          "filePath": "string"
        },
        "filters": [
          {
            "protocol": "Any",
            "localIPAddress": "string",
            "remoteIPAddress": "string",
            "localPort": "string",
            "remotePort": "string"
          },
          {
            "protocol": "Any",
            "localIPAddress": "string",
            "remoteIPAddress": "string",
            "localPort": "string",
            "remotePort": "string"
          },
          {
            "protocol": "Any",
            "localIPAddress": "string",
            "remoteIPAddress": "string",
            "localPort": "string",
            "remotePort": "string"
          },
          {
            "protocol": "Any",
            "localIPAddress": "string",
            "remoteIPAddress": "string",
            "localPort": "string",
            "remotePort": "string"
          }
        ]
      }
    },
    {
      "name": "string",
      "id": "string",
      "etag": "string",
      "properties": {
        "target": "string",
        "bytesToCapturePerPacket": 5,
        "totalBytesPerSession": 1073741824,
        "timeLimitInSeconds": 18000,
        "storageLocation": {
          "storageId": "string",
          "storagePath": "string",
          "filePath": "string"
        },
        "filters": [
          {
            "protocol": "Any",
            "localIPAddress": "string",
            "remoteIPAddress": "string",
            "localPort": "string",
            "remotePort": "string"
          },
          {
            "protocol": "Any",
            "localIPAddress": "string",
            "remoteIPAddress": "string",
            "localPort": "string",
            "remotePort": "string"
          },
          {
            "protocol": "Any",
            "localIPAddress": "string",
            "remoteIPAddress": "string",
            "localPort": "string",
            "remotePort": "string"
          },
          {
            "protocol": "Any",
            "localIPAddress": "string",
            "remoteIPAddress": "string",
            "localPort": "string",
            "remotePort": "string"
          },
          {
            "protocol": "Any",
            "localIPAddress": "string",
            "remoteIPAddress": "string",
            "localPort": "string",
            "remotePort": "string"
          }
        ]
      }
    },
    {
      "name": "string",
      "id": "string",
      "etag": "string",
      "properties": {
        "target": "string",
        "bytesToCapturePerPacket": 4,
        "totalBytesPerSession": 1073741824,
        "timeLimitInSeconds": 18000,
        "storageLocation": {
          "storageId": "string",
          "storagePath": "string",
          "filePath": "string"
        },
        "filters": [
          {
            "protocol": "Any",
            "localIPAddress": "string",
            "remoteIPAddress": "string",
            "localPort": "string",
            "remotePort": "string"
          }
        ]
      }
    }
  ]
}