{
  "actions": [
    {
      "name": "virtualNetworksDelete",
      "protocol": "REST",
      "method": "DELETE",
      "entitypath": "{base_path}/{version}/subscriptions/{pathv1}/resourceGroups/{pathv2}/providers/Microsoft.Network/virtualNetworks/{pathv3}?{query}",
      "requestSchema": "schema.json",
      "responseSchema": "schema.json",
      "timeout": 0,
      "sendEmpty": false,
      "sendGetBody": false,
      "requestDatatype": "JSON",
      "responseDatatype": "JSON",
      "headers": {},
      "responseObjects": [
        {
          "type": "default",
          "key": "",
          "mockFile": ""
        }
      ]
    },
    {
      "name": "virtualNetworksGet",
      "protocol": "REST",
      "method": "GET",
      "entitypath": "{base_path}/{version}/subscriptions/{pathv1}/resourceGroups/{pathv2}/providers/Microsoft.Network/virtualNetworks/{pathv3}?{query}",
      "requestSchema": "schema.json",
      "responseSchema": "schema.json",
      "timeout": 0,
      "sendEmpty": false,
      "sendGetBody": false,
      "requestDatatype": "JSON",
      "responseDatatype": "JSON",
      "headers": {},
      "responseObjects": [
        {
          "type": "default",
          "key": "",
          "mockFile": "mockdatafiles/virtualNetworksGet-default.json"
        }
      ]
    },
    {
      "name": "virtualNetworksCreateOrUpdate",
      "protocol": "REST",
      "method": "PUT",
      "entitypath": "{base_path}/{version}/subscriptions/{pathv1}/resourceGroups/{pathv2}/providers/Microsoft.Network/virtualNetworks/{pathv3}?{query}",
      "requestSchema": "schema.json",
      "responseSchema": "schema.json",
      "timeout": 0,
      "sendEmpty": false,
      "sendGetBody": false,
      "requestDatatype": "JSON",
      "responseDatatype": "JSON",
      "headers": {},
      "responseObjects": [
        {
          "type": "default",
          "key": "",
          "mockFile": "mockdatafiles/virtualNetworksCreateOrUpdate-default.json"
        }
      ]
    },
    {
      "name": "deployment",
      "protocol": "REST",
      "method": "PUT",
      "entitypath": "{base_path}/{version}/subscriptions/{pathv1}/resourceGroups/{pathv2}/providers/Microsoft.Resources/deployments/{pathv3}?{query}",
      "requestSchema": "schema.json",
      "responseSchema": "schema.json",
      "timeout": 0,
      "sendEmpty": false,
      "sendGetBody": false,
      "requestDatatype": "JSON",
      "responseDatatype": "JSON",
      "headers": {},
      "responseObjects": [
        {
          "type": "default",
          "key": "",
          "mockFile": "mockdatafiles/virtualNetworksCreateOrUpdate-default.json"
        }
      ]
    },
    {
      "name": "virtualNetworksUpdateTags",
      "protocol": "REST",
      "method": "PATCH",
      "entitypath": "{base_path}/{version}/subscriptions/{pathv1}/resourceGroups/{pathv2}/providers/Microsoft.Network/virtualNetworks/{pathv3}?{query}",
      "requestSchema": "schema.json",
      "responseSchema": "schema.json",
      "timeout": 0,
      "sendEmpty": false,
      "sendGetBody": false,
      "requestDatatype": "JSON",
      "responseDatatype": "JSON",
      "headers": {},
      "responseObjects": [
        {
          "type": "default",
          "key": "",
          "mockFile": "mockdatafiles/virtualNetworksUpdateTags-default.json"
        }
      ]
    },
    {
      "name": "virtualNetworksListAll",
      "protocol": "REST",
      "method": "GET",
      "entitypath": "{base_path}/{version}/subscriptions/{pathv1}/providers/Microsoft.Network/virtualNetworks?{query}",
      "requestSchema": "schema.json",
      "responseSchema": "schema.json",
      "timeout": 0,
      "sendEmpty": false,
      "sendGetBody": false,
      "requestDatatype": "JSON",
      "responseDatatype": "JSON",
      "headers": {},
      "responseObjects": [
        {
          "type": "default",
          "key": "",
          "mockFile": "mockdatafiles/virtualNetworksListAll-default.json"
        }
      ]
    },
    {
      "name": "virtualNetworksList",
      "protocol": "REST",
      "method": "GET",
      "entitypath": "{base_path}/{version}/subscriptions/{pathv1}/resourceGroups/{pathv2}/providers/Microsoft.Network/virtualNetworks?{query}",
      "requestSchema": "schema.json",
      "responseSchema": "schema.json",
      "timeout": 0,
      "sendEmpty": false,
      "sendGetBody": false,
      "requestDatatype": "JSON",
      "responseDatatype": "JSON",
      "headers": {},
      "responseObjects": [
        {
          "type": "default",
          "key": "",
          "mockFile": "mockdatafiles/virtualNetworksList-default.json"
        }
      ]
    }
  ]
}