{
  "sourceStatus": "Inactive",
  "states": [
    {
      "connectionState": "Reachable",
      "startTime": "string",
      "endTime": "string",
      "evaluationState": "NotStarted",
      "avgLatencyInMs": 2,
      "minLatencyInMs": 3,
      "maxLatencyInMs": 4,
      "probesSent": 1,
      "probesFailed": 8,
      "hops": [
        {
          "type": "string",
          "id": "string",
          "address": "string",
          "resourceId": "string",
          "nextHopIds": [
            "string",
            "string",
            "string",
            "string",
            "string"
          ],
          "issues": [
            {
              "origin": "Outbound",
              "severity": "Error",
              "type": "Unknown",
              "context": [
                {},
                {},
                {},
                {},
                {},
                {}
              ]
            },
            {
              "origin": "Inbound",
              "severity": "Error",
              "type": "PortThrottled",
              "context": [
                {},
                {},
                {},
                {},
                {},
                {},
                {},
                {}
              ]
            },
            {
              "origin": "Outbound",
              "severity": "Error",
              "type": "PortThrottled",
              "context": [
                {},
                {}
              ]
            },
            {
              "origin": "Outbound",
              "severity": "Warning",
              "type": "NetworkSecurityRule",
              "context": [
                {},
                {},
                {},
                {},
                {},
                {}
              ]
            },
            {
              "origin": "Inbound",
              "severity": "Error",
              "type": "Platform",
              "context": [
                {},
                {},
                {},
                {},
                {},
                {},
                {},
                {},
                {},
                {}
              ]
            },
            {
              "origin": "Inbound",
              "severity": "Error",
              "type": "AgentStopped",
              "context": [
                {},
                {},
                {},
                {},
                {}
              ]
            },
            {
              "origin": "Local",
              "severity": "Warning",
              "type": "UserDefinedRoute",
              "context": [
                {},
                {},
                {},
                {},
                {},
                {},
                {}
              ]
            },
            {
              "origin": "Inbound",
              "severity": "Error",
              "type": "Platform",
              "context": [
                {},
                {},
                {}
              ]
            },
            {
              "origin": "Local",
              "severity": "Warning",
              "type": "DnsResolution",
              "context": [
                {},
                {},
                {}
              ]
            }
          ]
        },
        {
          "type": "string",
          "id": "string",
          "address": "string",
          "resourceId": "string",
          "nextHopIds": [
            "string",
            "string",
            "string",
            "string",
            "string",
            "string"
          ],
          "issues": [
            {
              "origin": "Inbound",
              "severity": "Error",
              "type": "Unknown",
              "context": [
                {},
                {},
                {},
                {},
                {},
                {},
                {}
              ]
            },
            {
              "origin": "Inbound",
              "severity": "Warning",
              "type": "GuestFirewall",
              "context": [
                {},
                {},
                {},
                {},
                {}
              ]
            },
            {
              "origin": "Outbound",
              "severity": "Warning",
              "type": "AgentStopped",
              "context": [
                {}
              ]
            },
            {
              "origin": "Local",
              "severity": "Error",
              "type": "Unknown",
              "context": [
                {},
                {},
                {},
                {}
              ]
            }
          ]
        },
        {
          "type": "string",
          "id": "string",
          "address": "string",
          "resourceId": "string",
          "nextHopIds": [
            "string",
            "string",
            "string",
            "string",
            "string",
            "string"
          ],
          "issues": [
            {
              "origin": "Local",
              "severity": "Error",
              "type": "SocketBind",
              "context": [
                {},
                {},
                {}
              ]
            },
            {
              "origin": "Local",
              "severity": "Warning",
              "type": "SocketBind",
              "context": [
                {},
                {},
                {},
                {},
                {},
                {},
                {},
                {},
                {}
              ]
            },
            {
              "origin": "Outbound",
              "severity": "Warning",
              "type": "DnsResolution",
              "context": [
                {},
                {},
                {},
                {},
                {},
                {}
              ]
            },
            {
              "origin": "Outbound",
              "severity": "Error",
              "type": "Unknown",
              "context": [
                {},
                {},
                {},
                {},
                {},
                {},
                {},
                {},
                {},
                {}
              ]
            },
            {
              "origin": "Inbound",
              "severity": "Warning",
              "type": "NetworkSecurityRule",
              "context": [
                {},
                {},
                {}
              ]
            }
          ]
        },
        {
          "type": "string",
          "id": "string",
          "address": "string",
          "resourceId": "string",
          "nextHopIds": [
            "string",
            "string",
            "string",
            "string",
            "string",
            "string",
            "string",
            "string"
          ],
          "issues": [
            {
              "origin": "Outbound",
              "severity": "Warning",
              "type": "DnsResolution",
              "context": [
                {},
                {}
              ]
            }
          ]
        },
        {
          "type": "string",
          "id": "string",
          "address": "string",
          "resourceId": "string",
          "nextHopIds": [
            "string",
            "string",
            "string",
            "string",
            "string"
          ],
          "issues": [
            {
              "origin": "Local",
              "severity": "Warning",
              "type": "NetworkSecurityRule",
              "context": [
                {},
                {},
                {},
                {}
              ]
            },
            {
              "origin": "Inbound",
              "severity": "Error",
              "type": "UserDefinedRoute",
              "context": [
                {},
                {},
                {},
                {},
                {},
                {}
              ]
            },
            {
              "origin": "Outbound",
              "severity": "Warning",
              "type": "NetworkSecurityRule",
              "context": [
                {},
                {},
                {},
                {},
                {},
                {},
                {},
                {},
                {},
                {}
              ]
            },
            {
              "origin": "Inbound",
              "severity": "Error",
              "type": "GuestFirewall",
              "context": [
                {},
                {},
                {},
                {},
                {},
                {}
              ]
            },
            {
              "origin": "Outbound",
              "severity": "Warning",
              "type": "DnsResolution",
              "context": [
                {},
                {},
                {},
                {},
                {},
                {}
              ]
            },
            {
              "origin": "Local",
              "severity": "Error",
              "type": "DnsResolution",
              "context": [
                {},
                {}
              ]
            }
          ]
        },
        {
          "type": "string",
          "id": "string",
          "address": "string",
          "resourceId": "string",
          "nextHopIds": [
            "string",
            "string",
            "string",
            "string",
            "string",
            "string"
          ],
          "issues": [
            {
              "origin": "Local",
              "severity": "Warning",
              "type": "PortThrottled",
              "context": [
                {},
                {},
                {},
                {},
                {},
                {},
                {},
                {}
              ]
            },
            {
              "origin": "Outbound",
              "severity": "Warning",
              "type": "UserDefinedRoute",
              "context": [
                {},
                {},
                {},
                {},
                {},
                {},
                {},
                {},
                {}
              ]
            },
            {
              "origin": "Local",
              "severity": "Error",
              "type": "PortThrottled",
              "context": [
                {},
                {},
                {}
              ]
            }
          ]
        },
        {
          "type": "string",
          "id": "string",
          "address": "string",
          "resourceId": "string",
          "nextHopIds": [
            "string"
          ],
          "issues": [
            {
              "origin": "Local",
              "severity": "Error",
              "type": "Unknown",
              "context": [
                {},
                {},
                {},
                {}
              ]
            },
            {
              "origin": "Inbound",
              "severity": "Warning",
              "type": "UserDefinedRoute",
              "context": [
                {},
                {},
                {},
                {},
                {},
                {},
                {},
                {},
                {},
                {}
              ]
            }
          ]
        }
      ]
    },
    {
      "connectionState": "Reachable",
      "startTime": "string",
      "endTime": "string",
      "evaluationState": "Completed",
      "avgLatencyInMs": 6,
      "minLatencyInMs": 4,
      "maxLatencyInMs": 7,
      "probesSent": 9,
      "probesFailed": 2,
      "hops": [
        {
          "type": "string",
          "id": "string",
          "address": "string",
          "resourceId": "string",
          "nextHopIds": [
            "string",
            "string",
            "string",
            "string",
            "string",
            "string",
            "string",
            "string",
            "string",
            "string"
          ],
          "issues": [
            {
              "origin": "Outbound",
              "severity": "Warning",
              "type": "PortThrottled",
              "context": [
                {},
                {},
                {},
                {},
                {},
                {},
                {},
                {}
              ]
            },
            {
              "origin": "Inbound",
              "severity": "Warning",
              "type": "NetworkSecurityRule",
              "context": [
                {},
                {},
                {},
                {},
                {},
                {}
              ]
            },
            {
              "origin": "Inbound",
              "severity": "Error",
              "type": "Unknown",
              "context": [
                {},
                {},
                {},
                {},
                {},
                {},
                {},
                {}
              ]
            },
            {
              "origin": "Local",
              "severity": "Error",
              "type": "DnsResolution",
              "context": [
                {},
                {},
                {},
                {},
                {},
                {},
                {}
              ]
            },
            {
              "origin": "Inbound",
              "severity": "Warning",
              "type": "SocketBind",
              "context": [
                {},
                {},
                {},
                {},
                {},
                {},
                {},
                {},
                {}
              ]
            },
            {
              "origin": "Inbound",
              "severity": "Warning",
              "type": "AgentStopped",
              "context": [
                {},
                {},
                {},
                {},
                {}
              ]
            },
            {
              "origin": "Inbound",
              "severity": "Error",
              "type": "SocketBind",
              "context": [
                {}
              ]
            },
            {
              "origin": "Inbound",
              "severity": "Error",
              "type": "GuestFirewall",
              "context": [
                {},
                {},
                {},
                {},
                {},
                {},
                {},
                {},
                {},
                {}
              ]
            }
          ]
        },
        {
          "type": "string",
          "id": "string",
          "address": "string",
          "resourceId": "string",
          "nextHopIds": [
            "string",
            "string",
            "string",
            "string",
            "string"
          ],
          "issues": [
            {
              "origin": "Inbound",
              "severity": "Error",
              "type": "SocketBind",
              "context": [
                {},
                {},
                {},
                {},
                {},
                {}
              ]
            },
            {
              "origin": "Local",
              "severity": "Warning",
              "type": "PortThrottled",
              "context": [
                {},
                {},
                {},
                {},
                {}
              ]
            },
            {
              "origin": "Local",
              "severity": "Error",
              "type": "GuestFirewall",
              "context": [
                {},
                {},
                {}
              ]
            },
            {
              "origin": "Inbound",
              "severity": "Warning",
              "type": "GuestFirewall",
              "context": [
                {},
                {},
                {},
                {},
                {}
              ]
            },
            {
              "origin": "Outbound",
              "severity": "Error",
              "type": "Unknown",
              "context": [
                {},
                {},
                {}
              ]
            },
            {
              "origin": "Local",
              "severity": "Error",
              "type": "DnsResolution",
              "context": [
                {},
                {}
              ]
            },
            {
              "origin": "Outbound",
              "severity": "Warning",
              "type": "Unknown",
              "context": [
                {},
                {},
                {}
              ]
            },
            {
              "origin": "Local",
              "severity": "Error",
              "type": "AgentStopped",
              "context": [
                {},
                {},
                {},
                {},
                {},
                {},
                {},
                {},
                {},
                {}
              ]
            },
            {
              "origin": "Inbound",
              "severity": "Error",
              "type": "Platform",
              "context": [
                {},
                {},
                {},
                {},
                {},
                {},
                {},
                {},
                {}
              ]
            },
            {
              "origin": "Inbound",
              "severity": "Error",
              "type": "Platform",
              "context": [
                {},
                {},
                {}
              ]
            }
          ]
        },
        {
          "type": "string",
          "id": "string",
          "address": "string",
          "resourceId": "string",
          "nextHopIds": [
            "string",
            "string",
            "string",
            "string"
          ],
          "issues": [
            {
              "origin": "Local",
              "severity": "Warning",
              "type": "NetworkSecurityRule",
              "context": [
                {},
                {}
              ]
            },
            {
              "origin": "Local",
              "severity": "Warning",
              "type": "Unknown",
              "context": [
                {},
                {},
                {},
                {},
                {},
                {},
                {},
                {},
                {},
                {}
              ]
            },
            {
              "origin": "Local",
              "severity": "Error",
              "type": "DnsResolution",
              "context": [
                {},
                {},
                {},
                {}
              ]
            },
            {
              "origin": "Local",
              "severity": "Warning",
              "type": "Unknown",
              "context": [
                {},
                {},
                {},
                {},
                {},
                {}
              ]
            }
          ]
        },
        {
          "type": "string",
          "id": "string",
          "address": "string",
          "resourceId": "string",
          "nextHopIds": [
            "string",
            "string"
          ],
          "issues": [
            {
              "origin": "Outbound",
              "severity": "Warning",
              "type": "Platform",
              "context": [
                {},
                {},
                {},
                {},
                {},
                {},
                {},
                {},
                {}
              ]
            },
            {
              "origin": "Outbound",
              "severity": "Error",
              "type": "NetworkSecurityRule",
              "context": [
                {},
                {},
                {},
                {},
                {},
                {},
                {}
              ]
            },
            {
              "origin": "Local",
              "severity": "Error",
              "type": "GuestFirewall",
              "context": [
                {},
                {},
                {},
                {},
                {},
                {}
              ]
            },
            {
              "origin": "Local",
              "severity": "Warning",
              "type": "UserDefinedRoute",
              "context": [
                {},
                {},
                {},
                {},
                {}
              ]
            },
            {
              "origin": "Local",
              "severity": "Error",
              "type": "UserDefinedRoute",
              "context": [
                {}
              ]
            }
          ]
        },
        {
          "type": "string",
          "id": "string",
          "address": "string",
          "resourceId": "string",
          "nextHopIds": [
            "string"
          ],
          "issues": [
            {
              "origin": "Outbound",
              "severity": "Warning",
              "type": "DnsResolution",
              "context": [
                {},
                {},
                {},
                {}
              ]
            },
            {
              "origin": "Inbound",
              "severity": "Warning",
              "type": "Platform",
              "context": [
                {},
                {},
                {},
                {},
                {},
                {}
              ]
            },
            {
              "origin": "Inbound",
              "severity": "Warning",
              "type": "GuestFirewall",
              "context": [
                {}
              ]
            }
          ]
        },
        {
          "type": "string",
          "id": "string",
          "address": "string",
          "resourceId": "string",
          "nextHopIds": [
            "string",
            "string",
            "string",
            "string",
            "string",
            "string",
            "string"
          ],
          "issues": [
            {
              "origin": "Local",
              "severity": "Error",
              "type": "Unknown",
              "context": [
                {}
              ]
            },
            {
              "origin": "Outbound",
              "severity": "Error",
              "type": "AgentStopped",
              "context": [
                {},
                {},
                {},
                {},
                {},
                {},
                {}
              ]
            },
            {
              "origin": "Local",
              "severity": "Warning",
              "type": "NetworkSecurityRule",
              "context": [
                {},
                {},
                {},
                {}
              ]
            },
            {
              "origin": "Inbound",
              "severity": "Error",
              "type": "GuestFirewall",
              "context": [
                {},
                {},
                {},
                {}
              ]
            },
            {
              "origin": "Outbound",
              "severity": "Warning",
              "type": "UserDefinedRoute",
              "context": [
                {},
                {},
                {},
                {}
              ]
            },
            {
              "origin": "Local",
              "severity": "Error",
              "type": "AgentStopped",
              "context": [
                {},
                {}
              ]
            }
          ]
        },
        {
          "type": "string",
          "id": "string",
          "address": "string",
          "resourceId": "string",
          "nextHopIds": [
            "string",
            "string",
            "string",
            "string"
          ],
          "issues": [
            {
              "origin": "Local",
              "severity": "Error",
              "type": "UserDefinedRoute",
              "context": [
                {},
                {},
                {},
                {},
                {},
                {},
                {},
                {}
              ]
            },
            {
              "origin": "Local",
              "severity": "Warning",
              "type": "GuestFirewall",
              "context": [
                {},
                {},
                {},
                {},
                {},
                {},
                {},
                {},
                {},
                {}
              ]
            },
            {
              "origin": "Inbound",
              "severity": "Error",
              "type": "Unknown",
              "context": [
                {}
              ]
            },
            {
              "origin": "Outbound",
              "severity": "Warning",
              "type": "DnsResolution",
              "context": [
                {},
                {},
                {},
                {},
                {},
                {},
                {},
                {},
                {},
                {}
              ]
            },
            {
              "origin": "Outbound",
              "severity": "Warning",
              "type": "GuestFirewall",
              "context": [
                {},
                {},
                {},
                {},
                {},
                {},
                {},
                {},
                {}
              ]
            },
            {
              "origin": "Outbound",
              "severity": "Warning",
              "type": "Platform",
              "context": [
                {},
                {},
                {},
                {},
                {}
              ]
            }
          ]
        },
        {
          "type": "string",
          "id": "string",
          "address": "string",
          "resourceId": "string",
          "nextHopIds": [
            "string",
            "string",
            "string",
            "string",
            "string",
            "string",
            "string",
            "string",
            "string"
          ],
          "issues": [
            {
              "origin": "Inbound",
              "severity": "Warning",
              "type": "NetworkSecurityRule",
              "context": [
                {},
                {},
                {},
                {},
                {},
                {},
                {}
              ]
            },
            {
              "origin": "Inbound",
              "severity": "Error",
              "type": "DnsResolution",
              "context": [
                {},
                {},
                {},
                {},
                {},
                {}
              ]
            },
            {
              "origin": "Local",
              "severity": "Warning",
              "type": "Unknown",
              "context": [
                {},
                {},
                {},
                {},
                {},
                {},
                {},
                {},
                {}
              ]
            },
            {
              "origin": "Outbound",
              "severity": "Warning",
              "type": "AgentStopped",
              "context": [
                {},
                {},
                {},
                {},
                {},
                {},
                {},
                {},
                {}
              ]
            },
            {
              "origin": "Outbound",
              "severity": "Error",
              "type": "GuestFirewall",
              "context": [
                {},
                {},
                {},
                {},
                {},
                {}
              ]
            },
            {
              "origin": "Local",
              "severity": "Warning",
              "type": "NetworkSecurityRule",
              "context": [
                {}
              ]
            },
            {
              "origin": "Local",
              "severity": "Warning",
              "type": "AgentStopped",
              "context": [
                {},
                {},
                {},
                {},
                {}
              ]
            },
            {
              "origin": "Inbound",
              "severity": "Error",
              "type": "UserDefinedRoute",
              "context": [
                {},
                {},
                {}
              ]
            }
          ]
        },
        {
          "type": "string",
          "id": "string",
          "address": "string",
          "resourceId": "string",
          "nextHopIds": [
            "string",
            "string",
            "string",
            "string",
            "string"
          ],
          "issues": [
            {
              "origin": "Outbound",
              "severity": "Warning",
              "type": "DnsResolution",
              "context": [
                {},
                {},
                {},
                {},
                {},
                {}
              ]
            }
          ]
        },
        {
          "type": "string",
          "id": "string",
          "address": "string",
          "resourceId": "string",
          "nextHopIds": [
            "string",
            "string",
            "string",
            "string",
            "string",
            "string",
            "string",
            "string"
          ],
          "issues": [
            {
              "origin": "Outbound",
              "severity": "Error",
              "type": "AgentStopped",
              "context": [
                {},
                {},
                {},
                {}
              ]
            },
            {
              "origin": "Local",
              "severity": "Warning",
              "type": "GuestFirewall",
              "context": [
                {},
                {},
                {}
              ]
            },
            {
              "origin": "Local",
              "severity": "Error",
              "type": "NetworkSecurityRule",
              "context": [
                {},
                {},
                {},
                {},
                {},
                {},
                {},
                {}
              ]
            },
            {
              "origin": "Inbound",
              "severity": "Warning",
              "type": "GuestFirewall",
              "context": [
                {},
                {},
                {},
                {},
                {},
                {}
              ]
            },
            {
              "origin": "Outbound",
              "severity": "Error",
              "type": "Unknown",
              "context": [
                {},
                {},
                {},
                {},
                {}
              ]
            },
            {
              "origin": "Local",
              "severity": "Error",
              "type": "UserDefinedRoute",
              "context": [
                {},
                {},
                {},
                {}
              ]
            },
            {
              "origin": "Outbound",
              "severity": "Error",
              "type": "Unknown",
              "context": [
                {},
                {},
                {},
                {},
                {},
                {},
                {},
                {},
                {},
                {}
              ]
            },
            {
              "origin": "Outbound",
              "severity": "Warning",
              "type": "SocketBind",
              "context": [
                {},
                {},
                {},
                {},
                {},
                {}
              ]
            }
          ]
        }
      ]
    }
  ]
}