{
    "$id": "schema.json",
    "type": "object",
    "schema": "http://json-schema.org/draft-07/schema#",
    "translate": true,
    "dynamicfields": true,
    "properties": {
      "ph_request_type": {
        "type": "string",
        "description": "type of request (internal to adapter)",
        "default": "virtualMachinesListAll",
        "enum": [
          "virtualMachinesListAll",
          "virtualMachinesList",
          "virtualMachinesGet",
          "virtualMachinesDelete",
          "virtualMachinesCreateOrUpdate",
          "virtualMachinesStart",
          "virtualMachinesRestart",
          "virtualMachinesPowerOff",
          "virtualMachinesRunCommand"
        ],
        "external_name": "ph_request_type"
      },
      "apiVersion": {
        "type": "string",
        "description": "Client API version.",
        "parse": false,
        "encode": false,
        "encrypt": {
          "type": "AES",
          "key": ""
        },
        "external_name": "api-version"
      },
      "expand": {
        "type": "string",
        "description": "The expand expression to apply on the operation.",
        "parse": false,
        "encode": false,
        "encrypt": {
          "type": "AES",
          "key": ""
        },
        "external_name": "$expand"
      },
      "filter": {
        "type": "string",
        "description": "The expand expression to apply on the operation.",
        "parse": false,
        "encode": false,
        "encrypt": {
          "type": "AES",
          "key": ""
        },
        "external_name": "$filter"
      }
    },
    "definitions": {}
  }