{
  "actions": [
    {
      "name": "publicIPAddressesDelete",
      "protocol": "REST",
      "method": "DELETE",
      "entitypath": "{base_path}/{version}/subscriptions/{pathv1}/resourceGroups/{pathv2}/providers/Microsoft.Network/publicIPAddresses/{pathv3}?{query}",
      "requestSchema": "schema.json",
      "responseSchema": "schema.json",
      "timeout": 0,
      "sendEmpty": false,
      "sendGetBody": false,
      "requestDatatype": "JSON",
      "responseDatatype": "JSON",
      "headers": {},
      "responseObjects": [
        {
          "type": "default",
          "key": "",
          "mockFile": ""
        }
      ]
    },
    {
      "name": "publicIPAddressesGet",
      "protocol": "REST",
      "method": "GET",
      "entitypath": "{base_path}/{version}/subscriptions/{pathv1}/resourceGroups/{pathv2}/providers/Microsoft.Network/publicIPAddresses/{pathv3}?{query}",
      "requestSchema": "schema.json",
      "responseSchema": "schema.json",
      "timeout": 0,
      "sendEmpty": false,
      "sendGetBody": false,
      "requestDatatype": "JSON",
      "responseDatatype": "JSON",
      "headers": {},
      "responseObjects": [
        {
          "type": "default",
          "key": "",
          "mockFile": "mockdatafiles/publicIPAddressesGet-default.json"
        }
      ]
    },
    {
      "name": "publicIPAddressesCreateOrUpdate",
      "protocol": "REST",
      "method": "PUT",
      "entitypath": "{base_path}/{version}/subscriptions/{pathv1}/resourceGroups/{pathv2}/providers/Microsoft.Network/publicIPAddresses/{pathv3}?{query}",
      "requestSchema": "schema.json",
      "responseSchema": "schema.json",
      "timeout": 0,
      "sendEmpty": false,
      "sendGetBody": false,
      "requestDatatype": "JSON",
      "responseDatatype": "JSON",
      "headers": {},
      "responseObjects": [
        {
          "type": "default",
          "key": "",
          "mockFile": "mockdatafiles/publicIPAddressesCreateOrUpdate-default.json"
        }
      ]
    },
    {
      "name": "publicIPAddressesUpdateTags",
      "protocol": "REST",
      "method": "PATCH",
      "entitypath": "{base_path}/{version}/subscriptions/{pathv1}/resourceGroups/{pathv2}/providers/Microsoft.Network/publicIPAddresses/{pathv3}?{query}",
      "requestSchema": "schema.json",
      "responseSchema": "schema.json",
      "timeout": 0,
      "sendEmpty": false,
      "sendGetBody": false,
      "requestDatatype": "JSON",
      "responseDatatype": "JSON",
      "headers": {},
      "responseObjects": [
        {
          "type": "default",
          "key": "",
          "mockFile": "mockdatafiles/publicIPAddressesUpdateTags-default.json"
        }
      ]
    },
    {
      "name": "publicIPAddressesListAll",
      "protocol": "REST",
      "method": "GET",
      "entitypath": "{base_path}/{version}/subscriptions/{pathv1}/providers/Microsoft.Network/publicIPAddresses?{query}",
      "requestSchema": "schema.json",
      "responseSchema": "schema.json",
      "timeout": 0,
      "sendEmpty": false,
      "sendGetBody": false,
      "requestDatatype": "JSON",
      "responseDatatype": "JSON",
      "headers": {},
      "responseObjects": [
        {
          "type": "default",
          "key": "",
          "mockFile": "mockdatafiles/publicIPAddressesListAll-default.json"
        }
      ]
    },
    {
      "name": "publicIPAddressesList",
      "protocol": "REST",
      "method": "GET",
      "entitypath": "{base_path}/{version}/subscriptions/{pathv1}/resourceGroups/{pathv2}/providers/Microsoft.Network/publicIPAddresses?{query}",
      "requestSchema": "schema.json",
      "responseSchema": "schema.json",
      "timeout": 0,
      "sendEmpty": false,
      "sendGetBody": false,
      "requestDatatype": "JSON",
      "responseDatatype": "JSON",
      "headers": {},
      "responseObjects": [
        {
          "type": "default",
          "key": "",
          "mockFile": "mockdatafiles/publicIPAddressesList-default.json"
        }
      ]
    }
  ]
}