{
  "value": [
    {
      "id": "string",
      "name": "string",
      "type": "string",
      "location": "string",
      "tags": {}
    },
    {
      "id": "string",
      "name": "string",
      "type": "string",
      "location": "string",
      "tags": {}
    },
    {
      "id": "string",
      "name": "string",
      "type": "string",
      "location": "string",
      "tags": {}
    }
  ]
}