{
  "actions": [
    {
      "name": "natGatewaysDelete",
      "protocol": "REST",
      "method": "DELETE",
      "entitypath": "{base_path}/{version}/subscriptions/{pathv1}/resourceGroups/{pathv2}/providers/Microsoft.Network/natGateways/{pathv3}?{query}",
      "requestSchema": "schema.json",
      "responseSchema": "schema.json",
      "timeout": 0,
      "sendEmpty": false,
      "sendGetBody": false,
      "requestDatatype": "JSON",
      "responseDatatype": "JSON",
      "headers": {},
      "responseObjects": [
        {
          "type": "default",
          "key": "",
          "mockFile": ""
        }
      ]
    },
    {
      "name": "natGatewaysGet",
      "protocol": "REST",
      "method": "GET",
      "entitypath": "{base_path}/{version}/subscriptions/{pathv1}/resourceGroups/{pathv2}/providers/Microsoft.Network/natGateways/{pathv3}?{query}",
      "requestSchema": "schema.json",
      "responseSchema": "schema.json",
      "timeout": 0,
      "sendEmpty": false,
      "sendGetBody": false,
      "requestDatatype": "JSON",
      "responseDatatype": "JSON",
      "headers": {},
      "responseObjects": [
        {
          "type": "default",
          "key": "",
          "mockFile": "mockdatafiles/natGatewaysGet-default.json"
        }
      ]
    },
    {
      "name": "natGatewaysCreateOrUpdate",
      "protocol": "REST",
      "method": "PUT",
      "entitypath": "{base_path}/{version}/subscriptions/{pathv1}/resourceGroups/{pathv2}/providers/Microsoft.Network/natGateways/{pathv3}?{query}",
      "requestSchema": "schema.json",
      "responseSchema": "schema.json",
      "timeout": 0,
      "sendEmpty": false,
      "sendGetBody": false,
      "requestDatatype": "JSON",
      "responseDatatype": "JSON",
      "headers": {},
      "responseObjects": [
        {
          "type": "default",
          "key": "",
          "mockFile": "mockdatafiles/natGatewaysCreateOrUpdate-default.json"
        }
      ]
    },
    {
      "name": "natGatewaysUpdateTags",
      "protocol": "REST",
      "method": "PATCH",
      "entitypath": "{base_path}/{version}/subscriptions/{pathv1}/resourceGroups/{pathv2}/providers/Microsoft.Network/natGateways/{pathv3}?{query}",
      "requestSchema": "schema.json",
      "responseSchema": "schema.json",
      "timeout": 0,
      "sendEmpty": false,
      "sendGetBody": false,
      "requestDatatype": "JSON",
      "responseDatatype": "JSON",
      "headers": {},
      "responseObjects": [
        {
          "type": "default",
          "key": "",
          "mockFile": "mockdatafiles/natGatewaysUpdateTags-default.json"
        }
      ]
    },
    {
      "name": "natGatewaysListAll",
      "protocol": "REST",
      "method": "GET",
      "entitypath": "{base_path}/{version}/subscriptions/{pathv1}/providers/Microsoft.Network/natGateways?{query}",
      "requestSchema": "schema.json",
      "responseSchema": "schema.json",
      "timeout": 0,
      "sendEmpty": false,
      "sendGetBody": false,
      "requestDatatype": "JSON",
      "responseDatatype": "JSON",
      "headers": {},
      "responseObjects": [
        {
          "type": "default",
          "key": "",
          "mockFile": "mockdatafiles/natGatewaysListAll-default.json"
        }
      ]
    },
    {
      "name": "natGatewaysList",
      "protocol": "REST",
      "method": "GET",
      "entitypath": "{base_path}/{version}/subscriptions/{pathv1}/resourceGroups/{pathv2}/providers/Microsoft.Network/natGateways?{query}",
      "requestSchema": "schema.json",
      "responseSchema": "schema.json",
      "timeout": 0,
      "sendEmpty": false,
      "sendGetBody": false,
      "requestDatatype": "JSON",
      "responseDatatype": "JSON",
      "headers": {},
      "responseObjects": [
        {
          "type": "default",
          "key": "",
          "mockFile": "mockdatafiles/natGatewaysList-default.json"
        }
      ]
    }
  ]
}