{
  "$id": "schema.json",
  "type": "object",
  "schema": "http://json-schema.org/draft-07/schema#",
  "translate": true,
  "dynamicfields": true,
  "properties": {
    "ph_request_type": {
      "type": "string",
      "description": "type of request (internal to adapter)",
      "default": "virtualRoutersDelete",
      "enum": [
        "virtualRoutersDelete",
        "virtualRoutersGet",
        "virtualRoutersCreateOrUpdate",
        "virtualRoutersListByResourceGroup",
        "virtualRoutersList"
      ],
      "external_name": "ph_request_type"
    },
    "apiVersion": {
      "type": "string",
      "description": "Client API version.",
      "parse": false,
      "encode": false,
      "encrypt": {
        "type": "AES",
        "key": ""
      },
      "external_name": "api-version"
    },
    "expand": {
      "type": "string",
      "description": "Expands referenced resources.",
      "parse": false,
      "encode": false,
      "encrypt": {
        "type": "AES",
        "key": ""
      },
      "external_name": "$expand"
    }
  },
  "definitions": {}
}