{
  "value": [
    {
      "name": "string",
      "id": "string",
      "type": "string",
      "serviceName": "string",
      "actions": [
        "string",
        "string",
        "string",
        "string",
        "string",
        "string"
      ]
    },
    {
      "name": "string",
      "id": "string",
      "type": "string",
      "serviceName": "string",
      "actions": [
        "string",
        "string",
        "string",
        "string",
        "string"
      ]
    },
    {
      "name": "string",
      "id": "string",
      "type": "string",
      "serviceName": "string",
      "actions": [
        "string",
        "string",
        "string",
        "string",
        "string"
      ]
    },
    {
      "name": "string",
      "id": "string",
      "type": "string",
      "serviceName": "string",
      "actions": [
        "string",
        "string",
        "string",
        "string",
        "string",
        "string",
        "string",
        "string"
      ]
    },
    {
      "name": "string",
      "id": "string",
      "type": "string",
      "serviceName": "string",
      "actions": [
        "string",
        "string",
        "string",
        "string",
        "string",
        "string",
        "string",
        "string"
      ]
    },
    {
      "name": "string",
      "id": "string",
      "type": "string",
      "serviceName": "string",
      "actions": [
        "string",
        "string",
        "string",
        "string",
        "string",
        "string",
        "string",
        "string"
      ]
    },
    {
      "name": "string",
      "id": "string",
      "type": "string",
      "serviceName": "string",
      "actions": [
        "string",
        "string",
        "string",
        "string",
        "string",
        "string",
        "string",
        "string",
        "string"
      ]
    }
  ],
  "nextLink": "string"
}