{
  "value": [
    {
      "id": "string",
      "unit": "Count",
      "currentValue": 7,
      "limit": 6,
      "name": {
        "value": "string",
        "localizedValue": "string"
      }
    },
    {
      "id": "string",
      "unit": "Count",
      "currentValue": 5,
      "limit": 9,
      "name": {
        "value": "string",
        "localizedValue": "string"
      }
    },
    {
      "id": "string",
      "unit": "Count",
      "currentValue": 3,
      "limit": 1,
      "name": {
        "value": "string",
        "localizedValue": "string"
      }
    },
    {
      "id": "string",
      "unit": "Count",
      "currentValue": 2,
      "limit": 4,
      "name": {
        "value": "string",
        "localizedValue": "string"
      }
    },
    {
      "id": "string",
      "unit": "Count",
      "currentValue": 7,
      "limit": 4,
      "name": {
        "value": "string",
        "localizedValue": "string"
      }
    },
    {
      "id": "string",
      "unit": "Count",
      "currentValue": 8,
      "limit": 2,
      "name": {
        "value": "string",
        "localizedValue": "string"
      }
    },
    {
      "id": "string",
      "unit": "Count",
      "currentValue": 3,
      "limit": 5,
      "name": {
        "value": "string",
        "localizedValue": "string"
      }
    },
    {
      "id": "string",
      "unit": "Count",
      "currentValue": 10,
      "limit": 8,
      "name": {
        "value": "string",
        "localizedValue": "string"
      }
    },
    {
      "id": "string",
      "unit": "Count",
      "currentValue": 4,
      "limit": 5,
      "name": {
        "value": "string",
        "localizedValue": "string"
      }
    },
    {
      "id": "string",
      "unit": "Count",
      "currentValue": 7,
      "limit": 4,
      "name": {
        "value": "string",
        "localizedValue": "string"
      }
    }
  ],
  "nextLink": "string"
}