{
  "actions": [
    {
      "name": "expressRouteCircuitsGetStats",
      "protocol": "REST",
      "method": "GET",
      "entitypath": "{base_path}/{version}/subscriptions/{pathv1}/resourceGroups/{pathv2}/providers/Microsoft.Network/expressRouteCircuits/{pathv3}/stats?{query}",
      "requestSchema": "schema.json",
      "responseSchema": "schema.json",
      "timeout": 0,
      "sendEmpty": false,
      "sendGetBody": false,
      "requestDatatype": "JSON",
      "responseDatatype": "JSON",
      "headers": {},
      "responseObjects": [
        {
          "type": "default",
          "key": "",
          "mockFile": "mockdatafiles/expressRouteCircuitsGetStats-default.json"
        }
      ]
    },
    {
      "name": "expressRouteCircuitsGetPeeringStats",
      "protocol": "REST",
      "method": "GET",
      "entitypath": "{base_path}/{version}/subscriptions/{pathv1}/resourceGroups/{pathv2}/providers/Microsoft.Network/expressRouteCircuits/{pathv3}/peerings/{pathv4}/stats?{query}",
      "requestSchema": "schema.json",
      "responseSchema": "schema.json",
      "timeout": 0,
      "sendEmpty": false,
      "sendGetBody": false,
      "requestDatatype": "JSON",
      "responseDatatype": "JSON",
      "headers": {},
      "responseObjects": [
        {
          "type": "default",
          "key": "",
          "mockFile": "mockdatafiles/expressRouteCircuitsGetPeeringStats-default.json"
        }
      ]
    }
  ]
}