{
  "actions": [
    {
      "name": "virtualRouterPeeringsDelete",
      "protocol": "REST",
      "method": "DELETE",
      "entitypath": "{base_path}/{version}/subscriptions/{pathv1}/resourceGroups/{pathv2}/providers/Microsoft.Network/virtualRouters/{pathv3}/peerings/{pathv4}?{query}",
      "requestSchema": "schema.json",
      "responseSchema": "schema.json",
      "timeout": 0,
      "sendEmpty": false,
      "sendGetBody": false,
      "requestDatatype": "JSON",
      "responseDatatype": "JSON",
      "headers": {},
      "responseObjects": [
        {
          "type": "default",
          "key": "",
          "mockFile": ""
        }
      ]
    },
    {
      "name": "virtualRouterPeeringsGet",
      "protocol": "REST",
      "method": "GET",
      "entitypath": "{base_path}/{version}/subscriptions/{pathv1}/resourceGroups/{pathv2}/providers/Microsoft.Network/virtualRouters/{pathv3}/peerings/{pathv4}?{query}",
      "requestSchema": "schema.json",
      "responseSchema": "schema.json",
      "timeout": 0,
      "sendEmpty": false,
      "sendGetBody": false,
      "requestDatatype": "JSON",
      "responseDatatype": "JSON",
      "headers": {},
      "responseObjects": [
        {
          "type": "default",
          "key": "",
          "mockFile": "mockdatafiles/virtualRouterPeeringsGet-default.json"
        }
      ]
    },
    {
      "name": "virtualRouterPeeringsCreateOrUpdate",
      "protocol": "REST",
      "method": "PUT",
      "entitypath": "{base_path}/{version}/subscriptions/{pathv1}/resourceGroups/{pathv2}/providers/Microsoft.Network/virtualRouters/{pathv3}/peerings/{pathv4}?{query}",
      "requestSchema": "schema.json",
      "responseSchema": "schema.json",
      "timeout": 0,
      "sendEmpty": false,
      "sendGetBody": false,
      "requestDatatype": "JSON",
      "responseDatatype": "JSON",
      "headers": {},
      "responseObjects": [
        {
          "type": "default",
          "key": "",
          "mockFile": "mockdatafiles/virtualRouterPeeringsCreateOrUpdate-default.json"
        }
      ]
    },
    {
      "name": "virtualRouterPeeringsList",
      "protocol": "REST",
      "method": "GET",
      "entitypath": "{base_path}/{version}/subscriptions/{pathv1}/resourceGroups/{pathv2}/providers/Microsoft.Network/virtualRouters/{pathv3}/peerings?{query}",
      "requestSchema": "schema.json",
      "responseSchema": "schema.json",
      "timeout": 0,
      "sendEmpty": false,
      "sendGetBody": false,
      "requestDatatype": "JSON",
      "responseDatatype": "JSON",
      "headers": {},
      "responseObjects": [
        {
          "type": "default",
          "key": "",
          "mockFile": "mockdatafiles/virtualRouterPeeringsList-default.json"
        }
      ]
    }
  ]
}