{
  "$id": "schema.json",
  "type": "object",
  "schema": "http://json-schema.org/draft-07/schema#",
  "translate": true,
  "dynamicfields": true,
  "properties": {
    "ph_request_type": {
      "type": "string",
      "description": "type of request (internal to adapter)",
      "default": "listBucketInventoryConfigurations",
      "enum": [
        "listBucketInventoryConfigurations"
      ],
      "external_name": "ph_request_type"
    },
    "bucket": {
      "description": "The name of the bucket containing the inventory configurations to retrieve.",
      "parse": false,
      "encode": false,
      "encrypt": {
        "type": "AES",
        "key": ""
      },
      "external_name": "Bucket"
    },
    "continuationToken": {
      "description": "The marker used to continue an inventory configuration listing that has been truncated. Use the NextContinuationToken from a previously truncated list response to continu...(description truncated)",
      "parse": false,
      "encode": false,
      "encrypt": {
        "type": "AES",
        "key": ""
      },
      "external_name": "continuation-token"
    }
  },
  "definitions": {}
}