{
  "$id": "schema.json",
  "type": "object",
  "schema": "http://json-schema.org/draft-07/schema#",
  "translate": true,
  "dynamicfields": true,
  "properties": {
    "ph_request_type": {
      "type": "string",
      "description": "type of request (internal to adapter)",
      "default": "listObjectsV2",
      "enum": [
        "listObjectsV2"
      ],
      "external_name": "ph_request_type"
    },
    "bucket": {
      "description": "Name of the bucket to list.",
      "parse": false,
      "encode": false,
      "encrypt": {
        "type": "AES",
        "key": ""
      },
      "external_name": "Bucket"
    },
    "encodingType": {
      "description": "Requests Amazon S3 to encode the object keys in the response and specifies the encoding method to use. An object key may contain any Unicode character; however, XML 1.0 p...(description truncated)",
      "parse": false,
      "encode": false,
      "encrypt": {
        "type": "AES",
        "key": ""
      },
      "external_name": "encoding-type"
    },
    "maxKeys": {
      "description": "Sets the maximum number of keys returned in the response. The response might contain fewer keys but will never contain more.",
      "parse": false,
      "encode": false,
      "encrypt": {
        "type": "AES",
        "key": ""
      },
      "external_name": "max-keys"
    },
    "continuationToken": {
      "description": "ContinuationToken indicates Amazon S3 that the list is being continued on this bucket with a token. ContinuationToken is obfuscated and is not a real key",
      "parse": false,
      "encode": false,
      "encrypt": {
        "type": "AES",
        "key": ""
      },
      "external_name": "continuation-token"
    },
    "fetchOwner": {
      "description": "The owner field is not present in listV2 by default, if you want to return owner field with each key in the result then set the fetch owner field to true",
      "parse": false,
      "encode": false,
      "encrypt": {
        "type": "AES",
        "key": ""
      },
      "external_name": "fetch-owner"
    },
    "startAfter": {
      "description": "StartAfter is where you want Amazon S3 to start listing from. Amazon S3 starts listing after this specified key. StartAfter can be any key in the bucket",
      "parse": false,
      "encode": false,
      "encrypt": {
        "type": "AES",
        "key": ""
      },
      "external_name": "start-after"
    },
    "maxKeysQuery": {
      "description": "Pagination limit",
      "parse": false,
      "encode": false,
      "encrypt": {
        "type": "AES",
        "key": ""
      },
      "external_name": "MaxKeys"
    },
    "continuationTokenQuery": {
      "description": "Pagination token",
      "parse": false,
      "encode": false,
      "encrypt": {
        "type": "AES",
        "key": ""
      },
      "external_name": "ContinuationToken"
    },
    "listType": {
      "description": "",
      "parse": false,
      "encode": false,
      "encrypt": {
        "type": "AES",
        "key": ""
      },
      "external_name": "list-type"
    }
  },
  "definitions": {}
}