{
  "$id": "schema.json",
  "type": "object",
  "schema": "http://json-schema.org/draft-07/schema#",
  "translate": true,
  "dynamicfields": true,
  "properties": {
    "ph_request_type": {
      "type": "string",
      "description": "type of request (internal to adapter)",
      "default": "listObjectVersions",
      "enum": [
        "listObjectVersions"
      ],
      "external_name": "ph_request_type"
    },
    "bucket": {
      "description": "",
      "parse": false,
      "encode": false,
      "encrypt": {
        "type": "AES",
        "key": ""
      },
      "external_name": "Bucket"
    },
    "encodingType": {
      "description": "Requests Amazon S3 to encode the object keys in the response and specifies the encoding method to use. An object key may contain any Unicode character; however, XML 1.0 p...(description truncated)",
      "parse": false,
      "encode": false,
      "encrypt": {
        "type": "AES",
        "key": ""
      },
      "external_name": "encoding-type"
    },
    "keyMarker": {
      "description": "Specifies the key to start with when listing objects in a bucket.",
      "parse": false,
      "encode": false,
      "encrypt": {
        "type": "AES",
        "key": ""
      },
      "external_name": "key-marker"
    },
    "maxKeys": {
      "description": "Sets the maximum number of keys returned in the response. The response might contain fewer keys but will never contain more.",
      "parse": false,
      "encode": false,
      "encrypt": {
        "type": "AES",
        "key": ""
      },
      "external_name": "max-keys"
    },
    "versionIdMarker": {
      "description": "Specifies the object version you want to start listing from.",
      "parse": false,
      "encode": false,
      "encrypt": {
        "type": "AES",
        "key": ""
      },
      "external_name": "version-id-marker"
    },
    "maxKeysQuery": {
      "description": "Pagination limit",
      "parse": false,
      "encode": false,
      "encrypt": {
        "type": "AES",
        "key": ""
      },
      "external_name": "MaxKeys"
    },
    "keyMarkerQuery": {
      "description": "Pagination token",
      "parse": false,
      "encode": false,
      "encrypt": {
        "type": "AES",
        "key": ""
      },
      "external_name": "KeyMarker"
    },
    "versionIdMarkerQuery": {
      "description": "Pagination token",
      "parse": false,
      "encode": false,
      "encrypt": {
        "type": "AES",
        "key": ""
      },
      "external_name": "VersionIdMarker"
    }
  },
  "definitions": {}
}