{
  "Owner": {
    "DisplayName": "string",
    "ID": "string"
  },
  "Grants": [
    {
      "Grantee": {
        "DisplayName": "string",
        "EmailAddress": "string",
        "ID": "string",
        "Type": "Group",
        "URI": "string"
      },
      "Permission": "WRITE"
    }
  ]
}