{
  "Rules": [
    {
      "Expiration": {
        "Date": "string",
        "Days": 1,
        "ExpiredObjectDeleteMarker": true
      },
      "ID": "string",
      "Prefix": "string",
      "Status": "Enabled",
      "Transition": {
        "Date": "string",
        "Days": 6,
        "StorageClass": "INTELLIGENT_TIERING"
      },
      "NoncurrentVersionTransition": {
        "NoncurrentDays": 5,
        "StorageClass": "ONEZONE_IA"
      },
      "NoncurrentVersionExpiration": {
        "NoncurrentDays": 7
      },
      "AbortIncompleteMultipartUpload": {
        "DaysAfterInitiation": 4
      }
    },
    {
      "Expiration": {
        "Date": "string",
        "Days": 8,
        "ExpiredObjectDeleteMarker": true
      },
      "ID": "string",
      "Prefix": "string",
      "Status": "Enabled",
      "Transition": {
        "Date": "string",
        "Days": 6,
        "StorageClass": "ONEZONE_IA"
      },
      "NoncurrentVersionTransition": {
        "NoncurrentDays": 5,
        "StorageClass": "GLACIER"
      },
      "NoncurrentVersionExpiration": {
        "NoncurrentDays": 1
      },
      "AbortIncompleteMultipartUpload": {
        "DaysAfterInitiation": 6
      }
    },
    {
      "Expiration": {
        "Date": "string",
        "Days": 10,
        "ExpiredObjectDeleteMarker": false
      },
      "ID": "string",
      "Prefix": "string",
      "Status": "Disabled",
      "Transition": {
        "Date": "string",
        "Days": 5,
        "StorageClass": "GLACIER"
      },
      "NoncurrentVersionTransition": {
        "NoncurrentDays": 8,
        "StorageClass": "DEEP_ARCHIVE"
      },
      "NoncurrentVersionExpiration": {
        "NoncurrentDays": 10
      },
      "AbortIncompleteMultipartUpload": {
        "DaysAfterInitiation": 4
      }
    },
    {
      "Expiration": {
        "Date": "string",
        "Days": 2,
        "ExpiredObjectDeleteMarker": true
      },
      "ID": "string",
      "Prefix": "string",
      "Status": "Disabled",
      "Transition": {
        "Date": "string",
        "Days": 6,
        "StorageClass": "ONEZONE_IA"
      },
      "NoncurrentVersionTransition": {
        "NoncurrentDays": 7,
        "StorageClass": "STANDARD_IA"
      },
      "NoncurrentVersionExpiration": {
        "NoncurrentDays": 5
      },
      "AbortIncompleteMultipartUpload": {
        "DaysAfterInitiation": 3
      }
    },
    {
      "Expiration": {
        "Date": "string",
        "Days": 2,
        "ExpiredObjectDeleteMarker": true
      },
      "ID": "string",
      "Prefix": "string",
      "Status": "Disabled",
      "Transition": {
        "Date": "string",
        "Days": 2,
        "StorageClass": "ONEZONE_IA"
      },
      "NoncurrentVersionTransition": {
        "NoncurrentDays": 9,
        "StorageClass": "STANDARD_IA"
      },
      "NoncurrentVersionExpiration": {
        "NoncurrentDays": 10
      },
      "AbortIncompleteMultipartUpload": {
        "DaysAfterInitiation": 1
      }
    },
    {
      "Expiration": {
        "Date": "string",
        "Days": 7,
        "ExpiredObjectDeleteMarker": true
      },
      "ID": "string",
      "Prefix": "string",
      "Status": "Disabled",
      "Transition": {
        "Date": "string",
        "Days": 2,
        "StorageClass": "ONEZONE_IA"
      },
      "NoncurrentVersionTransition": {
        "NoncurrentDays": 8,
        "StorageClass": "GLACIER"
      },
      "NoncurrentVersionExpiration": {
        "NoncurrentDays": 2
      },
      "AbortIncompleteMultipartUpload": {
        "DaysAfterInitiation": 7
      }
    },
    {
      "Expiration": {
        "Date": "string",
        "Days": 7,
        "ExpiredObjectDeleteMarker": true
      },
      "ID": "string",
      "Prefix": "string",
      "Status": "Disabled",
      "Transition": {
        "Date": "string",
        "Days": 7,
        "StorageClass": "STANDARD_IA"
      },
      "NoncurrentVersionTransition": {
        "NoncurrentDays": 4,
        "StorageClass": "STANDARD_IA"
      },
      "NoncurrentVersionExpiration": {
        "NoncurrentDays": 1
      },
      "AbortIncompleteMultipartUpload": {
        "DaysAfterInitiation": 7
      }
    },
    {
      "Expiration": {
        "Date": "string",
        "Days": 9,
        "ExpiredObjectDeleteMarker": true
      },
      "ID": "string",
      "Prefix": "string",
      "Status": "Enabled",
      "Transition": {
        "Date": "string",
        "Days": 9,
        "StorageClass": "STANDARD_IA"
      },
      "NoncurrentVersionTransition": {
        "NoncurrentDays": 1,
        "StorageClass": "STANDARD_IA"
      },
      "NoncurrentVersionExpiration": {
        "NoncurrentDays": 5
      },
      "AbortIncompleteMultipartUpload": {
        "DaysAfterInitiation": 2
      }
    },
    {
      "Expiration": {
        "Date": "string",
        "Days": 5,
        "ExpiredObjectDeleteMarker": true
      },
      "ID": "string",
      "Prefix": "string",
      "Status": "Disabled",
      "Transition": {
        "Date": "string",
        "Days": 8,
        "StorageClass": "GLACIER"
      },
      "NoncurrentVersionTransition": {
        "NoncurrentDays": 10,
        "StorageClass": "ONEZONE_IA"
      },
      "NoncurrentVersionExpiration": {
        "NoncurrentDays": 10
      },
      "AbortIncompleteMultipartUpload": {
        "DaysAfterInitiation": 2
      }
    },
    {
      "Expiration": {
        "Date": "string",
        "Days": 8,
        "ExpiredObjectDeleteMarker": false
      },
      "ID": "string",
      "Prefix": "string",
      "Status": "Disabled",
      "Transition": {
        "Date": "string",
        "Days": 5,
        "StorageClass": "GLACIER"
      },
      "NoncurrentVersionTransition": {
        "NoncurrentDays": 3,
        "StorageClass": "DEEP_ARCHIVE"
      },
      "NoncurrentVersionExpiration": {
        "NoncurrentDays": 9
      },
      "AbortIncompleteMultipartUpload": {
        "DaysAfterInitiation": 9
      }
    }
  ]
}