{
  "$id": "schema.json",
  "type": "object",
  "schema": "http://json-schema.org/draft-07/schema#",
  "translate": true,
  "dynamicfields": true,
  "properties": {
    "ph_request_type": {
      "type": "string",
      "description": "type of request (internal to adapter)",
      "default": "listBucketAnalyticsConfigurations",
      "enum": [
        "listBucketAnalyticsConfigurations"
      ],
      "external_name": "ph_request_type"
    },
    "bucket": {
      "description": "The name of the bucket from which analytics configurations are retrieved.",
      "parse": false,
      "encode": false,
      "encrypt": {
        "type": "AES",
        "key": ""
      },
      "external_name": "Bucket"
    },
    "continuationToken": {
      "description": "The ContinuationToken that represents a placeholder from where this request should begin.",
      "parse": false,
      "encode": false,
      "encrypt": {
        "type": "AES",
        "key": ""
      },
      "external_name": "continuation-token"
    }
  },
  "definitions": {}
}