{
  "TopicConfigurations": [
    {
      "Id": "string",
      "TopicArn": "string",
      "Events": [
        "s3:ObjectCreated:CompleteMultipartUpload",
        "s3:ObjectCreated:CompleteMultipartUpload",
        "s3:ObjectCreated:Post",
        "s3:ObjectCreated:*",
        "s3:ObjectCreated:Post",
        "s3:ObjectRemoved:*",
        "s3:ObjectRestore:Completed",
        "s3:ObjectRestore:Post"
      ],
      "Filter": {
        "Key": {
          "FilterRules": [
            {
              "Name": "prefix",
              "Value": "string"
            },
            {
              "Name": "suffix",
              "Value": "string"
            },
            {
              "Name": "suffix",
              "Value": "string"
            },
            {
              "Name": "prefix",
              "Value": "string"
            }
          ]
        }
      }
    },
    {
      "Id": "string",
      "TopicArn": "string",
      "Events": [
        "s3:ObjectCreated:CompleteMultipartUpload",
        "s3:ObjectRestore:Post",
        "s3:ReducedRedundancyLostObject"
      ],
      "Filter": {
        "Key": {
          "FilterRules": [
            {
              "Name": "suffix",
              "Value": "string"
            },
            {
              "Name": "suffix",
              "Value": "string"
            },
            {
              "Name": "suffix",
              "Value": "string"
            },
            {
              "Name": "prefix",
              "Value": "string"
            },
            {
              "Name": "prefix",
              "Value": "string"
            }
          ]
        }
      }
    },
    {
      "Id": "string",
      "TopicArn": "string",
      "Events": [
        "s3:ObjectRestore:Post",
        "s3:ObjectRemoved:*",
        "s3:ObjectCreated:Copy"
      ],
      "Filter": {
        "Key": {
          "FilterRules": [
            {
              "Name": "suffix",
              "Value": "string"
            },
            {
              "Name": "prefix",
              "Value": "string"
            },
            {
              "Name": "prefix",
              "Value": "string"
            },
            {
              "Name": "suffix",
              "Value": "string"
            },
            {
              "Name": "suffix",
              "Value": "string"
            }
          ]
        }
      }
    },
    {
      "Id": "string",
      "TopicArn": "string",
      "Events": [
        "s3:ObjectRestore:Completed"
      ],
      "Filter": {
        "Key": {
          "FilterRules": [
            {
              "Name": "suffix",
              "Value": "string"
            },
            {
              "Name": "prefix",
              "Value": "string"
            },
            {
              "Name": "prefix",
              "Value": "string"
            },
            {
              "Name": "suffix",
              "Value": "string"
            },
            {
              "Name": "suffix",
              "Value": "string"
            },
            {
              "Name": "suffix",
              "Value": "string"
            },
            {
              "Name": "suffix",
              "Value": "string"
            }
          ]
        }
      }
    },
    {
      "Id": "string",
      "TopicArn": "string",
      "Events": [
        "s3:ObjectCreated:CompleteMultipartUpload",
        "s3:ObjectRestore:Post",
        "s3:ObjectCreated:CompleteMultipartUpload",
        "s3:ObjectCreated:Put",
        "s3:ObjectRemoved:DeleteMarkerCreated",
        "s3:ObjectCreated:*",
        "s3:ObjectCreated:Copy",
        "s3:ObjectRestore:Completed"
      ],
      "Filter": {
        "Key": {
          "FilterRules": [
            {
              "Name": "suffix",
              "Value": "string"
            },
            {
              "Name": "suffix",
              "Value": "string"
            },
            {
              "Name": "prefix",
              "Value": "string"
            },
            {
              "Name": "suffix",
              "Value": "string"
            },
            {
              "Name": "suffix",
              "Value": "string"
            },
            {
              "Name": "prefix",
              "Value": "string"
            },
            {
              "Name": "suffix",
              "Value": "string"
            },
            {
              "Name": "suffix",
              "Value": "string"
            }
          ]
        }
      }
    },
    {
      "Id": "string",
      "TopicArn": "string",
      "Events": [
        "s3:ObjectCreated:Put",
        "s3:ObjectCreated:CompleteMultipartUpload",
        "s3:ObjectCreated:Copy"
      ],
      "Filter": {
        "Key": {
          "FilterRules": [
            {
              "Name": "suffix",
              "Value": "string"
            },
            {
              "Name": "suffix",
              "Value": "string"
            },
            {
              "Name": "suffix",
              "Value": "string"
            },
            {
              "Name": "suffix",
              "Value": "string"
            },
            {
              "Name": "suffix",
              "Value": "string"
            },
            {
              "Name": "prefix",
              "Value": "string"
            },
            {
              "Name": "suffix",
              "Value": "string"
            },
            {
              "Name": "prefix",
              "Value": "string"
            },
            {
              "Name": "suffix",
              "Value": "string"
            },
            {
              "Name": "prefix",
              "Value": "string"
            }
          ]
        }
      }
    }
  ],
  "QueueConfigurations": [
    {
      "Id": "string",
      "QueueArn": "string",
      "Events": [
        "s3:ObjectRemoved:Delete",
        "s3:ObjectCreated:CompleteMultipartUpload",
        "s3:ObjectRemoved:*",
        "s3:ObjectCreated:CompleteMultipartUpload",
        "s3:ObjectCreated:Put",
        "s3:ObjectCreated:Copy",
        "s3:ObjectRemoved:DeleteMarkerCreated",
        "s3:ObjectRestore:Post",
        "s3:ObjectCreated:Post"
      ],
      "Filter": {
        "Key": {
          "FilterRules": [
            {
              "Name": "suffix",
              "Value": "string"
            }
          ]
        }
      }
    },
    {
      "Id": "string",
      "QueueArn": "string",
      "Events": [
        "s3:ObjectRemoved:Delete",
        "s3:ObjectCreated:Copy",
        "s3:ObjectCreated:Copy",
        "s3:ObjectCreated:Copy",
        "s3:ObjectCreated:CompleteMultipartUpload",
        "s3:ObjectCreated:CompleteMultipartUpload",
        "s3:ObjectRemoved:Delete",
        "s3:ObjectRestore:Completed",
        "s3:ObjectCreated:Post"
      ],
      "Filter": {
        "Key": {
          "FilterRules": [
            {
              "Name": "prefix",
              "Value": "string"
            },
            {
              "Name": "suffix",
              "Value": "string"
            },
            {
              "Name": "suffix",
              "Value": "string"
            },
            {
              "Name": "suffix",
              "Value": "string"
            },
            {
              "Name": "suffix",
              "Value": "string"
            }
          ]
        }
      }
    },
    {
      "Id": "string",
      "QueueArn": "string",
      "Events": [
        "s3:ObjectRestore:Completed",
        "s3:ReducedRedundancyLostObject",
        "s3:ObjectRestore:Completed",
        "s3:ObjectCreated:Post",
        "s3:ObjectRemoved:DeleteMarkerCreated",
        "s3:ObjectCreated:Post",
        "s3:ObjectCreated:CompleteMultipartUpload",
        "s3:ObjectRemoved:Delete"
      ],
      "Filter": {
        "Key": {
          "FilterRules": [
            {
              "Name": "suffix",
              "Value": "string"
            },
            {
              "Name": "suffix",
              "Value": "string"
            },
            {
              "Name": "suffix",
              "Value": "string"
            },
            {
              "Name": "prefix",
              "Value": "string"
            },
            {
              "Name": "suffix",
              "Value": "string"
            },
            {
              "Name": "suffix",
              "Value": "string"
            }
          ]
        }
      }
    }
  ],
  "LambdaFunctionConfigurations": [
    {
      "Id": "string",
      "LambdaFunctionArn": "string",
      "Events": [
        "s3:ObjectRestore:Post",
        "s3:ObjectCreated:Copy",
        "s3:ObjectCreated:CompleteMultipartUpload",
        "s3:ObjectCreated:CompleteMultipartUpload",
        "s3:ObjectRemoved:Delete",
        "s3:ObjectCreated:Copy",
        "s3:ObjectRemoved:DeleteMarkerCreated",
        "s3:ObjectRestore:Completed",
        "s3:ObjectCreated:Post"
      ],
      "Filter": {
        "Key": {
          "FilterRules": [
            {
              "Name": "prefix",
              "Value": "string"
            },
            {
              "Name": "prefix",
              "Value": "string"
            },
            {
              "Name": "suffix",
              "Value": "string"
            },
            {
              "Name": "prefix",
              "Value": "string"
            },
            {
              "Name": "suffix",
              "Value": "string"
            },
            {
              "Name": "prefix",
              "Value": "string"
            },
            {
              "Name": "suffix",
              "Value": "string"
            },
            {
              "Name": "suffix",
              "Value": "string"
            },
            {
              "Name": "suffix",
              "Value": "string"
            }
          ]
        }
      }
    }
  ]
}