{
  "ServerSideEncryptionConfiguration": {
    "Rules": [
      {
        "ApplyServerSideEncryptionByDefault": {
          "SSEAlgorithm": "AES256",
          "KMSMasterKeyID": "string"
        }
      },
      {
        "ApplyServerSideEncryptionByDefault": {
          "SSEAlgorithm": "aws:kms",
          "KMSMasterKeyID": "string"
        }
      },
      {
        "ApplyServerSideEncryptionByDefault": {
          "SSEAlgorithm": "AES256",
          "KMSMasterKeyID": "string"
        }
      },
      {
        "ApplyServerSideEncryptionByDefault": {
          "SSEAlgorithm": "AES256",
          "KMSMasterKeyID": "string"
        }
      },
      {
        "ApplyServerSideEncryptionByDefault": {
          "SSEAlgorithm": "AES256",
          "KMSMasterKeyID": "string"
        }
      },
      {
        "ApplyServerSideEncryptionByDefault": {
          "SSEAlgorithm": "aws:kms",
          "KMSMasterKeyID": "string"
        }
      },
      {
        "ApplyServerSideEncryptionByDefault": {
          "SSEAlgorithm": "aws:kms",
          "KMSMasterKeyID": "string"
        }
      }
    ]
  }
}