{
  "IsTruncated": true,
  "ContinuationToken": "string",
  "NextContinuationToken": "string",
  "MetricsConfigurationList": [
    {
      "Id": "string",
      "Filter": {
        "Prefix": "string",
        "Tag": {
          "Key": "string",
          "Value": "string"
        },
        "And": {
          "Prefix": "string",
          "Tags": [
            {
              "Key": "string",
              "Value": "string"
            },
            {
              "Key": "string",
              "Value": "string"
            },
            {
              "Key": "string",
              "Value": "string"
            },
            {
              "Key": "string",
              "Value": "string"
            },
            {
              "Key": "string",
              "Value": "string"
            },
            {
              "Key": "string",
              "Value": "string"
            },
            {
              "Key": "string",
              "Value": "string"
            },
            {
              "Key": "string",
              "Value": "string"
            },
            {
              "Key": "string",
              "Value": "string"
            }
          ]
        }
      }
    },
    {
      "Id": "string",
      "Filter": {
        "Prefix": "string",
        "Tag": {
          "Key": "string",
          "Value": "string"
        },
        "And": {
          "Prefix": "string",
          "Tags": [
            {
              "Key": "string",
              "Value": "string"
            },
            {
              "Key": "string",
              "Value": "string"
            },
            {
              "Key": "string",
              "Value": "string"
            },
            {
              "Key": "string",
              "Value": "string"
            },
            {
              "Key": "string",
              "Value": "string"
            },
            {
              "Key": "string",
              "Value": "string"
            },
            {
              "Key": "string",
              "Value": "string"
            },
            {
              "Key": "string",
              "Value": "string"
            },
            {
              "Key": "string",
              "Value": "string"
            }
          ]
        }
      }
    },
    {
      "Id": "string",
      "Filter": {
        "Prefix": "string",
        "Tag": {
          "Key": "string",
          "Value": "string"
        },
        "And": {
          "Prefix": "string",
          "Tags": [
            {
              "Key": "string",
              "Value": "string"
            },
            {
              "Key": "string",
              "Value": "string"
            },
            {
              "Key": "string",
              "Value": "string"
            },
            {
              "Key": "string",
              "Value": "string"
            },
            {
              "Key": "string",
              "Value": "string"
            },
            {
              "Key": "string",
              "Value": "string"
            },
            {
              "Key": "string",
              "Value": "string"
            },
            {
              "Key": "string",
              "Value": "string"
            },
            {
              "Key": "string",
              "Value": "string"
            },
            {
              "Key": "string",
              "Value": "string"
            }
          ]
        }
      }
    },
    {
      "Id": "string",
      "Filter": {
        "Prefix": "string",
        "Tag": {
          "Key": "string",
          "Value": "string"
        },
        "And": {
          "Prefix": "string",
          "Tags": [
            {
              "Key": "string",
              "Value": "string"
            },
            {
              "Key": "string",
              "Value": "string"
            },
            {
              "Key": "string",
              "Value": "string"
            },
            {
              "Key": "string",
              "Value": "string"
            },
            {
              "Key": "string",
              "Value": "string"
            },
            {
              "Key": "string",
              "Value": "string"
            },
            {
              "Key": "string",
              "Value": "string"
            },
            {
              "Key": "string",
              "Value": "string"
            }
          ]
        }
      }
    },
    {
      "Id": "string",
      "Filter": {
        "Prefix": "string",
        "Tag": {
          "Key": "string",
          "Value": "string"
        },
        "And": {
          "Prefix": "string",
          "Tags": [
            {
              "Key": "string",
              "Value": "string"
            },
            {
              "Key": "string",
              "Value": "string"
            },
            {
              "Key": "string",
              "Value": "string"
            },
            {
              "Key": "string",
              "Value": "string"
            },
            {
              "Key": "string",
              "Value": "string"
            }
          ]
        }
      }
    },
    {
      "Id": "string",
      "Filter": {
        "Prefix": "string",
        "Tag": {
          "Key": "string",
          "Value": "string"
        },
        "And": {
          "Prefix": "string",
          "Tags": [
            {
              "Key": "string",
              "Value": "string"
            },
            {
              "Key": "string",
              "Value": "string"
            },
            {
              "Key": "string",
              "Value": "string"
            },
            {
              "Key": "string",
              "Value": "string"
            },
            {
              "Key": "string",
              "Value": "string"
            },
            {
              "Key": "string",
              "Value": "string"
            },
            {
              "Key": "string",
              "Value": "string"
            },
            {
              "Key": "string",
              "Value": "string"
            },
            {
              "Key": "string",
              "Value": "string"
            }
          ]
        }
      }
    },
    {
      "Id": "string",
      "Filter": {
        "Prefix": "string",
        "Tag": {
          "Key": "string",
          "Value": "string"
        },
        "And": {
          "Prefix": "string",
          "Tags": [
            {
              "Key": "string",
              "Value": "string"
            },
            {
              "Key": "string",
              "Value": "string"
            }
          ]
        }
      }
    },
    {
      "Id": "string",
      "Filter": {
        "Prefix": "string",
        "Tag": {
          "Key": "string",
          "Value": "string"
        },
        "And": {
          "Prefix": "string",
          "Tags": [
            {
              "Key": "string",
              "Value": "string"
            },
            {
              "Key": "string",
              "Value": "string"
            },
            {
              "Key": "string",
              "Value": "string"
            },
            {
              "Key": "string",
              "Value": "string"
            },
            {
              "Key": "string",
              "Value": "string"
            },
            {
              "Key": "string",
              "Value": "string"
            }
          ]
        }
      }
    },
    {
      "Id": "string",
      "Filter": {
        "Prefix": "string",
        "Tag": {
          "Key": "string",
          "Value": "string"
        },
        "And": {
          "Prefix": "string",
          "Tags": [
            {
              "Key": "string",
              "Value": "string"
            },
            {
              "Key": "string",
              "Value": "string"
            },
            {
              "Key": "string",
              "Value": "string"
            },
            {
              "Key": "string",
              "Value": "string"
            },
            {
              "Key": "string",
              "Value": "string"
            },
            {
              "Key": "string",
              "Value": "string"
            }
          ]
        }
      }
    },
    {
      "Id": "string",
      "Filter": {
        "Prefix": "string",
        "Tag": {
          "Key": "string",
          "Value": "string"
        },
        "And": {
          "Prefix": "string",
          "Tags": [
            {
              "Key": "string",
              "Value": "string"
            }
          ]
        }
      }
    }
  ]
}