{
  "$id": "schema.json",
  "type": "object",
  "schema": "http://json-schema.org/draft-07/schema#",
  "translate": true,
  "dynamicfields": true,
  "properties": {
    "ph_request_type": {
      "type": "string",
      "description": "type of request (internal to adapter)",
      "default": "getBucketMetricsConfiguration",
      "enum": [
        "getBucketMetricsConfiguration",
        "putBucketMetricsConfiguration",
        "deleteBucketMetricsConfiguration"
      ],
      "external_name": "ph_request_type"
    },
    "bucket": {
      "description": "The name of the bucket containing the metrics configuration to delete.",
      "parse": false,
      "encode": false,
      "encrypt": {
        "type": "AES",
        "key": ""
      },
      "external_name": "Bucket"
    }
  },
  "definitions": {}
}