{
  "openapi": "3.1.0",
  "info": {
    "title": "",
    "version": "1.0.0"
  },
  "paths": {
    "/{bucket}/{key}": {
      "get": {
        "tags": [
          "Bucket"
        ],
        "operationId": "listParts",
        "description": "The parameters and request body are for method: listParts. Same endpoint also used in methods:<br> getObject (bucket : string,key : string,responseCacheControl : string,responseContentDisposition : string,responseContentEncoding : string,responseContentLanguage : string,responseContentType : string,responseExpires : string,versionId : string,partNumber : number,stsParams : object,roleName : string)<br> getObjectTagging (bucket : string,key : string,versionId : string,tagging : boolean,stsParams : object,roleName : string)<br> getObjectAcl (bucket : string,key : string,versionId : string,acl : boolean,stsParams : object,roleName : string)<br> getObjectLegalHold (bucket : string,key : string,versionId : string,legalHold : boolean,stsParams : object,roleName : string)<br> getObjectRetention (bucket : string,key : string,versionId : string,retention : boolean,stsParams : object,roleName : string)<br> getObjectTorrent (bucket : string,key : string,torrent : boolean,stsParams : object,roleName : string)",
        "responses": {
          "200": {
            "description": "Successful operation",
            "content": {
              "application/json": {
                "schema": {
                  "type": "object",
                  "properties": {
                    "Bucket": {
                      "type": "string"
                    },
                    "Key": {
                      "type": "string"
                    },
                    "UploadId": {
                      "type": "string"
                    },
                    "PartNumberMarker": {
                      "type": "number"
                    },
                    "NextPartNumberMarker": {
                      "type": "number"
                    },
                    "MaxParts": {
                      "type": "number"
                    },
                    "IsTruncated": {
                      "type": "boolean"
                    },
                    "Parts": {
                      "type": "array",
                      "items": {
                        "type": "object",
                        "properties": {
                          "PartNumber": {
                            "type": "number"
                          },
                          "LastModified": {
                            "type": "string"
                          },
                          "ETag": {
                            "type": "string"
                          },
                          "Size": {
                            "type": "number"
                          }
                        }
                      }
                    },
                    "Initiator": {
                      "type": "object",
                      "properties": {
                        "ID": {
                          "type": "string"
                        },
                        "DisplayName": {
                          "type": "string"
                        }
                      }
                    },
                    "Owner": {
                      "type": "object",
                      "properties": {
                        "DisplayName": {
                          "type": "string"
                        },
                        "ID": {
                          "type": "string"
                        }
                      }
                    },
                    "StorageClass": {
                      "type": "string"
                    }
                  }
                },
                "example": {
                  "Bucket": "string",
                  "Key": "string",
                  "UploadId": "string",
                  "PartNumberMarker": 1,
                  "NextPartNumberMarker": 1,
                  "MaxParts": 10,
                  "IsTruncated": true,
                  "Parts": [
                    {
                      "PartNumber": 8,
                      "LastModified": "string",
                      "ETag": "string",
                      "Size": 10
                    },
                    {
                      "PartNumber": 8,
                      "LastModified": "string",
                      "ETag": "string",
                      "Size": 6
                    }
                  ],
                  "Initiator": {
                    "ID": "string",
                    "DisplayName": "string"
                  },
                  "Owner": {
                    "DisplayName": "string",
                    "ID": "string"
                  },
                  "StorageClass": "STANDARD"
                }
              }
            }
          }
        },
        "parameters": [
          {
            "name": "bucket",
            "in": "path",
            "required": true,
            "schema": {
              "title": "bucket",
              "type": "string"
            }
          },
          {
            "name": "key",
            "in": "path",
            "required": true,
            "schema": {
              "title": "key",
              "type": "string"
            }
          },
          {
            "name": "maxParts",
            "in": "query",
            "required": true,
            "schema": {
              "type": "string"
            }
          },
          {
            "name": "partNumberMarker",
            "in": "query",
            "required": true,
            "schema": {
              "type": "string"
            }
          },
          {
            "name": "uploadId",
            "in": "query",
            "required": true,
            "schema": {
              "type": "string"
            }
          },
          {
            "name": "maxPartsQuery",
            "in": "query",
            "required": true,
            "schema": {
              "type": "string"
            }
          },
          {
            "name": "partNumberMarkerQuery",
            "in": "query",
            "required": true,
            "schema": {
              "type": "string"
            }
          }
        ],
        "requestBody": {
          "content": {
            "application/json": {
              "schema": {
                "type": "object"
              },
              "example": {}
            }
          }
        }
      },
      "post": {
        "tags": [
          "Bucket"
        ],
        "operationId": "completeMultipartUpload",
        "description": "The parameters and request body are for method: completeMultipartUpload. Same endpoint also used in methods:<br> createMultipartUpload (bucket : string,key : string,body : object,uploads : boolean,stsParams : object,roleName : string)<br> restoreObject (bucket : string,key : string,versionId : string,body : object,restore : boolean,stsParams : object,roleName : string)<br> selectObjectContent (bucket : string,key : string,body : object,select : boolean,selectType : string,stsParams : object,roleName : string)",
        "responses": {
          "200": {
            "description": "Successful operation",
            "content": {
              "application/json": {
                "schema": {
                  "type": "object",
                  "properties": {
                    "Location": {
                      "type": "string"
                    },
                    "Bucket": {
                      "type": "string"
                    },
                    "Key": {
                      "type": "string"
                    },
                    "ETag": {
                      "type": "string"
                    }
                  }
                },
                "example": {
                  "Location": "string",
                  "Bucket": "string",
                  "Key": "string",
                  "ETag": "string"
                }
              }
            }
          }
        },
        "parameters": [
          {
            "name": "bucket",
            "in": "path",
            "required": true,
            "schema": {
              "title": "bucket",
              "type": "string"
            }
          },
          {
            "name": "key",
            "in": "path",
            "required": true,
            "schema": {
              "title": "key",
              "type": "string"
            }
          },
          {
            "name": "uploadId",
            "in": "query",
            "required": true,
            "schema": {
              "type": "string"
            }
          }
        ],
        "requestBody": {
          "description": "indeterminate body object",
          "content": {
            "application/json": {
              "schema": {
                "type": "object"
              }
            }
          }
        }
      },
      "delete": {
        "tags": [
          "Bucket"
        ],
        "operationId": "abortMultipartUpload",
        "description": "The parameters and request body are for method: abortMultipartUpload. Same endpoint also used in methods:<br> deleteObject (bucket : string,key : string,versionId : string,stsParams : object,roleName : string)<br> deleteObjectTagging (bucket : string,key : string,versionId : string,tagging : boolean,stsParams : object,roleName : string)",
        "responses": {
          "200": {
            "description": "Successful operation",
            "content": {
              "application/json": {
                "schema": {
                  "title": "result",
                  "type": "object"
                }
              }
            }
          }
        },
        "parameters": [
          {
            "name": "bucket",
            "in": "path",
            "required": true,
            "schema": {
              "title": "bucket",
              "type": "string"
            }
          },
          {
            "name": "key",
            "in": "path",
            "required": true,
            "schema": {
              "title": "key",
              "type": "string"
            }
          },
          {
            "name": "uploadId",
            "in": "query",
            "required": true,
            "schema": {
              "type": "string"
            }
          }
        ],
        "requestBody": {
          "content": {
            "application/json": {
              "schema": {
                "type": "object"
              },
              "example": {}
            }
          }
        }
      },
      "put": {
        "tags": [
          "Bucket"
        ],
        "operationId": "copyObject",
        "description": "The parameters and request body are for method: copyObject. Same endpoint also used in methods:<br> putObject (bucket : string,key : string,body : string,stsParams : object,roleName : string)<br> putObjectTagging (bucket : string,key : string,versionId : string,body : object,tagging : boolean,stsParams : object,roleName : string)<br> putObjectAcl (bucket : string,key : string,versionId : string,body : object,acl : boolean,stsParams : object,roleName : string)<br> putObjectLegalHold (bucket : string,key : string,versionId : string,body : object,legalHold : boolean,stsParams : object,roleName : string)<br> putObjectRetention (bucket : string,key : string,versionId : string,body : object,retention : boolean,stsParams : object,roleName : string)<br> uploadPart (bucket : string,key : string,partNumber : number,uploadId : string,body : object,stsParams : object,roleName : string)<br> uploadPartCopy (bucket : string,key : string,partNumber : number,uploadId : string,stsParams : object,roleName : string)",
        "responses": {
          "200": {
            "description": "Successful operation",
            "content": {
              "application/json": {
                "schema": {
                  "type": "object",
                  "properties": {
                    "CopyObjectResult": {
                      "type": "object",
                      "properties": {
                        "ETag": {
                          "type": "string"
                        },
                        "LastModified": {
                          "type": "string"
                        }
                      }
                    }
                  }
                },
                "example": {
                  "CopyObjectResult": {
                    "ETag": "string",
                    "LastModified": "string"
                  }
                }
              }
            }
          }
        },
        "parameters": [
          {
            "name": "bucket",
            "in": "path",
            "required": true,
            "schema": {
              "title": "bucket",
              "type": "string"
            }
          },
          {
            "name": "key",
            "in": "path",
            "required": true,
            "schema": {
              "title": "key",
              "type": "string"
            }
          }
        ],
        "requestBody": {
          "description": "indeterminate body object",
          "content": {
            "application/json": {
              "schema": {
                "type": "object"
              }
            }
          }
        }
      },
      "head": {
        "tags": [
          "Bucket"
        ],
        "operationId": "headObject",
        "description": "The parameters and request body are for method: headObject. Same endpoint also used in methods:",
        "responses": {
          "200": {
            "description": "Successful operation",
            "content": {
              "application/json": {
                "schema": {
                  "type": "object",
                  "properties": {
                    "Metadata": {
                      "type": "object"
                    }
                  }
                },
                "example": {
                  "Metadata": {}
                }
              }
            }
          }
        },
        "parameters": [
          {
            "name": "bucket",
            "in": "path",
            "required": true,
            "schema": {
              "title": "bucket",
              "type": "string"
            }
          },
          {
            "name": "key",
            "in": "path",
            "required": true,
            "schema": {
              "title": "key",
              "type": "string"
            }
          },
          {
            "name": "versionId",
            "in": "query",
            "required": true,
            "schema": {
              "type": "string"
            }
          },
          {
            "name": "partNumber",
            "in": "query",
            "required": true,
            "schema": {
              "type": "string"
            }
          }
        ],
        "requestBody": {
          "content": {
            "application/json": {
              "schema": {
                "type": "object"
              },
              "example": {}
            }
          }
        }
      }
    },
    "/{bucket}": {
      "get": {
        "tags": [
          "Bucket"
        ],
        "operationId": "listObjects",
        "description": "The parameters and request body are for method: listObjects. Same endpoint also used in methods:<br> getBucketAnalyticsConfiguration (bucket : string,id : string,analytics : boolean,stsParams : object,roleName : string)<br> getBucketCors (bucket : string,cors : boolean,stsParams : object,roleName : string)<br> getBucketEncryption (bucket : string,encryption : boolean,stsParams : object,roleName : string)<br> getBucketInventoryConfiguration (bucket : string,id : string,inventory : boolean,stsParams : object,roleName : string)<br> getBucketLifecycleConfiguration (bucket : string,lifecycle : boolean,stsParams : object,roleName : string)<br> getBucketMetricsConfiguration (bucket : string,id : string,metrics : boolean,stsParams : object,roleName : string)<br> getBucketPolicy (bucket : string,policy : boolean,stsParams : object,roleName : string)<br> getBucketReplication (bucket : string,replication : boolean,stsParams : object,roleName : string)<br> getBucketTagging (bucket : string,tagging : boolean,stsParams : object,roleName : string)<br> getBucketWebsite (bucket : string,website : boolean,stsParams : object,roleName : string)<br> getPublicAccessBlock (bucket : string,publicAccessBlock : boolean,stsParams : object,roleName : string)<br> getBucketAccelerateConfiguration (bucket : string,accelerate : boolean,stsParams : object,roleName : string)<br> getBucketAcl (bucket : string,acl : boolean,stsParams : object,roleName : string)<br> getBucketLocation (bucket : string,location : boolean,stsParams : object,roleName : string)<br> getBucketLogging (bucket : string,logging : boolean,stsParams : object,roleName : string)<br> getBucketNotificationConfiguration (bucket : string,notification : boolean,stsParams : object,roleName : string)<br> getBucketPolicyStatus (bucket : string,policyStatus : boolean,stsParams : object,roleName : string)<br> getBucketRequestPayment (bucket : string,requestPayment : boolean,stsParams : object,roleName : string)<br> getBucketVersioning (bucket : string,versioning : boolean,stsParams : object,roleName : string)<br> getObjectLockConfiguration (bucket : string,objectLock : boolean,stsParams : object,roleName : string)<br> listBucketAnalyticsConfigurations (bucket : string,continuationToken : string,analytics : boolean,stsParams : object,roleName : string)<br> listBucketInventoryConfigurations (bucket : string,continuationToken : string,inventory : boolean,stsParams : object,roleName : string)<br> listBucketMetricsConfigurations (bucket : string,continuationToken : string,metrics : boolean,stsParams : object,roleName : string)<br> listMultipartUploads (bucket : string,delimiter : string,encodingType : string,keyMarker : string,maxUploads : number,prefix : string,uploadIdMarker : string,maxUploadsQuery : string,keyMarkerQuery : string,uploadIdMarkerQuery : string,uploads : boolean,stsParams : object,roleName : string)<br> listObjectVersions (bucket : string,delimiter : string,encodingType : string,keyMarker : string,maxKeys : number,prefix : string,versionIdMarker : string,maxKeysQuery : string,keyMarkerQuery : string,versionIdMarkerQuery : string,versions : boolean,stsParams : object,roleName : string)<br> listObjectsV2 (bucket : string,delimiter : string,encodingType : string,maxKeys : number,prefix : string,continuationToken : string,fetchOwner : boolean,startAfter : string,maxKeysQuery : string,continuationTokenQuery : string,listType : string,stsParams : object,roleName : string)",
        "responses": {
          "200": {
            "description": "Successful operation",
            "content": {
              "application/json": {
                "schema": {
                  "type": "object",
                  "properties": {
                    "IsTruncated": {
                      "type": "boolean"
                    },
                    "Marker": {
                      "type": "string"
                    },
                    "NextMarker": {
                      "type": "string"
                    },
                    "Contents": {
                      "type": "array",
                      "items": {
                        "type": "object",
                        "properties": {
                          "Key": {
                            "type": "string"
                          },
                          "LastModified": {
                            "type": "string"
                          },
                          "ETag": {
                            "type": "string"
                          },
                          "Size": {
                            "type": "number"
                          },
                          "StorageClass": {
                            "type": "string"
                          },
                          "Owner": {
                            "type": "object",
                            "properties": {
                              "DisplayName": {
                                "type": "string"
                              },
                              "ID": {
                                "type": "string"
                              }
                            }
                          }
                        }
                      }
                    },
                    "Name": {
                      "type": "string"
                    },
                    "Prefix": {
                      "type": "string"
                    },
                    "Delimiter": {
                      "type": "string"
                    },
                    "MaxKeys": {
                      "type": "number"
                    },
                    "CommonPrefixes": {
                      "type": "array",
                      "items": {
                        "type": "object",
                        "properties": {
                          "Prefix": {
                            "type": "string"
                          }
                        }
                      }
                    },
                    "EncodingType": {
                      "type": "string"
                    }
                  }
                },
                "example": {
                  "IsTruncated": false,
                  "Marker": "string",
                  "NextMarker": "string",
                  "Contents": [
                    {
                      "Key": "string",
                      "LastModified": "string",
                      "ETag": "string",
                      "Size": 4,
                      "StorageClass": "DEEP_ARCHIVE",
                      "Owner": {
                        "DisplayName": "string",
                        "ID": "string"
                      }
                    },
                    {
                      "Key": "string",
                      "LastModified": "string",
                      "ETag": "string",
                      "Size": 4,
                      "StorageClass": "STANDARD_IA",
                      "Owner": {
                        "DisplayName": "string",
                        "ID": "string"
                      }
                    },
                    {
                      "Key": "string",
                      "LastModified": "string",
                      "ETag": "string",
                      "Size": 7,
                      "StorageClass": "STANDARD",
                      "Owner": {
                        "DisplayName": "string",
                        "ID": "string"
                      }
                    },
                    {
                      "Key": "string",
                      "LastModified": "string",
                      "ETag": "string",
                      "Size": 10,
                      "StorageClass": "INTELLIGENT_TIERING",
                      "Owner": {
                        "DisplayName": "string",
                        "ID": "string"
                      }
                    },
                    {
                      "Key": "string",
                      "LastModified": "string",
                      "ETag": "string",
                      "Size": 3,
                      "StorageClass": "ONEZONE_IA",
                      "Owner": {
                        "DisplayName": "string",
                        "ID": "string"
                      }
                    },
                    {
                      "Key": "string",
                      "LastModified": "string",
                      "ETag": "string",
                      "Size": 4,
                      "StorageClass": "ONEZONE_IA",
                      "Owner": {
                        "DisplayName": "string",
                        "ID": "string"
                      }
                    }
                  ],
                  "Name": "string",
                  "Prefix": "string",
                  "Delimiter": "string",
                  "MaxKeys": 6,
                  "CommonPrefixes": [
                    {
                      "Prefix": "string"
                    },
                    {
                      "Prefix": "string"
                    },
                    {
                      "Prefix": "string"
                    },
                    {
                      "Prefix": "string"
                    }
                  ],
                  "EncodingType": "url"
                }
              }
            }
          }
        },
        "parameters": [
          {
            "name": "bucket",
            "in": "path",
            "required": true,
            "schema": {
              "title": "bucket",
              "type": "string"
            }
          },
          {
            "name": "delimiter",
            "in": "query",
            "required": true,
            "schema": {
              "type": "string"
            }
          },
          {
            "name": "encodingType",
            "in": "query",
            "required": true,
            "schema": {
              "type": "string"
            }
          },
          {
            "name": "marker",
            "in": "query",
            "required": true,
            "schema": {
              "type": "string"
            }
          },
          {
            "name": "maxKeys",
            "in": "query",
            "required": true,
            "schema": {
              "type": "string"
            }
          },
          {
            "name": "prefix",
            "in": "query",
            "required": true,
            "schema": {
              "type": "string"
            }
          },
          {
            "name": "maxKeysQuery",
            "in": "query",
            "required": true,
            "schema": {
              "type": "string"
            }
          },
          {
            "name": "markerQuery",
            "in": "query",
            "required": true,
            "schema": {
              "type": "string"
            }
          }
        ],
        "requestBody": {
          "content": {
            "application/json": {
              "schema": {
                "type": "object"
              },
              "example": {}
            }
          }
        }
      },
      "put": {
        "tags": [
          "Bucket"
        ],
        "operationId": "createBucket",
        "description": "The parameters and request body are for method: createBucket. Same endpoint also used in methods:<br> putBucketAnalyticsConfiguration (bucket : string,id : string,body : object,analytics : boolean,stsParams : object,roleName : string)<br> putBucketCors (bucket : string,body : object,cors : boolean,stsParams : object,roleName : string)<br> putBucketEncryption (bucket : string,body : object,encryption : boolean,stsParams : object,roleName : string)<br> putBucketInventoryConfiguration (bucket : string,id : string,body : object,inventory : boolean,stsParams : object,roleName : string)<br> putBucketLifecycleConfiguration (bucket : string,body : object,lifecycle : boolean,stsParams : object,roleName : string)<br> putBucketMetricsConfiguration (bucket : string,id : string,body : object,metrics : boolean,stsParams : object,roleName : string)<br> putBucketPolicy (bucket : string,body : object,policy : boolean,stsParams : object,roleName : string)<br> putBucketReplication (bucket : string,body : object,replication : boolean,stsParams : object,roleName : string)<br> putBucketTagging (bucket : string,body : object,tagging : boolean,stsParams : object,roleName : string)<br> putBucketWebsite (bucket : string,body : object,website : boolean,stsParams : object,roleName : string)<br> putPublicAccessBlock (bucket : string,body : object,publicAccessBlock : boolean,stsParams : object,roleName : string)<br> putBucketAccelerateConfiguration (bucket : string,body : object,accelerate : boolean,stsParams : object,roleName : string)<br> putBucketAcl (bucket : string,body : object,acl : boolean,stsParams : object,roleName : string)<br> putBucketLogging (bucket : string,body : object,logging : boolean,stsParams : object,roleName : string)<br> putBucketNotificationConfiguration (bucket : string,body : object,notification : boolean,stsParams : object,roleName : string)<br> putBucketRequestPayment (bucket : string,body : object,requestPayment : boolean,stsParams : object,roleName : string)<br> putBucketVersioning (bucket : string,body : object,versioning : boolean,stsParams : object,roleName : string)<br> putObjectLockConfiguration (bucket : string,body : object,objectLock : boolean,stsParams : object,roleName : string)",
        "responses": {
          "200": {
            "description": "Successful operation",
            "content": {
              "application/json": {
                "schema": {
                  "title": "result",
                  "type": "object"
                }
              }
            }
          }
        },
        "parameters": [
          {
            "name": "bucket",
            "in": "path",
            "required": true,
            "schema": {
              "title": "bucket",
              "type": "string"
            }
          }
        ],
        "requestBody": {
          "description": "indeterminate body object",
          "content": {
            "application/json": {
              "schema": {
                "type": "object"
              }
            }
          }
        }
      },
      "delete": {
        "tags": [
          "Bucket"
        ],
        "operationId": "deleteBucket",
        "description": "The parameters and request body are for method: deleteBucket. Same endpoint also used in methods:<br> deleteBucketAnalyticsConfiguration (bucket : string,id : string,analytics : boolean,stsParams : object,roleName : string)<br> deleteBucketCors (bucket : string,cors : boolean,stsParams : object,roleName : string)<br> deleteBucketEncryption (bucket : string,encryption : boolean,stsParams : object,roleName : string)<br> deleteBucketInventoryConfiguration (bucket : string,id : string,inventory : boolean,stsParams : object,roleName : string)<br> deleteBucketLifecycle (bucket : string,lifecycle : boolean,stsParams : object,roleName : string)<br> deleteBucketMetricsConfiguration (bucket : string,id : string,metrics : boolean,stsParams : object,roleName : string)<br> deleteBucketPolicy (bucket : string,policy : boolean,stsParams : object,roleName : string)<br> deleteBucketReplication (bucket : string,replication : boolean,stsParams : object,roleName : string)<br> deleteBucketTagging (bucket : string,tagging : boolean,stsParams : object,roleName : string)<br> deleteBucketWebsite (bucket : string,website : boolean,stsParams : object,roleName : string)<br> deletePublicAccessBlock (bucket : string,publicAccessBlock : boolean,stsParams : object,roleName : string)",
        "responses": {
          "200": {
            "description": "Successful operation",
            "content": {
              "application/json": {
                "schema": {
                  "title": "result",
                  "type": "object"
                }
              }
            }
          }
        },
        "parameters": [
          {
            "name": "bucket",
            "in": "path",
            "required": true,
            "schema": {
              "title": "bucket",
              "type": "string"
            }
          }
        ],
        "requestBody": {
          "content": {
            "application/json": {
              "schema": {
                "type": "object"
              },
              "example": {}
            }
          }
        }
      },
      "head": {
        "tags": [
          "Bucket"
        ],
        "operationId": "headBucket",
        "description": "The parameters and request body are for method: headBucket. Same endpoint also used in methods:",
        "responses": {
          "200": {
            "description": "Successful operation",
            "content": {
              "application/json": {
                "schema": {
                  "title": "result",
                  "type": "object"
                }
              }
            }
          }
        },
        "parameters": [
          {
            "name": "bucket",
            "in": "path",
            "required": true,
            "schema": {
              "title": "bucket",
              "type": "string"
            }
          }
        ],
        "requestBody": {
          "content": {
            "application/json": {
              "schema": {
                "type": "object"
              },
              "example": {}
            }
          }
        }
      },
      "post": {
        "tags": [
          "BucketDelete"
        ],
        "operationId": "deleteObjects",
        "description": "The parameters and request body are for method: deleteObjects. Same endpoint also used in methods:",
        "responses": {
          "200": {
            "description": "Successful operation",
            "content": {
              "application/json": {
                "schema": {
                  "type": "object",
                  "properties": {
                    "Deleted": {
                      "type": "array",
                      "items": {
                        "type": "object",
                        "properties": {
                          "Key": {
                            "type": "string"
                          },
                          "VersionId": {
                            "type": "string"
                          },
                          "DeleteMarker": {
                            "type": "boolean"
                          },
                          "DeleteMarkerVersionId": {
                            "type": "string"
                          }
                        }
                      }
                    },
                    "Errors": {
                      "type": "array",
                      "items": {
                        "type": "object",
                        "properties": {
                          "Key": {
                            "type": "string"
                          },
                          "VersionId": {
                            "type": "string"
                          },
                          "Code": {
                            "type": "string"
                          },
                          "Message": {
                            "type": "string"
                          }
                        }
                      }
                    }
                  }
                },
                "example": {
                  "Deleted": [
                    {
                      "Key": "string",
                      "VersionId": "string",
                      "DeleteMarker": false,
                      "DeleteMarkerVersionId": "string"
                    },
                    {
                      "Key": "string",
                      "VersionId": "string",
                      "DeleteMarker": false,
                      "DeleteMarkerVersionId": "string"
                    },
                    {
                      "Key": "string",
                      "VersionId": "string",
                      "DeleteMarker": true,
                      "DeleteMarkerVersionId": "string"
                    },
                    {
                      "Key": "string",
                      "VersionId": "string",
                      "DeleteMarker": true,
                      "DeleteMarkerVersionId": "string"
                    },
                    {
                      "Key": "string",
                      "VersionId": "string",
                      "DeleteMarker": true,
                      "DeleteMarkerVersionId": "string"
                    },
                    {
                      "Key": "string",
                      "VersionId": "string",
                      "DeleteMarker": false,
                      "DeleteMarkerVersionId": "string"
                    },
                    {
                      "Key": "string",
                      "VersionId": "string",
                      "DeleteMarker": true,
                      "DeleteMarkerVersionId": "string"
                    },
                    {
                      "Key": "string",
                      "VersionId": "string",
                      "DeleteMarker": false,
                      "DeleteMarkerVersionId": "string"
                    }
                  ],
                  "Errors": [
                    {
                      "Key": "string",
                      "VersionId": "string",
                      "Code": "string",
                      "Message": "string"
                    },
                    {
                      "Key": "string",
                      "VersionId": "string",
                      "Code": "string",
                      "Message": "string"
                    },
                    {
                      "Key": "string",
                      "VersionId": "string",
                      "Code": "string",
                      "Message": "string"
                    },
                    {
                      "Key": "string",
                      "VersionId": "string",
                      "Code": "string",
                      "Message": "string"
                    },
                    {
                      "Key": "string",
                      "VersionId": "string",
                      "Code": "string",
                      "Message": "string"
                    },
                    {
                      "Key": "string",
                      "VersionId": "string",
                      "Code": "string",
                      "Message": "string"
                    }
                  ]
                }
              }
            }
          }
        },
        "parameters": [
          {
            "name": "bucket",
            "in": "path",
            "required": true,
            "schema": {
              "title": "bucket",
              "type": "string"
            }
          },
          {
            "name": "deleteParam",
            "in": "query",
            "required": true,
            "schema": {
              "type": "string"
            }
          }
        ],
        "requestBody": {
          "description": "indeterminate body object",
          "content": {
            "application/json": {
              "schema": {
                "type": "object"
              }
            }
          }
        }
      }
    },
    "/{key}": {
      "get": {
        "tags": [
          "Bucket"
        ],
        "operationId": "getObjectNew",
        "description": "The parameters and request body are for method: getObjectNew. Same endpoint also used in methods:",
        "responses": {
          "200": {
            "description": "Successful operation",
            "content": {
              "application/json": {
                "schema": {
                  "type": "object",
                  "properties": {
                    "Body": {
                      "type": "string"
                    },
                    "Metadata": {
                      "type": "object"
                    }
                  }
                },
                "example": {
                  "Body": "string",
                  "Metadata": {}
                }
              }
            }
          }
        },
        "parameters": [
          {
            "name": "key",
            "in": "path",
            "required": true,
            "schema": {
              "title": "key",
              "type": "string"
            }
          },
          {
            "name": "responseCacheControl",
            "in": "query",
            "required": true,
            "schema": {
              "type": "string"
            }
          },
          {
            "name": "responseContentDisposition",
            "in": "query",
            "required": true,
            "schema": {
              "type": "string"
            }
          },
          {
            "name": "responseContentEncoding",
            "in": "query",
            "required": true,
            "schema": {
              "type": "string"
            }
          },
          {
            "name": "responseContentLanguage",
            "in": "query",
            "required": true,
            "schema": {
              "type": "string"
            }
          },
          {
            "name": "responseContentType",
            "in": "query",
            "required": true,
            "schema": {
              "type": "string"
            }
          },
          {
            "name": "responseExpires",
            "in": "query",
            "required": true,
            "schema": {
              "type": "string"
            }
          },
          {
            "name": "versionId",
            "in": "query",
            "required": true,
            "schema": {
              "type": "string"
            }
          },
          {
            "name": "partNumber",
            "in": "query",
            "required": true,
            "schema": {
              "type": "string"
            }
          }
        ],
        "requestBody": {
          "content": {
            "application/json": {
              "schema": {
                "type": "object"
              },
              "example": {}
            }
          }
        }
      },
      "put": {
        "tags": [
          "Bucket"
        ],
        "operationId": "putObjectNew",
        "description": "The parameters and request body are for method: putObjectNew. Same endpoint also used in methods:",
        "responses": {
          "200": {
            "description": "Successful operation",
            "content": {
              "application/json": {
                "schema": {
                  "title": "result",
                  "type": "object"
                }
              }
            }
          }
        },
        "parameters": [
          {
            "name": "key",
            "in": "path",
            "required": true,
            "schema": {
              "title": "key",
              "type": "string"
            }
          }
        ],
        "requestBody": {
          "description": "indeterminate body object",
          "content": {
            "application/json": {
              "schema": {
                "type": "object"
              }
            }
          }
        }
      }
    },
    "/": {
      "get": {
        "tags": [
          "Root"
        ],
        "operationId": "listBuckets",
        "description": "The parameters and request body are for method: listBuckets. Same endpoint also used in methods:",
        "responses": {
          "200": {
            "description": "Successful operation",
            "content": {
              "application/json": {
                "schema": {
                  "type": "object",
                  "properties": {
                    "Buckets": {
                      "type": "array",
                      "items": {
                        "type": "object",
                        "properties": {
                          "Name": {
                            "type": "string"
                          },
                          "CreationDate": {
                            "type": "string"
                          }
                        }
                      }
                    },
                    "Owner": {
                      "type": "object",
                      "properties": {
                        "DisplayName": {
                          "type": "string"
                        },
                        "ID": {
                          "type": "string"
                        }
                      }
                    }
                  }
                },
                "example": {
                  "Buckets": [
                    {
                      "Name": "string",
                      "CreationDate": "string"
                    },
                    {
                      "Name": "string",
                      "CreationDate": "string"
                    },
                    {
                      "Name": "string",
                      "CreationDate": "string"
                    },
                    {
                      "Name": "string",
                      "CreationDate": "string"
                    },
                    {
                      "Name": "string",
                      "CreationDate": "string"
                    },
                    {
                      "Name": "string",
                      "CreationDate": "string"
                    },
                    {
                      "Name": "string",
                      "CreationDate": "string"
                    },
                    {
                      "Name": "string",
                      "CreationDate": "string"
                    },
                    {
                      "Name": "string",
                      "CreationDate": "string"
                    }
                  ],
                  "Owner": {
                    "DisplayName": "string",
                    "ID": "string"
                  }
                }
              }
            }
          }
        },
        "requestBody": {
          "content": {
            "application/json": {
              "schema": {
                "type": "object"
              },
              "example": {}
            }
          }
        }
      }
    }
  },
  "components": {
    "schemas": {}
  }
}