{
  "errors": [],
  "statistics": [
    {
      "owner": "errorJson",
      "description": "New adapter errors available for use",
      "value": 0
    },
    {
      "owner": "errorJson",
      "description": "Adapter errors no longer available for use",
      "value": 0
    },
    {
      "owner": "errorJson",
      "description": "Adapter errors that have been updated (e.g. recommendation changes)",
      "value": 29
    },
    {
      "owner": "packageJson",
      "description": "Number of production dependencies",
      "value": 12
    },
    {
      "owner": "packageJson",
      "description": "Number of development dependencies",
      "value": 7
    },
    {
      "owner": "packageJson",
      "description": "Number of npm scripts",
      "value": 21
    },
    {
      "owner": "packageJson",
      "description": "Runtime Library dependency",
      "value": "^4.39.1"
    },
    {
      "owner": "propertiesSchemaJson",
      "description": "Adapter properties defined in the propertiesSchema file",
      "value": 62
    },
    {
      "owner": "readmeMd",
      "description": "Number of lines in the README.md",
      "value": 615
    },
    {
      "owner": "unitTestJS",
      "description": "Number of lines of code in unit tests",
      "value": 5770
    },
    {
      "owner": "unitTestJS",
      "description": "Number of unit tests",
      "value": 350
    },
    {
      "owner": "integrationTestJS",
      "description": "Number of lines of code in integration tests",
      "value": 2435
    },
    {
      "owner": "integrationTestJS",
      "description": "Number of integration tests",
      "value": 75
    },
    {
      "owner": "staticFile",
      "description": "Number of lines of code in adapterBase.js",
      "value": 1007
    },
    {
      "owner": "staticFile",
      "description": "Number of static files added",
      "value": 30
    },
    {
      "owner": "Overall",
      "description": "Total lines of Code",
      "value": 9212
    },
    {
      "owner": "Overall",
      "description": "Total Tests",
      "value": 425
    },
    {
      "owner": "Overall",
      "description": "Total Files",
      "value": 6
    }
  ]
}