{
  "$id": "schema.json",
  "type": "object",
  "schema": "http://json-schema.org/draft-07/schema#",
  "translate": true,
  "dynamicfields": true,
  "properties": {
    "ph_request_type": {
      "type": "string",
      "description": "type of request (internal to adapter)",
      "default": "getDescribeBundleTasks",
      "enum": [
        "getDescribeBundleTasks",
        "postDescribeBundleTasks"
      ],
      "external_name": "ph_request_type"
    },
    "bundleId": {
      "description": "The bundle task IDs.   Default: Describes all your bundle tasks.",
      "parse": false,
      "encode": false,
      "encrypt": {
        "type": "AES",
        "key": ""
      },
      "external_name": "BundleId"
    },
    "filter": {
      "description": "The filters.         bundle-id  - The ID of the bundle task.         error-code  - If the task failed, the error code returned.         error-message  - If the task fail...(description truncated)",
      "parse": false,
      "encode": false,
      "encrypt": {
        "type": "AES",
        "key": ""
      },
      "external_name": "Filter"
    },
    "dryRun": {
      "description": "Checks whether you have the required permissions for the action, without actually making the request, and provides an error response. If you have the required permissions...(description truncated)",
      "parse": false,
      "encode": false,
      "encrypt": {
        "type": "AES",
        "key": ""
      },
      "external_name": "DryRun"
    },
    "action": {
      "description": "",
      "parse": false,
      "encode": false,
      "encrypt": {
        "type": "AES",
        "key": ""
      },
      "external_name": "Action"
    },
    "version": {
      "description": "",
      "parse": false,
      "encode": false,
      "encrypt": {
        "type": "AES",
        "key": ""
      },
      "external_name": "Version"
    },
    "bodyFormData": {
      "description": "",
      "parse": false,
      "encode": false,
      "encrypt": {
        "type": "AES",
        "key": ""
      },
      "external_name": "body"
    }
  },
  "definitions": {}
}