{
  "ClientToken": "string",
  "FlowLogIds": [
    "string",
    "string",
    "string",
    "string",
    "string",
    "string"
  ],
  "Unsuccessful": [
    {
      "Error": {
        "Code": "string",
        "Message": "string"
      },
      "ResourceId": "string"
    },
    {
      "Error": {
        "Code": "string",
        "Message": "string"
      },
      "ResourceId": "string"
    },
    {
      "Error": {
        "Code": "string",
        "Message": "string"
      },
      "ResourceId": "string"
    },
    {
      "Error": {
        "Code": "string",
        "Message": "string"
      },
      "ResourceId": "string"
    },
    {
      "Error": {
        "Code": "string",
        "Message": "string"
      },
      "ResourceId": "string"
    },
    {
      "Error": {
        "Code": "string",
        "Message": "string"
      },
      "ResourceId": "string"
    },
    {
      "Error": {
        "Code": "string",
        "Message": "string"
      },
      "ResourceId": "string"
    }
  ]
}