{
  "NextToken": "string",
  "SpotPriceHistory": [
    {
      "AvailabilityZone": "string",
      "InstanceType": "m3.2xlarge",
      "ProductDescription": "Windows (Amazon VPC)",
      "SpotPrice": "string",
      "Timestamp": "string"
    },
    {
      "AvailabilityZone": "string",
      "InstanceType": "r4.large",
      "ProductDescription": "Linux/UNIX (Amazon VPC)",
      "SpotPrice": "string",
      "Timestamp": "string"
    }
  ]
}