{
  "DescribeInternetGatewaysResponse": {
    "_attr": {
      "xmlns": "http://ec2.amazonaws.com/doc/2016-11-15/"
    },
    "requestId": "424c6b44-4cef-4bf4-9ecf-08e3f5548540",
    "internetGatewaySet": {
      "item": {
        "internetGatewayId": "igw-0875e08c9fe51d909",
        "ownerId": "359954733328",
        "attachmentSet": {
          "item": {
            "vpcId": "vpc-07b0bbfa0573ab106",
            "state": "available"
          }
        },
        "tagSet": {
          "item": {
            "key": "Customer",
            "value": "Customer A"
          }
        }
      }
    }
  }
}