{
  "NextToken": "string",
  "ScheduledInstanceAvailabilitySet": [
    {
      "AvailabilityZone": "string",
      "AvailableInstanceCount": 6,
      "FirstSlotStartTime": "string",
      "HourlyPrice": "string",
      "InstanceType": "string",
      "MaxTermDurationInDays": 9,
      "MinTermDurationInDays": 6,
      "NetworkPlatform": "string",
      "Platform": "string",
      "PurchaseToken": "string",
      "Recurrence": {
        "Frequency": "string",
        "Interval": 5,
        "OccurrenceDaySet": [
          9,
          7,
          2,
          6
        ],
        "OccurrenceRelativeToEnd": false,
        "OccurrenceUnit": "string"
      },
      "SlotDurationInHours": 7,
      "TotalScheduledInstanceHours": 4
    },
    {
      "AvailabilityZone": "string",
      "AvailableInstanceCount": 10,
      "FirstSlotStartTime": "string",
      "HourlyPrice": "string",
      "InstanceType": "string",
      "MaxTermDurationInDays": 1,
      "MinTermDurationInDays": 4,
      "NetworkPlatform": "string",
      "Platform": "string",
      "PurchaseToken": "string",
      "Recurrence": {
        "Frequency": "string",
        "Interval": 3,
        "OccurrenceDaySet": [
          10,
          7,
          1,
          4,
          2,
          7,
          9,
          9,
          6,
          9
        ],
        "OccurrenceRelativeToEnd": false,
        "OccurrenceUnit": "string"
      },
      "SlotDurationInHours": 10,
      "TotalScheduledInstanceHours": 3
    },
    {
      "AvailabilityZone": "string",
      "AvailableInstanceCount": 7,
      "FirstSlotStartTime": "string",
      "HourlyPrice": "string",
      "InstanceType": "string",
      "MaxTermDurationInDays": 3,
      "MinTermDurationInDays": 4,
      "NetworkPlatform": "string",
      "Platform": "string",
      "PurchaseToken": "string",
      "Recurrence": {
        "Frequency": "string",
        "Interval": 4,
        "OccurrenceDaySet": [
          6,
          7,
          8
        ],
        "OccurrenceRelativeToEnd": false,
        "OccurrenceUnit": "string"
      },
      "SlotDurationInHours": 9,
      "TotalScheduledInstanceHours": 6
    },
    {
      "AvailabilityZone": "string",
      "AvailableInstanceCount": 6,
      "FirstSlotStartTime": "string",
      "HourlyPrice": "string",
      "InstanceType": "string",
      "MaxTermDurationInDays": 2,
      "MinTermDurationInDays": 6,
      "NetworkPlatform": "string",
      "Platform": "string",
      "PurchaseToken": "string",
      "Recurrence": {
        "Frequency": "string",
        "Interval": 8,
        "OccurrenceDaySet": [
          1,
          10,
          2,
          7,
          7,
          2,
          7
        ],
        "OccurrenceRelativeToEnd": true,
        "OccurrenceUnit": "string"
      },
      "SlotDurationInHours": 5,
      "TotalScheduledInstanceHours": 3
    },
    {
      "AvailabilityZone": "string",
      "AvailableInstanceCount": 5,
      "FirstSlotStartTime": "string",
      "HourlyPrice": "string",
      "InstanceType": "string",
      "MaxTermDurationInDays": 5,
      "MinTermDurationInDays": 9,
      "NetworkPlatform": "string",
      "Platform": "string",
      "PurchaseToken": "string",
      "Recurrence": {
        "Frequency": "string",
        "Interval": 8,
        "OccurrenceDaySet": [
          10,
          10
        ],
        "OccurrenceRelativeToEnd": false,
        "OccurrenceUnit": "string"
      },
      "SlotDurationInHours": 4,
      "TotalScheduledInstanceHours": 5
    },
    {
      "AvailabilityZone": "string",
      "AvailableInstanceCount": 10,
      "FirstSlotStartTime": "string",
      "HourlyPrice": "string",
      "InstanceType": "string",
      "MaxTermDurationInDays": 2,
      "MinTermDurationInDays": 2,
      "NetworkPlatform": "string",
      "Platform": "string",
      "PurchaseToken": "string",
      "Recurrence": {
        "Frequency": "string",
        "Interval": 10,
        "OccurrenceDaySet": [
          8,
          1,
          3,
          3
        ],
        "OccurrenceRelativeToEnd": false,
        "OccurrenceUnit": "string"
      },
      "SlotDurationInHours": 3,
      "TotalScheduledInstanceHours": 4
    },
    {
      "AvailabilityZone": "string",
      "AvailableInstanceCount": 1,
      "FirstSlotStartTime": "string",
      "HourlyPrice": "string",
      "InstanceType": "string",
      "MaxTermDurationInDays": 3,
      "MinTermDurationInDays": 7,
      "NetworkPlatform": "string",
      "Platform": "string",
      "PurchaseToken": "string",
      "Recurrence": {
        "Frequency": "string",
        "Interval": 6,
        "OccurrenceDaySet": [
          8,
          3,
          10,
          5,
          8
        ],
        "OccurrenceRelativeToEnd": false,
        "OccurrenceUnit": "string"
      },
      "SlotDurationInHours": 2,
      "TotalScheduledInstanceHours": 1
    },
    {
      "AvailabilityZone": "string",
      "AvailableInstanceCount": 1,
      "FirstSlotStartTime": "string",
      "HourlyPrice": "string",
      "InstanceType": "string",
      "MaxTermDurationInDays": 8,
      "MinTermDurationInDays": 9,
      "NetworkPlatform": "string",
      "Platform": "string",
      "PurchaseToken": "string",
      "Recurrence": {
        "Frequency": "string",
        "Interval": 8,
        "OccurrenceDaySet": [
          2,
          9,
          5,
          8,
          6,
          7,
          10,
          3,
          5,
          6
        ],
        "OccurrenceRelativeToEnd": false,
        "OccurrenceUnit": "string"
      },
      "SlotDurationInHours": 1,
      "TotalScheduledInstanceHours": 6
    },
    {
      "AvailabilityZone": "string",
      "AvailableInstanceCount": 10,
      "FirstSlotStartTime": "string",
      "HourlyPrice": "string",
      "InstanceType": "string",
      "MaxTermDurationInDays": 3,
      "MinTermDurationInDays": 7,
      "NetworkPlatform": "string",
      "Platform": "string",
      "PurchaseToken": "string",
      "Recurrence": {
        "Frequency": "string",
        "Interval": 1,
        "OccurrenceDaySet": [
          1,
          10,
          5
        ],
        "OccurrenceRelativeToEnd": true,
        "OccurrenceUnit": "string"
      },
      "SlotDurationInHours": 5,
      "TotalScheduledInstanceHours": 3
    }
  ]
}