{
  "ServiceConfiguration": {
    "ServiceType": [
      {
        "ServiceType": "Gateway"
      },
      {
        "ServiceType": "Interface"
      },
      {
        "ServiceType": "Gateway"
      },
      {
        "ServiceType": "Interface"
      },
      {
        "ServiceType": "Gateway"
      }
    ],
    "ServiceId": "string",
    "ServiceName": "string",
    "ServiceState": "Available",
    "AvailabilityZones": [
      "string",
      "string",
      "string",
      "string",
      "string",
      "string",
      "string"
    ],
    "AcceptanceRequired": false,
    "ManagesVpcEndpoints": true,
    "NetworkLoadBalancerArns": [
      "string",
      "string",
      "string",
      "string",
      "string",
      "string",
      "string",
      "string",
      "string"
    ],
    "BaseEndpointDnsNames": [
      "string",
      "string",
      "string",
      "string",
      "string",
      "string",
      "string",
      "string",
      "string"
    ],
    "PrivateDnsName": "string",
    "Tags": [
      {
        "Key": "string",
        "Value": "string"
      },
      {
        "Key": "string",
        "Value": "string"
      },
      {
        "Key": "string",
        "Value": "string"
      },
      {
        "Key": "string",
        "Value": "string"
      },
      {
        "Key": "string",
        "Value": "string"
      },
      {
        "Key": "string",
        "Value": "string"
      },
      {
        "Key": "string",
        "Value": "string"
      },
      {
        "Key": "string",
        "Value": "string"
      }
    ]
  },
  "ClientToken": "string"
}