{
  "AllowedPrincipals": [
    {
      "PrincipalType": "User",
      "Principal": "string"
    },
    {
      "PrincipalType": "All",
      "Principal": "string"
    },
    {
      "PrincipalType": "Account",
      "Principal": "string"
    },
    {
      "PrincipalType": "OrganizationUnit",
      "Principal": "string"
    }
  ],
  "NextToken": "string"
}