{
  "ReservedInstancesOfferings": [
    {
      "AvailabilityZone": "string",
      "Duration": 7,
      "FixedPrice": 6,
      "InstanceType": "c3.8xlarge",
      "ProductDescription": "Linux/UNIX",
      "ReservedInstancesOfferingId": "string",
      "UsagePrice": 5,
      "CurrencyCode": "USD",
      "InstanceTenancy": "default",
      "Marketplace": true,
      "OfferingClass": "convertible",
      "OfferingType": "Medium Utilization",
      "PricingDetails": [
        {
          "Count": 4,
          "Price": 10
        },
        {
          "Count": 4,
          "Price": 7
        },
        {
          "Count": 1,
          "Price": 7
        },
        {
          "Count": 1,
          "Price": 2
        },
        {
          "Count": 2,
          "Price": 6
        },
        {
          "Count": 8,
          "Price": 8
        },
        {
          "Count": 1,
          "Price": 3
        }
      ],
      "RecurringCharges": [
        {
          "Amount": 8,
          "Frequency": "Hourly"
        },
        {
          "Amount": 6,
          "Frequency": "Hourly"
        },
        {
          "Amount": 7,
          "Frequency": "Hourly"
        },
        {
          "Amount": 3,
          "Frequency": "Hourly"
        },
        {
          "Amount": 2,
          "Frequency": "Hourly"
        },
        {
          "Amount": 9,
          "Frequency": "Hourly"
        },
        {
          "Amount": 8,
          "Frequency": "Hourly"
        },
        {
          "Amount": 6,
          "Frequency": "Hourly"
        },
        {
          "Amount": 8,
          "Frequency": "Hourly"
        },
        {
          "Amount": 8,
          "Frequency": "Hourly"
        }
      ],
      "Scope": "Region"
    },
    {
      "AvailabilityZone": "string",
      "Duration": 6,
      "FixedPrice": 6,
      "InstanceType": "t2.medium",
      "ProductDescription": "Linux/UNIX",
      "ReservedInstancesOfferingId": "string",
      "UsagePrice": 6,
      "CurrencyCode": "USD",
      "InstanceTenancy": "dedicated",
      "Marketplace": true,
      "OfferingClass": "convertible",
      "OfferingType": "No Upfront",
      "PricingDetails": [
        {
          "Count": 9,
          "Price": 9
        },
        {
          "Count": 4,
          "Price": 8
        },
        {
          "Count": 2,
          "Price": 1
        },
        {
          "Count": 4,
          "Price": 3
        }
      ],
      "RecurringCharges": [
        {
          "Amount": 1,
          "Frequency": "Hourly"
        },
        {
          "Amount": 10,
          "Frequency": "Hourly"
        },
        {
          "Amount": 5,
          "Frequency": "Hourly"
        },
        {
          "Amount": 8,
          "Frequency": "Hourly"
        },
        {
          "Amount": 9,
          "Frequency": "Hourly"
        },
        {
          "Amount": 6,
          "Frequency": "Hourly"
        },
        {
          "Amount": 9,
          "Frequency": "Hourly"
        },
        {
          "Amount": 4,
          "Frequency": "Hourly"
        },
        {
          "Amount": 9,
          "Frequency": "Hourly"
        },
        {
          "Amount": 7,
          "Frequency": "Hourly"
        }
      ],
      "Scope": "Availability Zone"
    },
    {
      "AvailabilityZone": "string",
      "Duration": 3,
      "FixedPrice": 6,
      "InstanceType": "c5d.9xlarge",
      "ProductDescription": "Windows",
      "ReservedInstancesOfferingId": "string",
      "UsagePrice": 8,
      "CurrencyCode": "USD",
      "InstanceTenancy": "default",
      "Marketplace": false,
      "OfferingClass": "convertible",
      "OfferingType": "Heavy Utilization",
      "PricingDetails": [
        {
          "Count": 3,
          "Price": 2
        },
        {
          "Count": 7,
          "Price": 7
        },
        {
          "Count": 4,
          "Price": 10
        },
        {
          "Count": 9,
          "Price": 3
        },
        {
          "Count": 1,
          "Price": 7
        },
        {
          "Count": 6,
          "Price": 8
        },
        {
          "Count": 4,
          "Price": 10
        }
      ],
      "RecurringCharges": [
        {
          "Amount": 5,
          "Frequency": "Hourly"
        },
        {
          "Amount": 9,
          "Frequency": "Hourly"
        },
        {
          "Amount": 9,
          "Frequency": "Hourly"
        },
        {
          "Amount": 2,
          "Frequency": "Hourly"
        },
        {
          "Amount": 5,
          "Frequency": "Hourly"
        },
        {
          "Amount": 7,
          "Frequency": "Hourly"
        },
        {
          "Amount": 9,
          "Frequency": "Hourly"
        },
        {
          "Amount": 6,
          "Frequency": "Hourly"
        }
      ],
      "Scope": "Region"
    },
    {
      "AvailabilityZone": "string",
      "Duration": 9,
      "FixedPrice": 2,
      "InstanceType": "m5d.12xlarge",
      "ProductDescription": "Linux/UNIX",
      "ReservedInstancesOfferingId": "string",
      "UsagePrice": 10,
      "CurrencyCode": "USD",
      "InstanceTenancy": "dedicated",
      "Marketplace": true,
      "OfferingClass": "convertible",
      "OfferingType": "Medium Utilization",
      "PricingDetails": [
        {
          "Count": 1,
          "Price": 7
        },
        {
          "Count": 3,
          "Price": 8
        },
        {
          "Count": 8,
          "Price": 9
        },
        {
          "Count": 10,
          "Price": 1
        },
        {
          "Count": 4,
          "Price": 4
        },
        {
          "Count": 2,
          "Price": 9
        },
        {
          "Count": 9,
          "Price": 1
        },
        {
          "Count": 7,
          "Price": 3
        }
      ],
      "RecurringCharges": [
        {
          "Amount": 5,
          "Frequency": "Hourly"
        },
        {
          "Amount": 3,
          "Frequency": "Hourly"
        },
        {
          "Amount": 7,
          "Frequency": "Hourly"
        },
        {
          "Amount": 5,
          "Frequency": "Hourly"
        },
        {
          "Amount": 3,
          "Frequency": "Hourly"
        },
        {
          "Amount": 3,
          "Frequency": "Hourly"
        },
        {
          "Amount": 5,
          "Frequency": "Hourly"
        }
      ],
      "Scope": "Region"
    }
  ],
  "NextToken": "string"
}