{
  "InstanceStatuses": [
    {
      "AvailabilityZone": "string",
      "Events": [
        {
          "InstanceEventId": "string",
          "Code": "instance-reboot",
          "Description": "string",
          "NotAfter": "string",
          "NotBefore": "string",
          "NotBeforeDeadline": "string"
        },
        {
          "InstanceEventId": "string",
          "Code": "instance-retirement",
          "Description": "string",
          "NotAfter": "string",
          "NotBefore": "string",
          "NotBeforeDeadline": "string"
        },
        {
          "InstanceEventId": "string",
          "Code": "instance-retirement",
          "Description": "string",
          "NotAfter": "string",
          "NotBefore": "string",
          "NotBeforeDeadline": "string"
        },
        {
          "InstanceEventId": "string",
          "Code": "system-reboot",
          "Description": "string",
          "NotAfter": "string",
          "NotBefore": "string",
          "NotBeforeDeadline": "string"
        },
        {
          "InstanceEventId": "string",
          "Code": "system-maintenance",
          "Description": "string",
          "NotAfter": "string",
          "NotBefore": "string",
          "NotBeforeDeadline": "string"
        },
        {
          "InstanceEventId": "string",
          "Code": "instance-reboot",
          "Description": "string",
          "NotAfter": "string",
          "NotBefore": "string",
          "NotBeforeDeadline": "string"
        },
        {
          "InstanceEventId": "string",
          "Code": "instance-stop",
          "Description": "string",
          "NotAfter": "string",
          "NotBefore": "string",
          "NotBeforeDeadline": "string"
        },
        {
          "InstanceEventId": "string",
          "Code": "instance-reboot",
          "Description": "string",
          "NotAfter": "string",
          "NotBefore": "string",
          "NotBeforeDeadline": "string"
        },
        {
          "InstanceEventId": "string",
          "Code": "system-reboot",
          "Description": "string",
          "NotAfter": "string",
          "NotBefore": "string",
          "NotBeforeDeadline": "string"
        }
      ],
      "InstanceId": "string",
      "InstanceState": {
        "Code": 1,
        "Name": "shutting-down"
      },
      "InstanceStatus": {
        "Details": [
          {
            "ImpairedSince": "string",
            "Name": "reachability",
            "Status": "initializing"
          },
          {
            "ImpairedSince": "string",
            "Name": "reachability",
            "Status": "insufficient-data"
          },
          {
            "ImpairedSince": "string",
            "Name": "reachability",
            "Status": "insufficient-data"
          },
          {
            "ImpairedSince": "string",
            "Name": "reachability",
            "Status": "initializing"
          },
          {
            "ImpairedSince": "string",
            "Name": "reachability",
            "Status": "initializing"
          },
          {
            "ImpairedSince": "string",
            "Name": "reachability",
            "Status": "passed"
          },
          {
            "ImpairedSince": "string",
            "Name": "reachability",
            "Status": "initializing"
          },
          {
            "ImpairedSince": "string",
            "Name": "reachability",
            "Status": "insufficient-data"
          },
          {
            "ImpairedSince": "string",
            "Name": "reachability",
            "Status": "initializing"
          }
        ],
        "Status": "initializing"
      },
      "SystemStatus": {
        "Details": [
          {
            "ImpairedSince": "string",
            "Name": "reachability",
            "Status": "initializing"
          },
          {
            "ImpairedSince": "string",
            "Name": "reachability",
            "Status": "failed"
          },
          {
            "ImpairedSince": "string",
            "Name": "reachability",
            "Status": "initializing"
          },
          {
            "ImpairedSince": "string",
            "Name": "reachability",
            "Status": "failed"
          }
        ],
        "Status": "initializing"
      }
    },
    {
      "AvailabilityZone": "string",
      "Events": [
        {
          "InstanceEventId": "string",
          "Code": "instance-retirement",
          "Description": "string",
          "NotAfter": "string",
          "NotBefore": "string",
          "NotBeforeDeadline": "string"
        },
        {
          "InstanceEventId": "string",
          "Code": "system-maintenance",
          "Description": "string",
          "NotAfter": "string",
          "NotBefore": "string",
          "NotBeforeDeadline": "string"
        },
        {
          "InstanceEventId": "string",
          "Code": "instance-stop",
          "Description": "string",
          "NotAfter": "string",
          "NotBefore": "string",
          "NotBeforeDeadline": "string"
        }
      ],
      "InstanceId": "string",
      "InstanceState": {
        "Code": 8,
        "Name": "stopping"
      },
      "InstanceStatus": {
        "Details": [
          {
            "ImpairedSince": "string",
            "Name": "reachability",
            "Status": "insufficient-data"
          },
          {
            "ImpairedSince": "string",
            "Name": "reachability",
            "Status": "failed"
          },
          {
            "ImpairedSince": "string",
            "Name": "reachability",
            "Status": "initializing"
          },
          {
            "ImpairedSince": "string",
            "Name": "reachability",
            "Status": "passed"
          },
          {
            "ImpairedSince": "string",
            "Name": "reachability",
            "Status": "initializing"
          }
        ],
        "Status": "initializing"
      },
      "SystemStatus": {
        "Details": [
          {
            "ImpairedSince": "string",
            "Name": "reachability",
            "Status": "initializing"
          },
          {
            "ImpairedSince": "string",
            "Name": "reachability",
            "Status": "initializing"
          },
          {
            "ImpairedSince": "string",
            "Name": "reachability",
            "Status": "passed"
          },
          {
            "ImpairedSince": "string",
            "Name": "reachability",
            "Status": "initializing"
          },
          {
            "ImpairedSince": "string",
            "Name": "reachability",
            "Status": "insufficient-data"
          },
          {
            "ImpairedSince": "string",
            "Name": "reachability",
            "Status": "failed"
          },
          {
            "ImpairedSince": "string",
            "Name": "reachability",
            "Status": "initializing"
          }
        ],
        "Status": "not-applicable"
      }
    },
    {
      "AvailabilityZone": "string",
      "Events": [
        {
          "InstanceEventId": "string",
          "Code": "instance-reboot",
          "Description": "string",
          "NotAfter": "string",
          "NotBefore": "string",
          "NotBeforeDeadline": "string"
        },
        {
          "InstanceEventId": "string",
          "Code": "system-maintenance",
          "Description": "string",
          "NotAfter": "string",
          "NotBefore": "string",
          "NotBeforeDeadline": "string"
        },
        {
          "InstanceEventId": "string",
          "Code": "system-reboot",
          "Description": "string",
          "NotAfter": "string",
          "NotBefore": "string",
          "NotBeforeDeadline": "string"
        },
        {
          "InstanceEventId": "string",
          "Code": "system-reboot",
          "Description": "string",
          "NotAfter": "string",
          "NotBefore": "string",
          "NotBeforeDeadline": "string"
        },
        {
          "InstanceEventId": "string",
          "Code": "instance-stop",
          "Description": "string",
          "NotAfter": "string",
          "NotBefore": "string",
          "NotBeforeDeadline": "string"
        }
      ],
      "InstanceId": "string",
      "InstanceState": {
        "Code": 8,
        "Name": "stopping"
      },
      "InstanceStatus": {
        "Details": [
          {
            "ImpairedSince": "string",
            "Name": "reachability",
            "Status": "passed"
          },
          {
            "ImpairedSince": "string",
            "Name": "reachability",
            "Status": "passed"
          },
          {
            "ImpairedSince": "string",
            "Name": "reachability",
            "Status": "failed"
          },
          {
            "ImpairedSince": "string",
            "Name": "reachability",
            "Status": "initializing"
          },
          {
            "ImpairedSince": "string",
            "Name": "reachability",
            "Status": "initializing"
          },
          {
            "ImpairedSince": "string",
            "Name": "reachability",
            "Status": "passed"
          },
          {
            "ImpairedSince": "string",
            "Name": "reachability",
            "Status": "insufficient-data"
          }
        ],
        "Status": "insufficient-data"
      },
      "SystemStatus": {
        "Details": [
          {
            "ImpairedSince": "string",
            "Name": "reachability",
            "Status": "initializing"
          },
          {
            "ImpairedSince": "string",
            "Name": "reachability",
            "Status": "passed"
          },
          {
            "ImpairedSince": "string",
            "Name": "reachability",
            "Status": "initializing"
          },
          {
            "ImpairedSince": "string",
            "Name": "reachability",
            "Status": "insufficient-data"
          },
          {
            "ImpairedSince": "string",
            "Name": "reachability",
            "Status": "initializing"
          },
          {
            "ImpairedSince": "string",
            "Name": "reachability",
            "Status": "passed"
          },
          {
            "ImpairedSince": "string",
            "Name": "reachability",
            "Status": "insufficient-data"
          }
        ],
        "Status": "initializing"
      }
    },
    {
      "AvailabilityZone": "string",
      "Events": [
        {
          "InstanceEventId": "string",
          "Code": "instance-reboot",
          "Description": "string",
          "NotAfter": "string",
          "NotBefore": "string",
          "NotBeforeDeadline": "string"
        },
        {
          "InstanceEventId": "string",
          "Code": "system-maintenance",
          "Description": "string",
          "NotAfter": "string",
          "NotBefore": "string",
          "NotBeforeDeadline": "string"
        }
      ],
      "InstanceId": "string",
      "InstanceState": {
        "Code": 6,
        "Name": "pending"
      },
      "InstanceStatus": {
        "Details": [
          {
            "ImpairedSince": "string",
            "Name": "reachability",
            "Status": "insufficient-data"
          },
          {
            "ImpairedSince": "string",
            "Name": "reachability",
            "Status": "initializing"
          },
          {
            "ImpairedSince": "string",
            "Name": "reachability",
            "Status": "insufficient-data"
          },
          {
            "ImpairedSince": "string",
            "Name": "reachability",
            "Status": "initializing"
          },
          {
            "ImpairedSince": "string",
            "Name": "reachability",
            "Status": "initializing"
          },
          {
            "ImpairedSince": "string",
            "Name": "reachability",
            "Status": "passed"
          }
        ],
        "Status": "impaired"
      },
      "SystemStatus": {
        "Details": [
          {
            "ImpairedSince": "string",
            "Name": "reachability",
            "Status": "passed"
          },
          {
            "ImpairedSince": "string",
            "Name": "reachability",
            "Status": "passed"
          },
          {
            "ImpairedSince": "string",
            "Name": "reachability",
            "Status": "failed"
          },
          {
            "ImpairedSince": "string",
            "Name": "reachability",
            "Status": "failed"
          },
          {
            "ImpairedSince": "string",
            "Name": "reachability",
            "Status": "insufficient-data"
          },
          {
            "ImpairedSince": "string",
            "Name": "reachability",
            "Status": "failed"
          },
          {
            "ImpairedSince": "string",
            "Name": "reachability",
            "Status": "passed"
          },
          {
            "ImpairedSince": "string",
            "Name": "reachability",
            "Status": "failed"
          },
          {
            "ImpairedSince": "string",
            "Name": "reachability",
            "Status": "failed"
          },
          {
            "ImpairedSince": "string",
            "Name": "reachability",
            "Status": "failed"
          }
        ],
        "Status": "impaired"
      }
    },
    {
      "AvailabilityZone": "string",
      "Events": [
        {
          "InstanceEventId": "string",
          "Code": "instance-stop",
          "Description": "string",
          "NotAfter": "string",
          "NotBefore": "string",
          "NotBeforeDeadline": "string"
        },
        {
          "InstanceEventId": "string",
          "Code": "instance-stop",
          "Description": "string",
          "NotAfter": "string",
          "NotBefore": "string",
          "NotBeforeDeadline": "string"
        },
        {
          "InstanceEventId": "string",
          "Code": "instance-retirement",
          "Description": "string",
          "NotAfter": "string",
          "NotBefore": "string",
          "NotBeforeDeadline": "string"
        },
        {
          "InstanceEventId": "string",
          "Code": "instance-stop",
          "Description": "string",
          "NotAfter": "string",
          "NotBefore": "string",
          "NotBeforeDeadline": "string"
        },
        {
          "InstanceEventId": "string",
          "Code": "instance-retirement",
          "Description": "string",
          "NotAfter": "string",
          "NotBefore": "string",
          "NotBeforeDeadline": "string"
        },
        {
          "InstanceEventId": "string",
          "Code": "instance-stop",
          "Description": "string",
          "NotAfter": "string",
          "NotBefore": "string",
          "NotBeforeDeadline": "string"
        },
        {
          "InstanceEventId": "string",
          "Code": "system-reboot",
          "Description": "string",
          "NotAfter": "string",
          "NotBefore": "string",
          "NotBeforeDeadline": "string"
        },
        {
          "InstanceEventId": "string",
          "Code": "instance-reboot",
          "Description": "string",
          "NotAfter": "string",
          "NotBefore": "string",
          "NotBeforeDeadline": "string"
        },
        {
          "InstanceEventId": "string",
          "Code": "system-maintenance",
          "Description": "string",
          "NotAfter": "string",
          "NotBefore": "string",
          "NotBeforeDeadline": "string"
        },
        {
          "InstanceEventId": "string",
          "Code": "system-reboot",
          "Description": "string",
          "NotAfter": "string",
          "NotBefore": "string",
          "NotBeforeDeadline": "string"
        }
      ],
      "InstanceId": "string",
      "InstanceState": {
        "Code": 7,
        "Name": "terminated"
      },
      "InstanceStatus": {
        "Details": [
          {
            "ImpairedSince": "string",
            "Name": "reachability",
            "Status": "passed"
          },
          {
            "ImpairedSince": "string",
            "Name": "reachability",
            "Status": "failed"
          },
          {
            "ImpairedSince": "string",
            "Name": "reachability",
            "Status": "passed"
          },
          {
            "ImpairedSince": "string",
            "Name": "reachability",
            "Status": "passed"
          },
          {
            "ImpairedSince": "string",
            "Name": "reachability",
            "Status": "failed"
          }
        ],
        "Status": "ok"
      },
      "SystemStatus": {
        "Details": [
          {
            "ImpairedSince": "string",
            "Name": "reachability",
            "Status": "initializing"
          },
          {
            "ImpairedSince": "string",
            "Name": "reachability",
            "Status": "passed"
          },
          {
            "ImpairedSince": "string",
            "Name": "reachability",
            "Status": "passed"
          },
          {
            "ImpairedSince": "string",
            "Name": "reachability",
            "Status": "passed"
          }
        ],
        "Status": "impaired"
      }
    },
    {
      "AvailabilityZone": "string",
      "Events": [
        {
          "InstanceEventId": "string",
          "Code": "system-reboot",
          "Description": "string",
          "NotAfter": "string",
          "NotBefore": "string",
          "NotBeforeDeadline": "string"
        },
        {
          "InstanceEventId": "string",
          "Code": "instance-retirement",
          "Description": "string",
          "NotAfter": "string",
          "NotBefore": "string",
          "NotBeforeDeadline": "string"
        },
        {
          "InstanceEventId": "string",
          "Code": "system-reboot",
          "Description": "string",
          "NotAfter": "string",
          "NotBefore": "string",
          "NotBeforeDeadline": "string"
        },
        {
          "InstanceEventId": "string",
          "Code": "instance-retirement",
          "Description": "string",
          "NotAfter": "string",
          "NotBefore": "string",
          "NotBeforeDeadline": "string"
        }
      ],
      "InstanceId": "string",
      "InstanceState": {
        "Code": 4,
        "Name": "stopping"
      },
      "InstanceStatus": {
        "Details": [
          {
            "ImpairedSince": "string",
            "Name": "reachability",
            "Status": "initializing"
          }
        ],
        "Status": "not-applicable"
      },
      "SystemStatus": {
        "Details": [
          {
            "ImpairedSince": "string",
            "Name": "reachability",
            "Status": "initializing"
          },
          {
            "ImpairedSince": "string",
            "Name": "reachability",
            "Status": "passed"
          },
          {
            "ImpairedSince": "string",
            "Name": "reachability",
            "Status": "failed"
          },
          {
            "ImpairedSince": "string",
            "Name": "reachability",
            "Status": "passed"
          },
          {
            "ImpairedSince": "string",
            "Name": "reachability",
            "Status": "failed"
          },
          {
            "ImpairedSince": "string",
            "Name": "reachability",
            "Status": "passed"
          },
          {
            "ImpairedSince": "string",
            "Name": "reachability",
            "Status": "failed"
          }
        ],
        "Status": "insufficient-data"
      }
    },
    {
      "AvailabilityZone": "string",
      "Events": [
        {
          "InstanceEventId": "string",
          "Code": "instance-reboot",
          "Description": "string",
          "NotAfter": "string",
          "NotBefore": "string",
          "NotBeforeDeadline": "string"
        },
        {
          "InstanceEventId": "string",
          "Code": "instance-retirement",
          "Description": "string",
          "NotAfter": "string",
          "NotBefore": "string",
          "NotBeforeDeadline": "string"
        }
      ],
      "InstanceId": "string",
      "InstanceState": {
        "Code": 8,
        "Name": "pending"
      },
      "InstanceStatus": {
        "Details": [
          {
            "ImpairedSince": "string",
            "Name": "reachability",
            "Status": "failed"
          },
          {
            "ImpairedSince": "string",
            "Name": "reachability",
            "Status": "insufficient-data"
          },
          {
            "ImpairedSince": "string",
            "Name": "reachability",
            "Status": "passed"
          },
          {
            "ImpairedSince": "string",
            "Name": "reachability",
            "Status": "insufficient-data"
          },
          {
            "ImpairedSince": "string",
            "Name": "reachability",
            "Status": "initializing"
          },
          {
            "ImpairedSince": "string",
            "Name": "reachability",
            "Status": "failed"
          }
        ],
        "Status": "ok"
      },
      "SystemStatus": {
        "Details": [
          {
            "ImpairedSince": "string",
            "Name": "reachability",
            "Status": "failed"
          },
          {
            "ImpairedSince": "string",
            "Name": "reachability",
            "Status": "failed"
          },
          {
            "ImpairedSince": "string",
            "Name": "reachability",
            "Status": "initializing"
          },
          {
            "ImpairedSince": "string",
            "Name": "reachability",
            "Status": "initializing"
          },
          {
            "ImpairedSince": "string",
            "Name": "reachability",
            "Status": "failed"
          },
          {
            "ImpairedSince": "string",
            "Name": "reachability",
            "Status": "failed"
          }
        ],
        "Status": "insufficient-data"
      }
    },
    {
      "AvailabilityZone": "string",
      "Events": [
        {
          "InstanceEventId": "string",
          "Code": "instance-stop",
          "Description": "string",
          "NotAfter": "string",
          "NotBefore": "string",
          "NotBeforeDeadline": "string"
        },
        {
          "InstanceEventId": "string",
          "Code": "instance-retirement",
          "Description": "string",
          "NotAfter": "string",
          "NotBefore": "string",
          "NotBeforeDeadline": "string"
        },
        {
          "InstanceEventId": "string",
          "Code": "system-maintenance",
          "Description": "string",
          "NotAfter": "string",
          "NotBefore": "string",
          "NotBeforeDeadline": "string"
        }
      ],
      "InstanceId": "string",
      "InstanceState": {
        "Code": 5,
        "Name": "stopped"
      },
      "InstanceStatus": {
        "Details": [
          {
            "ImpairedSince": "string",
            "Name": "reachability",
            "Status": "insufficient-data"
          },
          {
            "ImpairedSince": "string",
            "Name": "reachability",
            "Status": "initializing"
          },
          {
            "ImpairedSince": "string",
            "Name": "reachability",
            "Status": "passed"
          },
          {
            "ImpairedSince": "string",
            "Name": "reachability",
            "Status": "failed"
          },
          {
            "ImpairedSince": "string",
            "Name": "reachability",
            "Status": "failed"
          },
          {
            "ImpairedSince": "string",
            "Name": "reachability",
            "Status": "failed"
          },
          {
            "ImpairedSince": "string",
            "Name": "reachability",
            "Status": "initializing"
          }
        ],
        "Status": "not-applicable"
      },
      "SystemStatus": {
        "Details": [
          {
            "ImpairedSince": "string",
            "Name": "reachability",
            "Status": "failed"
          },
          {
            "ImpairedSince": "string",
            "Name": "reachability",
            "Status": "failed"
          }
        ],
        "Status": "ok"
      }
    },
    {
      "AvailabilityZone": "string",
      "Events": [
        {
          "InstanceEventId": "string",
          "Code": "system-reboot",
          "Description": "string",
          "NotAfter": "string",
          "NotBefore": "string",
          "NotBeforeDeadline": "string"
        },
        {
          "InstanceEventId": "string",
          "Code": "system-reboot",
          "Description": "string",
          "NotAfter": "string",
          "NotBefore": "string",
          "NotBeforeDeadline": "string"
        },
        {
          "InstanceEventId": "string",
          "Code": "instance-stop",
          "Description": "string",
          "NotAfter": "string",
          "NotBefore": "string",
          "NotBeforeDeadline": "string"
        },
        {
          "InstanceEventId": "string",
          "Code": "system-reboot",
          "Description": "string",
          "NotAfter": "string",
          "NotBefore": "string",
          "NotBeforeDeadline": "string"
        },
        {
          "InstanceEventId": "string",
          "Code": "system-reboot",
          "Description": "string",
          "NotAfter": "string",
          "NotBefore": "string",
          "NotBeforeDeadline": "string"
        },
        {
          "InstanceEventId": "string",
          "Code": "instance-stop",
          "Description": "string",
          "NotAfter": "string",
          "NotBefore": "string",
          "NotBeforeDeadline": "string"
        },
        {
          "InstanceEventId": "string",
          "Code": "system-reboot",
          "Description": "string",
          "NotAfter": "string",
          "NotBefore": "string",
          "NotBeforeDeadline": "string"
        },
        {
          "InstanceEventId": "string",
          "Code": "instance-retirement",
          "Description": "string",
          "NotAfter": "string",
          "NotBefore": "string",
          "NotBeforeDeadline": "string"
        },
        {
          "InstanceEventId": "string",
          "Code": "instance-stop",
          "Description": "string",
          "NotAfter": "string",
          "NotBefore": "string",
          "NotBeforeDeadline": "string"
        }
      ],
      "InstanceId": "string",
      "InstanceState": {
        "Code": 10,
        "Name": "terminated"
      },
      "InstanceStatus": {
        "Details": [
          {
            "ImpairedSince": "string",
            "Name": "reachability",
            "Status": "insufficient-data"
          },
          {
            "ImpairedSince": "string",
            "Name": "reachability",
            "Status": "initializing"
          },
          {
            "ImpairedSince": "string",
            "Name": "reachability",
            "Status": "insufficient-data"
          },
          {
            "ImpairedSince": "string",
            "Name": "reachability",
            "Status": "initializing"
          },
          {
            "ImpairedSince": "string",
            "Name": "reachability",
            "Status": "failed"
          }
        ],
        "Status": "initializing"
      },
      "SystemStatus": {
        "Details": [
          {
            "ImpairedSince": "string",
            "Name": "reachability",
            "Status": "failed"
          },
          {
            "ImpairedSince": "string",
            "Name": "reachability",
            "Status": "initializing"
          },
          {
            "ImpairedSince": "string",
            "Name": "reachability",
            "Status": "failed"
          },
          {
            "ImpairedSince": "string",
            "Name": "reachability",
            "Status": "passed"
          },
          {
            "ImpairedSince": "string",
            "Name": "reachability",
            "Status": "passed"
          },
          {
            "ImpairedSince": "string",
            "Name": "reachability",
            "Status": "initializing"
          },
          {
            "ImpairedSince": "string",
            "Name": "reachability",
            "Status": "insufficient-data"
          },
          {
            "ImpairedSince": "string",
            "Name": "reachability",
            "Status": "initializing"
          },
          {
            "ImpairedSince": "string",
            "Name": "reachability",
            "Status": "passed"
          },
          {
            "ImpairedSince": "string",
            "Name": "reachability",
            "Status": "failed"
          }
        ],
        "Status": "not-applicable"
      }
    },
    {
      "AvailabilityZone": "string",
      "Events": [
        {
          "InstanceEventId": "string",
          "Code": "instance-retirement",
          "Description": "string",
          "NotAfter": "string",
          "NotBefore": "string",
          "NotBeforeDeadline": "string"
        },
        {
          "InstanceEventId": "string",
          "Code": "instance-stop",
          "Description": "string",
          "NotAfter": "string",
          "NotBefore": "string",
          "NotBeforeDeadline": "string"
        },
        {
          "InstanceEventId": "string",
          "Code": "system-reboot",
          "Description": "string",
          "NotAfter": "string",
          "NotBefore": "string",
          "NotBeforeDeadline": "string"
        },
        {
          "InstanceEventId": "string",
          "Code": "system-reboot",
          "Description": "string",
          "NotAfter": "string",
          "NotBefore": "string",
          "NotBeforeDeadline": "string"
        },
        {
          "InstanceEventId": "string",
          "Code": "instance-stop",
          "Description": "string",
          "NotAfter": "string",
          "NotBefore": "string",
          "NotBeforeDeadline": "string"
        },
        {
          "InstanceEventId": "string",
          "Code": "instance-reboot",
          "Description": "string",
          "NotAfter": "string",
          "NotBefore": "string",
          "NotBeforeDeadline": "string"
        },
        {
          "InstanceEventId": "string",
          "Code": "instance-retirement",
          "Description": "string",
          "NotAfter": "string",
          "NotBefore": "string",
          "NotBeforeDeadline": "string"
        },
        {
          "InstanceEventId": "string",
          "Code": "instance-stop",
          "Description": "string",
          "NotAfter": "string",
          "NotBefore": "string",
          "NotBeforeDeadline": "string"
        },
        {
          "InstanceEventId": "string",
          "Code": "system-reboot",
          "Description": "string",
          "NotAfter": "string",
          "NotBefore": "string",
          "NotBeforeDeadline": "string"
        },
        {
          "InstanceEventId": "string",
          "Code": "system-reboot",
          "Description": "string",
          "NotAfter": "string",
          "NotBefore": "string",
          "NotBeforeDeadline": "string"
        }
      ],
      "InstanceId": "string",
      "InstanceState": {
        "Code": 8,
        "Name": "stopping"
      },
      "InstanceStatus": {
        "Details": [
          {
            "ImpairedSince": "string",
            "Name": "reachability",
            "Status": "insufficient-data"
          },
          {
            "ImpairedSince": "string",
            "Name": "reachability",
            "Status": "failed"
          },
          {
            "ImpairedSince": "string",
            "Name": "reachability",
            "Status": "insufficient-data"
          },
          {
            "ImpairedSince": "string",
            "Name": "reachability",
            "Status": "passed"
          }
        ],
        "Status": "impaired"
      },
      "SystemStatus": {
        "Details": [
          {
            "ImpairedSince": "string",
            "Name": "reachability",
            "Status": "initializing"
          },
          {
            "ImpairedSince": "string",
            "Name": "reachability",
            "Status": "failed"
          },
          {
            "ImpairedSince": "string",
            "Name": "reachability",
            "Status": "insufficient-data"
          },
          {
            "ImpairedSince": "string",
            "Name": "reachability",
            "Status": "initializing"
          },
          {
            "ImpairedSince": "string",
            "Name": "reachability",
            "Status": "initializing"
          },
          {
            "ImpairedSince": "string",
            "Name": "reachability",
            "Status": "insufficient-data"
          },
          {
            "ImpairedSince": "string",
            "Name": "reachability",
            "Status": "initializing"
          },
          {
            "ImpairedSince": "string",
            "Name": "reachability",
            "Status": "failed"
          },
          {
            "ImpairedSince": "string",
            "Name": "reachability",
            "Status": "passed"
          }
        ],
        "Status": "initializing"
      }
    }
  ],
  "NextToken": "string"
}