{
  "TransitGatewayVpcAttachment": {
    "TransitGatewayAttachmentId": "string",
    "TransitGatewayId": "string",
    "VpcId": "string",
    "VpcOwnerId": "string",
    "State": "available",
    "SubnetIds": [
      "string",
      "string",
      "string",
      "string"
    ],
    "CreationTime": "string",
    "Options": {
      "DnsSupport": "enable",
      "Ipv6Support": "enable"
    },
    "Tags": [
      {
        "Key": "string",
        "Value": "string"
      },
      {
        "Key": "string",
        "Value": "string"
      },
      {
        "Key": "string",
        "Value": "string"
      },
      {
        "Key": "string",
        "Value": "string"
      }
    ]
  }
}