{
  "KeyPairs": [
    {
      "KeyFingerprint": "string",
      "KeyName": "string"
    },
    {
      "KeyFingerprint": "string",
      "KeyName": "string"
    },
    {
      "KeyFingerprint": "string",
      "KeyName": "string"
    },
    {
      "KeyFingerprint": "string",
      "KeyName": "string"
    },
    {
      "KeyFingerprint": "string",
      "KeyName": "string"
    },
    {
      "KeyFingerprint": "string",
      "KeyName": "string"
    },
    {
      "KeyFingerprint": "string",
      "KeyName": "string"
    },
    {
      "KeyFingerprint": "string",
      "KeyName": "string"
    },
    {
      "KeyFingerprint": "string",
      "KeyName": "string"
    },
    {
      "KeyFingerprint": "string",
      "KeyName": "string"
    }
  ]
}