{
  "DescribeNetworkInterfacesResponse": {
    "_attr": {
      "xmlns": "http://ec2.amazonaws.com/doc/2016-11-15/"
    },
    "requestId": "c2b5df50-a4d2-46b4-a3c4-293609e87a72",
    "networkInterfaceSet": ""
  }
}