{
  "actions": [
    {
      "name": "getCreateTags",
      "protocol": "REST",
      "method": "GET",
      "entitypath": "{base_path}/{version}?{query}",
      "requestSchema": "schema.json",
      "responseSchema": "schema.json",
      "timeout": 0,
      "sendEmpty": false,
      "sendGetBody": false,
      "requestDatatype": "URLENCODE",
      "responseDatatype": "XML2JSON",
      "headers": {},
      "responseObjects": [
        {
          "type": "default",
          "key": "",
          "mockFile": ""
        }
      ]
    },
    {
      "name": "postCreateTags",
      "protocol": "REST",
      "method": "POST",
      "entitypath": "{base_path}/{version}?{query}",
      "requestSchema": "schema.json",
      "responseSchema": "schema.json",
      "timeout": 0,
      "sendEmpty": false,
      "sendGetBody": false,
      "requestDatatype": "URLENCODE",
      "responseDatatype": "XML2JSON",
      "headers": {},
      "responseObjects": [
        {
          "type": "default",
          "key": "",
          "mockFile": ""
        }
      ]
    }
  ]
}