{
  "PlacementGroups": [
    {
      "GroupName": "string",
      "State": "available",
      "Strategy": "spread",
      "PartitionCount": 3
    },
    {
      "GroupName": "string",
      "State": "deleted",
      "Strategy": "cluster",
      "PartitionCount": 3
    }
  ]
}