{
  "actions": [
    {
      "name": "describeSubnets",
      "protocol": "REST",
      "method": "GET",
      "entitypath": "{base_path}/{version}?{query}",
      "requestSchema": "schema.json",
      "responseSchema": "schema.json",
      "timeout": 0,
      "sendEmpty": false,
      "sendGetBody": false,
      "requestDatatype": "URLENCODE",
      "responseDatatype": "XML2JSON",
      "headers": {},
      "responseObjects": [
        {
          "type": "default",
          "key": "",
          "mockFile": "mockdatafiles/describeSubnets-default.json"
        }
      ]
    },
    {
      "name": "createSubnet",
      "protocol": "REST",
      "method": "GET",
      "entitypath": "{base_path}/{version}?{query}",
      "requestSchema": "schema.json",
      "responseSchema": "schema.json",
      "timeout": 0,
      "sendEmpty": false,
      "sendGetBody": false,
      "requestDatatype": "URLENCODE",
      "responseDatatype": "XML2JSON",
      "headers": {},
      "responseObjects": [
        {
          "type": "default",
          "key": "",
          "mockFile": "mockdatafiles/createSubnet-default.json"
        }
      ]
    },
    {
      "name": "createDefaultSubnet",
      "protocol": "REST",
      "method": "GET",
      "entitypath": "{base_path}/{version}?{query}",
      "requestSchema": "schema.json",
      "responseSchema": "schema.json",
      "timeout": 0,
      "sendEmpty": false,
      "sendGetBody": false,
      "requestDatatype": "URLENCODE",
      "responseDatatype": "XML2JSON",
      "headers": {},
      "responseObjects": [
        {
          "type": "default",
          "key": "",
          "mockFile": "mockdatafiles/createDefaultSubnet-default.json"
        }
      ]
    },
    {
      "name": "modifySubnetAttribute",
      "protocol": "REST",
      "method": "GET",
      "entitypath": "{base_path}/{version}?{query}",
      "requestSchema": "schema.json",
      "responseSchema": "schema.json",
      "timeout": 0,
      "sendEmpty": false,
      "sendGetBody": false,
      "requestDatatype": "URLENCODE",
      "responseDatatype": "XML2JSON",
      "headers": {},
      "responseObjects": [
        {
          "type": "default",
          "key": "",
          "mockFile": ""
        }
      ]
    },
    {
      "name": "associateSubnetCidrBlock",
      "protocol": "REST",
      "method": "GET",
      "entitypath": "{base_path}/{version}?{query}",
      "requestSchema": "schema.json",
      "responseSchema": "schema.json",
      "timeout": 0,
      "sendEmpty": false,
      "sendGetBody": false,
      "requestDatatype": "URLENCODE",
      "responseDatatype": "XML2JSON",
      "headers": {},
      "responseObjects": [
        {
          "type": "default",
          "key": "",
          "mockFile": "mockdatafiles/associateSubnetCidrBlock-default.json"
        }
      ]
    },
    {
      "name": "disassociateSubnetCidrBlock",
      "protocol": "REST",
      "method": "GET",
      "entitypath": "{base_path}/{version}?{query}",
      "requestSchema": "schema.json",
      "responseSchema": "schema.json",
      "timeout": 0,
      "sendEmpty": false,
      "sendGetBody": false,
      "requestDatatype": "URLENCODE",
      "responseDatatype": "XML2JSON",
      "headers": {},
      "responseObjects": [
        {
          "type": "default",
          "key": "",
          "mockFile": "mockdatafiles/disassociateSubnetCidrBlock-default.json"
        }
      ]
    },
    {
      "name": "deleteSubnet",
      "protocol": "REST",
      "method": "GET",
      "entitypath": "{base_path}/{version}?{query}",
      "requestSchema": "schema.json",
      "responseSchema": "schema.json",
      "timeout": 0,
      "sendEmpty": false,
      "sendGetBody": false,
      "requestDatatype": "URLENCODE",
      "responseDatatype": "XML2JSON",
      "headers": {},
      "responseObjects": [
        {
          "type": "default",
          "key": "",
          "mockFile": ""
        }
      ]
    }
  ]
}