{
  "TransitGatewayRouteTablePropagations": [
    {
      "TransitGatewayAttachmentId": "string",
      "ResourceId": "string",
      "ResourceType": "vpc",
      "State": "enabled"
    },
    {
      "TransitGatewayAttachmentId": "string",
      "ResourceId": "string",
      "ResourceType": "vpc",
      "State": "disabling"
    },
    {
      "TransitGatewayAttachmentId": "string",
      "ResourceId": "string",
      "ResourceType": "vpn",
      "State": "enabled"
    },
    {
      "TransitGatewayAttachmentId": "string",
      "ResourceId": "string",
      "ResourceType": "vpn",
      "State": "disabling"
    },
    {
      "TransitGatewayAttachmentId": "string",
      "ResourceId": "string",
      "ResourceType": "vpc",
      "State": "enabled"
    },
    {
      "TransitGatewayAttachmentId": "string",
      "ResourceId": "string",
      "ResourceType": "vpn",
      "State": "enabling"
    },
    {
      "TransitGatewayAttachmentId": "string",
      "ResourceId": "string",
      "ResourceType": "vpn",
      "State": "enabling"
    },
    {
      "TransitGatewayAttachmentId": "string",
      "ResourceId": "string",
      "ResourceType": "vpc",
      "State": "disabled"
    }
  ],
  "NextToken": "string"
}