{
  "ImportSnapshotTasks": [
    {
      "Description": "string",
      "ImportTaskId": "string",
      "SnapshotTaskDetail": {
        "Description": "string",
        "DiskImageSize": 10,
        "Encrypted": true,
        "Format": "string",
        "KmsKeyId": "string",
        "Progress": "string",
        "SnapshotId": "string",
        "Status": "string",
        "StatusMessage": "string",
        "Url": "string",
        "UserBucket": {
          "S3Bucket": "string",
          "S3Key": "string"
        }
      }
    },
    {
      "Description": "string",
      "ImportTaskId": "string",
      "SnapshotTaskDetail": {
        "Description": "string",
        "DiskImageSize": 4,
        "Encrypted": true,
        "Format": "string",
        "KmsKeyId": "string",
        "Progress": "string",
        "SnapshotId": "string",
        "Status": "string",
        "StatusMessage": "string",
        "Url": "string",
        "UserBucket": {
          "S3Bucket": "string",
          "S3Key": "string"
        }
      }
    },
    {
      "Description": "string",
      "ImportTaskId": "string",
      "SnapshotTaskDetail": {
        "Description": "string",
        "DiskImageSize": 5,
        "Encrypted": false,
        "Format": "string",
        "KmsKeyId": "string",
        "Progress": "string",
        "SnapshotId": "string",
        "Status": "string",
        "StatusMessage": "string",
        "Url": "string",
        "UserBucket": {
          "S3Bucket": "string",
          "S3Key": "string"
        }
      }
    },
    {
      "Description": "string",
      "ImportTaskId": "string",
      "SnapshotTaskDetail": {
        "Description": "string",
        "DiskImageSize": 8,
        "Encrypted": false,
        "Format": "string",
        "KmsKeyId": "string",
        "Progress": "string",
        "SnapshotId": "string",
        "Status": "string",
        "StatusMessage": "string",
        "Url": "string",
        "UserBucket": {
          "S3Bucket": "string",
          "S3Key": "string"
        }
      }
    },
    {
      "Description": "string",
      "ImportTaskId": "string",
      "SnapshotTaskDetail": {
        "Description": "string",
        "DiskImageSize": 2,
        "Encrypted": false,
        "Format": "string",
        "KmsKeyId": "string",
        "Progress": "string",
        "SnapshotId": "string",
        "Status": "string",
        "StatusMessage": "string",
        "Url": "string",
        "UserBucket": {
          "S3Bucket": "string",
          "S3Key": "string"
        }
      }
    },
    {
      "Description": "string",
      "ImportTaskId": "string",
      "SnapshotTaskDetail": {
        "Description": "string",
        "DiskImageSize": 10,
        "Encrypted": true,
        "Format": "string",
        "KmsKeyId": "string",
        "Progress": "string",
        "SnapshotId": "string",
        "Status": "string",
        "StatusMessage": "string",
        "Url": "string",
        "UserBucket": {
          "S3Bucket": "string",
          "S3Key": "string"
        }
      }
    },
    {
      "Description": "string",
      "ImportTaskId": "string",
      "SnapshotTaskDetail": {
        "Description": "string",
        "DiskImageSize": 8,
        "Encrypted": true,
        "Format": "string",
        "KmsKeyId": "string",
        "Progress": "string",
        "SnapshotId": "string",
        "Status": "string",
        "StatusMessage": "string",
        "Url": "string",
        "UserBucket": {
          "S3Bucket": "string",
          "S3Key": "string"
        }
      }
    },
    {
      "Description": "string",
      "ImportTaskId": "string",
      "SnapshotTaskDetail": {
        "Description": "string",
        "DiskImageSize": 7,
        "Encrypted": false,
        "Format": "string",
        "KmsKeyId": "string",
        "Progress": "string",
        "SnapshotId": "string",
        "Status": "string",
        "StatusMessage": "string",
        "Url": "string",
        "UserBucket": {
          "S3Bucket": "string",
          "S3Key": "string"
        }
      }
    }
  ],
  "NextToken": "string"
}