{
  "ReservedInstances": [
    {
      "AvailabilityZone": "string",
      "Duration": 7,
      "End": "string",
      "FixedPrice": 8,
      "InstanceCount": 5,
      "InstanceType": "r5ad.16xlarge",
      "ProductDescription": "Windows",
      "ReservedInstancesId": "string",
      "Start": "string",
      "State": "payment-failed",
      "UsagePrice": 10,
      "CurrencyCode": "USD",
      "InstanceTenancy": "dedicated",
      "OfferingClass": "standard",
      "OfferingType": "All Upfront",
      "RecurringCharges": [
        {
          "Amount": 6,
          "Frequency": "Hourly"
        }
      ],
      "Scope": "Region",
      "Tags": [
        {
          "Key": "string",
          "Value": "string"
        },
        {
          "Key": "string",
          "Value": "string"
        }
      ]
    },
    {
      "AvailabilityZone": "string",
      "Duration": 8,
      "End": "string",
      "FixedPrice": 7,
      "InstanceCount": 5,
      "InstanceType": "c3.2xlarge",
      "ProductDescription": "Windows (Amazon VPC)",
      "ReservedInstancesId": "string",
      "Start": "string",
      "State": "payment-pending",
      "UsagePrice": 10,
      "CurrencyCode": "USD",
      "InstanceTenancy": "dedicated",
      "OfferingClass": "standard",
      "OfferingType": "No Upfront",
      "RecurringCharges": [
        {
          "Amount": 2,
          "Frequency": "Hourly"
        },
        {
          "Amount": 5,
          "Frequency": "Hourly"
        },
        {
          "Amount": 4,
          "Frequency": "Hourly"
        },
        {
          "Amount": 10,
          "Frequency": "Hourly"
        },
        {
          "Amount": 2,
          "Frequency": "Hourly"
        },
        {
          "Amount": 2,
          "Frequency": "Hourly"
        },
        {
          "Amount": 9,
          "Frequency": "Hourly"
        }
      ],
      "Scope": "Region",
      "Tags": [
        {
          "Key": "string",
          "Value": "string"
        },
        {
          "Key": "string",
          "Value": "string"
        }
      ]
    },
    {
      "AvailabilityZone": "string",
      "Duration": 7,
      "End": "string",
      "FixedPrice": 5,
      "InstanceCount": 7,
      "InstanceType": "r5ad.24xlarge",
      "ProductDescription": "Windows (Amazon VPC)",
      "ReservedInstancesId": "string",
      "Start": "string",
      "State": "retired",
      "UsagePrice": 7,
      "CurrencyCode": "USD",
      "InstanceTenancy": "dedicated",
      "OfferingClass": "standard",
      "OfferingType": "No Upfront",
      "RecurringCharges": [
        {
          "Amount": 9,
          "Frequency": "Hourly"
        },
        {
          "Amount": 9,
          "Frequency": "Hourly"
        },
        {
          "Amount": 7,
          "Frequency": "Hourly"
        },
        {
          "Amount": 2,
          "Frequency": "Hourly"
        },
        {
          "Amount": 1,
          "Frequency": "Hourly"
        },
        {
          "Amount": 3,
          "Frequency": "Hourly"
        },
        {
          "Amount": 8,
          "Frequency": "Hourly"
        },
        {
          "Amount": 8,
          "Frequency": "Hourly"
        },
        {
          "Amount": 1,
          "Frequency": "Hourly"
        }
      ],
      "Scope": "Availability Zone",
      "Tags": [
        {
          "Key": "string",
          "Value": "string"
        },
        {
          "Key": "string",
          "Value": "string"
        },
        {
          "Key": "string",
          "Value": "string"
        },
        {
          "Key": "string",
          "Value": "string"
        },
        {
          "Key": "string",
          "Value": "string"
        },
        {
          "Key": "string",
          "Value": "string"
        }
      ]
    },
    {
      "AvailabilityZone": "string",
      "Duration": 7,
      "End": "string",
      "FixedPrice": 3,
      "InstanceCount": 9,
      "InstanceType": "p3dn.24xlarge",
      "ProductDescription": "Linux/UNIX",
      "ReservedInstancesId": "string",
      "Start": "string",
      "State": "payment-failed",
      "UsagePrice": 4,
      "CurrencyCode": "USD",
      "InstanceTenancy": "host",
      "OfferingClass": "standard",
      "OfferingType": "No Upfront",
      "RecurringCharges": [
        {
          "Amount": 3,
          "Frequency": "Hourly"
        },
        {
          "Amount": 6,
          "Frequency": "Hourly"
        },
        {
          "Amount": 8,
          "Frequency": "Hourly"
        },
        {
          "Amount": 6,
          "Frequency": "Hourly"
        },
        {
          "Amount": 5,
          "Frequency": "Hourly"
        },
        {
          "Amount": 3,
          "Frequency": "Hourly"
        },
        {
          "Amount": 7,
          "Frequency": "Hourly"
        },
        {
          "Amount": 7,
          "Frequency": "Hourly"
        }
      ],
      "Scope": "Region",
      "Tags": [
        {
          "Key": "string",
          "Value": "string"
        },
        {
          "Key": "string",
          "Value": "string"
        },
        {
          "Key": "string",
          "Value": "string"
        },
        {
          "Key": "string",
          "Value": "string"
        },
        {
          "Key": "string",
          "Value": "string"
        },
        {
          "Key": "string",
          "Value": "string"
        },
        {
          "Key": "string",
          "Value": "string"
        }
      ]
    }
  ]
}