{
  "$id": "schema.json",
  "type": "object",
  "schema": "http://json-schema.org/draft-07/schema#",
  "translate": true,
  "dynamicfields": true,
  "properties": {
    "ph_request_type": {
      "type": "string",
      "description": "type of request (internal to adapter)",
      "default": "getDescribeAccountAttributes",
      "enum": [
        "getDescribeAccountAttributes",
        "postDescribeAccountAttributes"
      ],
      "external_name": "ph_request_type"
    },
    "attributeName": {
      "description": "The account attribute names.",
      "parse": false,
      "encode": false,
      "encrypt": {
        "type": "AES",
        "key": ""
      },
      "external_name": "AttributeName"
    },
    "dryRun": {
      "description": "Checks whether you have the required permissions for the action, without actually making the request, and provides an error response. If you have the required permissions...(description truncated)",
      "parse": false,
      "encode": false,
      "encrypt": {
        "type": "AES",
        "key": ""
      },
      "external_name": "DryRun"
    },
    "action": {
      "description": "",
      "parse": false,
      "encode": false,
      "encrypt": {
        "type": "AES",
        "key": ""
      },
      "external_name": "Action"
    },
    "version": {
      "description": "",
      "parse": false,
      "encode": false,
      "encrypt": {
        "type": "AES",
        "key": ""
      },
      "external_name": "Version"
    },
    "bodyFormData": {
      "description": "",
      "parse": false,
      "encode": false,
      "encrypt": {
        "type": "AES",
        "key": ""
      },
      "external_name": "body"
    }
  },
  "definitions": {}
}