{
  "actions": [
    {
      "name": "describeVpnGateways",
      "protocol": "REST",
      "method": "GET",
      "entitypath": "{base_path}/{version}?{query}",
      "requestSchema": "schema.json",
      "responseSchema": "schema.json",
      "timeout": 0,
      "sendEmpty": false,
      "sendGetBody": false,
      "requestDatatype": "URLENCODE",
      "responseDatatype": "XML2JSON",
      "headers": {},
      "responseObjects": [
        {
          "type": "default",
          "key": "",
          "mockFile": "mockdatafiles/describeVpnGateways-default.json"
        }
      ]
    },
    {
      "name": "describeVpnConnections",
      "protocol": "REST",
      "method": "GET",
      "entitypath": "{base_path}/{version}?{query}",
      "requestSchema": "schema.json",
      "responseSchema": "schema.json",
      "timeout": 0,
      "sendEmpty": false,
      "sendGetBody": false,
      "requestDatatype": "URLENCODE",
      "responseDatatype": "XML2JSON",
      "headers": {},
      "responseObjects": [
        {
          "type": "default",
          "key": "",
          "mockFile": "mockdatafiles/describeVpnConnections-default.json"
        }
      ]
    },
    {
      "name": "createVpnGateway",
      "protocol": "REST",
      "method": "GET",
      "entitypath": "{base_path}/{version}?{query}",
      "requestSchema": "schema.json",
      "responseSchema": "schema.json",
      "timeout": 0,
      "sendEmpty": false,
      "sendGetBody": false,
      "requestDatatype": "URLENCODE",
      "responseDatatype": "XML2JSON",
      "headers": {},
      "responseObjects": [
        {
          "type": "default",
          "key": "",
          "mockFile": "mockdatafiles/createVpnGateway-default.json"
        }
      ]
    },
    {
      "name": "createVpnConnection",
      "protocol": "REST",
      "method": "GET",
      "entitypath": "{base_path}/{version}?{query}",
      "requestSchema": "schema.json",
      "responseSchema": "schema.json",
      "timeout": 0,
      "sendEmpty": false,
      "sendGetBody": false,
      "requestDatatype": "URLENCODE",
      "responseDatatype": "XML2JSON",
      "headers": {},
      "responseObjects": [
        {
          "type": "default",
          "key": "",
          "mockFile": "mockdatafiles/createVpnConnection-default.json"
        }
      ]
    },
    {
      "name": "createVpnConnectionRoute",
      "protocol": "REST",
      "method": "GET",
      "entitypath": "{base_path}/{version}?{query}",
      "requestSchema": "schema.json",
      "responseSchema": "schema.json",
      "timeout": 0,
      "sendEmpty": false,
      "sendGetBody": false,
      "requestDatatype": "URLENCODE",
      "responseDatatype": "XML2JSON",
      "headers": {},
      "responseObjects": [
        {
          "type": "default",
          "key": "",
          "mockFile": ""
        }
      ]
    },
    {
      "name": "modifyVpnConnection",
      "protocol": "REST",
      "method": "GET",
      "entitypath": "{base_path}/{version}?{query}",
      "requestSchema": "schema.json",
      "responseSchema": "schema.json",
      "timeout": 0,
      "sendEmpty": false,
      "sendGetBody": false,
      "requestDatatype": "URLENCODE",
      "responseDatatype": "XML2JSON",
      "headers": {},
      "responseObjects": [
        {
          "type": "default",
          "key": "",
          "mockFile": "mockdatafiles/modifyVpnConnection-default.json"
        }
      ]
    },
    {
      "name": "attachVpnGateway",
      "protocol": "REST",
      "method": "GET",
      "entitypath": "{base_path}/{version}?{query}",
      "requestSchema": "schema.json",
      "responseSchema": "schema.json",
      "timeout": 0,
      "sendEmpty": false,
      "sendGetBody": false,
      "requestDatatype": "URLENCODE",
      "responseDatatype": "XML2JSON",
      "headers": {},
      "responseObjects": [
        {
          "type": "default",
          "key": "",
          "mockFile": "mockdatafiles/attachVpnGateway-default.json"
        }
      ]
    },
    {
      "name": "detachVpnGateway",
      "protocol": "REST",
      "method": "GET",
      "entitypath": "{base_path}/{version}?{query}",
      "requestSchema": "schema.json",
      "responseSchema": "schema.json",
      "timeout": 0,
      "sendEmpty": false,
      "sendGetBody": false,
      "requestDatatype": "URLENCODE",
      "responseDatatype": "XML2JSON",
      "headers": {},
      "responseObjects": [
        {
          "type": "default",
          "key": "",
          "mockFile": ""
        }
      ]
    },
    {
      "name": "deleteVpnGateway",
      "protocol": "REST",
      "method": "GET",
      "entitypath": "{base_path}/{version}?{query}",
      "requestSchema": "schema.json",
      "responseSchema": "schema.json",
      "timeout": 0,
      "sendEmpty": false,
      "sendGetBody": false,
      "requestDatatype": "URLENCODE",
      "responseDatatype": "XML2JSON",
      "headers": {},
      "responseObjects": [
        {
          "type": "default",
          "key": "",
          "mockFile": ""
        }
      ]
    },
    {
      "name": "deleteVpnConnection",
      "protocol": "REST",
      "method": "GET",
      "entitypath": "{base_path}/{version}?{query}",
      "requestSchema": "schema.json",
      "responseSchema": "schema.json",
      "timeout": 0,
      "sendEmpty": false,
      "sendGetBody": false,
      "requestDatatype": "URLENCODE",
      "responseDatatype": "XML2JSON",
      "headers": {},
      "responseObjects": [
        {
          "type": "default",
          "key": "",
          "mockFile": ""
        }
      ]
    },
    {
      "name": "deleteVpnConnectionRoute",
      "protocol": "REST",
      "method": "GET",
      "entitypath": "{base_path}/{version}?{query}",
      "requestSchema": "schema.json",
      "responseSchema": "schema.json",
      "timeout": 0,
      "sendEmpty": false,
      "sendGetBody": false,
      "requestDatatype": "URLENCODE",
      "responseDatatype": "XML2JSON",
      "headers": {},
      "responseObjects": [
        {
          "type": "default",
          "key": "",
          "mockFile": ""
        }
      ]
    },
    {
      "name": "describeClientVpnConnections",
      "protocol": "REST",
      "method": "GET",
      "entitypath": "{base_path}/{version}?{query}",
      "requestSchema": "schema.json",
      "responseSchema": "schema.json",
      "timeout": 0,
      "sendEmpty": false,
      "sendGetBody": false,
      "requestDatatype": "URLENCODE",
      "responseDatatype": "XML2JSON",
      "headers": {},
      "responseObjects": [
        {
          "type": "default",
          "key": "",
          "mockFile": "mockdatafiles/describeClientVpnConnections-default.json"
        }
      ]
    },
    {
      "name": "describeClientVpnRoutes",
      "protocol": "REST",
      "method": "GET",
      "entitypath": "{base_path}/{version}?{query}",
      "requestSchema": "schema.json",
      "responseSchema": "schema.json",
      "timeout": 0,
      "sendEmpty": false,
      "sendGetBody": false,
      "requestDatatype": "URLENCODE",
      "responseDatatype": "XML2JSON",
      "headers": {},
      "responseObjects": [
        {
          "type": "default",
          "key": "",
          "mockFile": "mockdatafiles/describeClientVpnRoutes-default.json"
        }
      ]
    },
    {
      "name": "describeClientVpnEndpoints",
      "protocol": "REST",
      "method": "GET",
      "entitypath": "{base_path}/{version}?{query}",
      "requestSchema": "schema.json",
      "responseSchema": "schema.json",
      "timeout": 0,
      "sendEmpty": false,
      "sendGetBody": false,
      "requestDatatype": "URLENCODE",
      "responseDatatype": "XML2JSON",
      "headers": {},
      "responseObjects": [
        {
          "type": "default",
          "key": "",
          "mockFile": "mockdatafiles/describeClientVpnEndpoints-default.json"
        }
      ]
    },
    {
      "name": "describeClientVpnTargetNetworks",
      "protocol": "REST",
      "method": "GET",
      "entitypath": "{base_path}/{version}?{query}",
      "requestSchema": "schema.json",
      "responseSchema": "schema.json",
      "timeout": 0,
      "sendEmpty": false,
      "sendGetBody": false,
      "requestDatatype": "URLENCODE",
      "responseDatatype": "XML2JSON",
      "headers": {},
      "responseObjects": [
        {
          "type": "default",
          "key": "",
          "mockFile": "mockdatafiles/describeClientVpnTargetNetworks-default.json"
        }
      ]
    },
    {
      "name": "describeClientVpnAuthorizationRules",
      "protocol": "REST",
      "method": "GET",
      "entitypath": "{base_path}/{version}?{query}",
      "requestSchema": "schema.json",
      "responseSchema": "schema.json",
      "timeout": 0,
      "sendEmpty": false,
      "sendGetBody": false,
      "requestDatatype": "URLENCODE",
      "responseDatatype": "XML2JSON",
      "headers": {},
      "responseObjects": [
        {
          "type": "default",
          "key": "",
          "mockFile": "mockdatafiles/describeClientVpnAuthorizationRules-default.json"
        }
      ]
    },
    {
      "name": "createClientVpnRoute",
      "protocol": "REST",
      "method": "GET",
      "entitypath": "{base_path}/{version}?{query}",
      "requestSchema": "schema.json",
      "responseSchema": "schema.json",
      "timeout": 0,
      "sendEmpty": false,
      "sendGetBody": false,
      "requestDatatype": "URLENCODE",
      "responseDatatype": "XML2JSON",
      "headers": {},
      "responseObjects": [
        {
          "type": "default",
          "key": "",
          "mockFile": "mockdatafiles/createClientVpnRoute-default.json"
        }
      ]
    },
    {
      "name": "createClientVpnEndpoint",
      "protocol": "REST",
      "method": "GET",
      "entitypath": "{base_path}/{version}?{query}",
      "requestSchema": "schema.json",
      "responseSchema": "schema.json",
      "timeout": 0,
      "sendEmpty": false,
      "sendGetBody": false,
      "requestDatatype": "URLENCODE",
      "responseDatatype": "XML2JSON",
      "headers": {},
      "responseObjects": [
        {
          "type": "default",
          "key": "",
          "mockFile": "mockdatafiles/createClientVpnEndpoint-default.json"
        }
      ]
    },
    {
      "name": "exportClientVpnClientConfiguration",
      "protocol": "REST",
      "method": "GET",
      "entitypath": "{base_path}/{version}?{query}",
      "requestSchema": "schema.json",
      "responseSchema": "schema.json",
      "timeout": 0,
      "sendEmpty": false,
      "sendGetBody": false,
      "requestDatatype": "URLENCODE",
      "responseDatatype": "XML2JSON",
      "headers": {},
      "responseObjects": [
        {
          "type": "default",
          "key": "",
          "mockFile": "mockdatafiles/exportClientVpnClientConfiguration-default.json"
        }
      ]
    },
    {
      "name": "exportClientVpnClientCertificateRevocationList",
      "protocol": "REST",
      "method": "GET",
      "entitypath": "{base_path}/{version}?{query}",
      "requestSchema": "schema.json",
      "responseSchema": "schema.json",
      "timeout": 0,
      "sendEmpty": false,
      "sendGetBody": false,
      "requestDatatype": "URLENCODE",
      "responseDatatype": "XML2JSON",
      "headers": {},
      "responseObjects": [
        {
          "type": "default",
          "key": "",
          "mockFile": "mockdatafiles/exportClientVpnClientCertificateRevocationList-default.json"
        }
      ]
    },
    {
      "name": "importClientVpnClientCertificateRevocationList",
      "protocol": "REST",
      "method": "GET",
      "entitypath": "{base_path}/{version}?{query}",
      "requestSchema": "schema.json",
      "responseSchema": "schema.json",
      "timeout": 0,
      "sendEmpty": false,
      "sendGetBody": false,
      "requestDatatype": "URLENCODE",
      "responseDatatype": "XML2JSON",
      "headers": {},
      "responseObjects": [
        {
          "type": "default",
          "key": "",
          "mockFile": "mockdatafiles/importClientVpnClientCertificateRevocationList-default.json"
        }
      ]
    },
    {
      "name": "modifyClientVpnEndpoint",
      "protocol": "REST",
      "method": "GET",
      "entitypath": "{base_path}/{version}?{query}",
      "requestSchema": "schema.json",
      "responseSchema": "schema.json",
      "timeout": 0,
      "sendEmpty": false,
      "sendGetBody": false,
      "requestDatatype": "URLENCODE",
      "responseDatatype": "XML2JSON",
      "headers": {},
      "responseObjects": [
        {
          "type": "default",
          "key": "",
          "mockFile": "mockdatafiles/modifyClientVpnEndpoint-default.json"
        }
      ]
    },
    {
      "name": "associateClientVpnTargetNetwork",
      "protocol": "REST",
      "method": "GET",
      "entitypath": "{base_path}/{version}?{query}",
      "requestSchema": "schema.json",
      "responseSchema": "schema.json",
      "timeout": 0,
      "sendEmpty": false,
      "sendGetBody": false,
      "requestDatatype": "URLENCODE",
      "responseDatatype": "XML2JSON",
      "headers": {},
      "responseObjects": [
        {
          "type": "default",
          "key": "",
          "mockFile": "mockdatafiles/associateClientVpnTargetNetwork-default.json"
        }
      ]
    },
    {
      "name": "authorizeClientVpnIngress",
      "protocol": "REST",
      "method": "GET",
      "entitypath": "{base_path}/{version}?{query}",
      "requestSchema": "schema.json",
      "responseSchema": "schema.json",
      "timeout": 0,
      "sendEmpty": false,
      "sendGetBody": false,
      "requestDatatype": "URLENCODE",
      "responseDatatype": "XML2JSON",
      "headers": {},
      "responseObjects": [
        {
          "type": "default",
          "key": "",
          "mockFile": "mockdatafiles/authorizeClientVpnIngress-default.json"
        }
      ]
    },
    {
      "name": "disassociateClientVpnTargetNetwork",
      "protocol": "REST",
      "method": "GET",
      "entitypath": "{base_path}/{version}?{query}",
      "requestSchema": "schema.json",
      "responseSchema": "schema.json",
      "timeout": 0,
      "sendEmpty": false,
      "sendGetBody": false,
      "requestDatatype": "URLENCODE",
      "responseDatatype": "XML2JSON",
      "headers": {},
      "responseObjects": [
        {
          "type": "default",
          "key": "",
          "mockFile": "mockdatafiles/disassociateClientVpnTargetNetwork-default.json"
        }
      ]
    },
    {
      "name": "revokeClientVpnIngress",
      "protocol": "REST",
      "method": "GET",
      "entitypath": "{base_path}/{version}?{query}",
      "requestSchema": "schema.json",
      "responseSchema": "schema.json",
      "timeout": 0,
      "sendEmpty": false,
      "sendGetBody": false,
      "requestDatatype": "URLENCODE",
      "responseDatatype": "XML2JSON",
      "headers": {},
      "responseObjects": [
        {
          "type": "default",
          "key": "",
          "mockFile": "mockdatafiles/revokeClientVpnIngress-default.json"
        }
      ]
    },
    {
      "name": "terminateClientVpnConnections",
      "protocol": "REST",
      "method": "GET",
      "entitypath": "{base_path}/{version}?{query}",
      "requestSchema": "schema.json",
      "responseSchema": "schema.json",
      "timeout": 0,
      "sendEmpty": false,
      "sendGetBody": false,
      "requestDatatype": "URLENCODE",
      "responseDatatype": "XML2JSON",
      "headers": {},
      "responseObjects": [
        {
          "type": "default",
          "key": "",
          "mockFile": "mockdatafiles/terminateClientVpnConnections-default.json"
        }
      ]
    },
    {
      "name": "deleteClientVpnEndpoint",
      "protocol": "REST",
      "method": "GET",
      "entitypath": "{base_path}/{version}?{query}",
      "requestSchema": "schema.json",
      "responseSchema": "schema.json",
      "timeout": 0,
      "sendEmpty": false,
      "sendGetBody": false,
      "requestDatatype": "URLENCODE",
      "responseDatatype": "XML2JSON",
      "headers": {},
      "responseObjects": [
        {
          "type": "default",
          "key": "",
          "mockFile": "mockdatafiles/deleteClientVpnEndpoint-default.json"
        }
      ]
    },
    {
      "name": "deleteClientVpnRoute",
      "protocol": "REST",
      "method": "GET",
      "entitypath": "{base_path}/{version}?{query}",
      "requestSchema": "schema.json",
      "responseSchema": "schema.json",
      "timeout": 0,
      "sendEmpty": false,
      "sendGetBody": false,
      "requestDatatype": "URLENCODE",
      "responseDatatype": "XML2JSON",
      "headers": {},
      "responseObjects": [
        {
          "type": "default",
          "key": "",
          "mockFile": "mockdatafiles/deleteClientVpnRoute-default.json"
        }
      ]
    }
  ]
}