{
  "BundleTask": {
    "BundleId": "string",
    "BundleTaskError": {
      "Code": "string",
      "Message": "string"
    },
    "InstanceId": "string",
    "Progress": "string",
    "StartTime": "string",
    "State": "cancelling",
    "Storage": {
      "S3": {
        "AWSAccessKeyId": "string",
        "Bucket": "string",
        "Prefix": "string",
        "UploadPolicy": "string",
        "UploadPolicySignature": "string"
      }
    },
    "UpdateTime": "string"
  }
}