{
  "MovingAddressStatuses": [
    {
      "MoveStatus": "restoringToClassic",
      "PublicIp": "string"
    },
    {
      "MoveStatus": "movingToVpc",
      "PublicIp": "string"
    },
    {
      "MoveStatus": "movingToVpc",
      "PublicIp": "string"
    },
    {
      "MoveStatus": "restoringToClassic",
      "PublicIp": "string"
    },
    {
      "MoveStatus": "restoringToClassic",
      "PublicIp": "string"
    }
  ],
  "NextToken": "string"
}