{
  "awsDevice": {},
  "awsDeviceV2": {},
  "bandwidth": {},
  "connectionId": {},
  "connectionName": {},
  "connectionState": {},
  "hasLogicalRedundancy": {},
  "jumboFrameCapable": {},
  "lagId": {},
  "loaIssueTime": {},
  "location": {},
  "ownerAccount": {},
  "partnerName": {},
  "providerName": {},
  "region": {},
  "tags": {},
  "vlan": {}
}