{
  "virtualInterface": {
    "addressFamily": {},
    "amazonAddress": {},
    "amazonSideAsn": {},
    "asn": {},
    "authKey": {},
    "awsDeviceV2": {},
    "bgpPeers": {},
    "connectionId": {},
    "customerAddress": {},
    "customerRouterConfig": {},
    "directConnectGatewayId": {},
    "jumboFrameCapable": {},
    "location": {},
    "mtu": {},
    "ownerAccount": {},
    "region": {},
    "routeFilterPrefixes": {},
    "tags": {},
    "virtualGatewayId": {},
    "virtualInterfaceId": {},
    "virtualInterfaceName": {},
    "virtualInterfaceState": {},
    "virtualInterfaceType": {},
    "vlan": {}
  }
}