{
  "allowsHostedConnections": {},
  "awsDevice": {},
  "awsDeviceV2": {},
  "connections": {},
  "connectionsBandwidth": {},
  "hasLogicalRedundancy": {},
  "jumboFrameCapable": {},
  "lagId": {},
  "lagName": {},
  "lagState": {},
  "location": {},
  "minimumLinks": {},
  "numberOfConnections": {},
  "ownerAccount": {},
  "providerName": {},
  "region": {},
  "tags": {}
}