{
  "directConnectGatewayAssociation": {
    "allowedPrefixesToDirectConnectGateway": {},
    "associatedGateway": {
      "id": {},
      "ownerAccount": {},
      "region": {},
      "type": {}
    },
    "associationId": {},
    "associationState": {},
    "directConnectGatewayId": {},
    "directConnectGatewayOwnerAccount": {},
    "stateChangeError": {},
    "virtualGatewayId": {},
    "virtualGatewayOwnerAccount": {},
    "virtualGatewayRegion": {}
  }
}