{
  "name": "adapter-aws_directconnect",
  "webName": "Itential integration to Amazon Web Services Direct Connect",
  "supportLevel": "community",
  "vendor": "Amazon Web Services",
  "product": "Direct Connect",
  "techAlliance": false,
  "osVersion": [],
  "apiVersions": [],
  "iapVersions": [
    "2021.1.x",
    "2021.2.x",
    "2022.1.x",
    "2023.1.x"
  ],
  "method": "REST",
  "type": "Adapter",
  "domains": [
    "Cloud"
  ],
  "tags": [
    "Cloud Infrastructure Changes",
    "Hybrid & Multi Cloud Orchestration",
    "Configuration & Compliance",
    "Software Upgrades & Device Maintenance"
  ],
  "useCases": [
    "VNet or VPC deploy/management",
    "Connect VPC and VNet",
    "Connect router to transit gateway",
    "Route across GCP & Azure",
    "Connect sites across cloud platforms",
    "Router configuration backup or restore",
    "Run network compliance checks and remediation",
    "Determine configuration drift",
    "Golden Configuration",
    "Port Turn-up",
    "Assign Network & IP",
    "Cloud Managed Networks",
    "Software Upgrade",
    "Device Onboarding"
  ],
  "deprecated": {
    "isDeprecated": false
  },
  "brokerSince": "",
  "authMethods": [
    {
      "type": "AWS Auth",
      "primary": true
    }
  ],
  "documentation": {
    "storeLink": "",
    "npmLink": "https://www.npmjs.com/package/@itentialopensource/adapter-aws_directconnect",
    "repoLink": "https://gitlab.com/itentialopensource/adapters/adapter-aws_directconnect",
    "docLink": "https://gitlab.com/itentialopensource/adapters/adapter-aws_directconnect/-/blob/master/README.md?ref_type=heads",
    "demoLinks": [],
    "trainingLinks": [
      {
        "title": "Itential Academy",
        "link": "https://www.itential.com/itential-academy/"
      }
    ],
    "faqLink": "https://docs.itential.com/opensource/docs/troubleshooting-an-adapter",
    "contributeLink": "https://gitlab.com/itentialopensource/adapters/contributing-guide",
    "issueLink": "https://itential.atlassian.net/servicedesk/customer/portals",
    "webLink": "https://www.itential.com/adapters/amazon-direct-connect/",
    "vendorLink": "https://aws.amazon.com/",
    "productLink": "https://aws.amazon.com/directconnect/",
    "apiLinks": [
      {
        "title": "Amazon Web Services - Direct Connect API",
        "link": "https://docs.aws.amazon.com/directconnect/latest/APIReference/Welcome.html",
        "public": true
      }
    ],
    "workshopLinks": [],
    "workshopHomePage": "https://www.itential.com/get-started/"
  },
  "assets": [],
  "relatedItems": {
    "adapters": [],
    "integrations": [],
    "ecosystemApplications": [],
    "workflowProjects": [],
    "transformationProjects": [],
    "exampleProjects": []
  }
}