{
  "$id": "schema.json",
  "type": "object",
  "schema": "http://json-schema.org/draft-07/schema#",
  "translate": true,
  "dynamicfields": true,
  "properties": {
    "ph_request_type": {
      "type": "string",
      "description": "type of request (internal to adapter)",
      "default": "genericGet",
      "enum": [
        "genericPost",
        "genericGet"
      ],
      "external_name": "ph_request_type"
    },
    "adminEmail": {
      "type": "string",
      "description": "Email address of the admin account of the Aviatrix controller. (required) Ex. 'john-smith@gmail.com'",
      "parse": false,
      "encode": false,
      "encrypt": {
        "type": "AES",
        "key": ""
      },
      "external_name": "admin_email"
    },
    "targetVersion": {
      "type": "string",
      "description": "The version to upgrade to on initial setup. (optional)",
      "parse": false,
      "encode": false,
      "encrypt": {
        "type": "AES",
        "key": ""
      },
      "external_name": "target_version"
    },
    "accountName": {
      "type": "string",
      "description": "### Description\nAccount name.\n\n\n###  Required\nYES\n\n\n### Type\nString\n\n\n### Valid Value(s) / Example(s)\n&#34;john&#34;, &#34;smith&#34;\n\n\n### Default Value\nNone",
      "parse": false,
      "encode": false,
      "encrypt": {
        "type": "AES",
        "key": ""
      },
      "external_name": "account_name"
    },
    "cloudType": {
      "type": ["string", "number"],
      "description": "### Description\nType of cloud service provider.\n\n\n###  Required\nYES\n\n\n### Type\nInteger\n\n\n### Valid Value(s) / Example(s)\n\n|          Cloud Type          | Corresponding V...(description truncated)",
      "parse": false,
      "encode": false,
      "encrypt": {
        "type": "AES",
        "key": ""
      },
      "external_name": "cloud_type"
    },
    "withImage": {
      "type": "string",
      "description": "### Description\nIndicates whether to retrieve storage names with image or not.\n\n\n###  Required\nNO\n\n\n### Type\nString\n\n\n### Valid Value(s) / Example(s)\n&#34;yes&#34;, &#34;no&#34;\n\n\n### De...(description truncated)",
      "parse": false,
      "encode": false,
      "encrypt": {
        "type": "AES",
        "key": ""
      },
      "external_name": "with_image"
    },
    "vpcReg": {
      "type": "string",
      "description": "### Description\nRegion name.\n\n###  Required\nNO\n\n\n### Type\nString\n\n\n### Valid Value(s) / Example(s)\n&#34;us-west-1&#34;, &#34;us-west-2&#34;\n\n\n### Default Value\nNone",
      "parse": false,
      "encode": false,
      "encrypt": {
        "type": "AES",
        "key": ""
      },
      "external_name": "vpc_reg"
    },
    "vpcId": {
      "type": "string",
      "description": "VPC ID/VNet-Name of cloud provider.",
      "parse": false,
      "encode": false,
      "encrypt": {
        "type": "AES",
        "key": ""
      },
      "external_name": "vpc_id"
    },
    "vpcNet": {
      "type": "string",
      "description": "A VPC Network address range selected from one of the available network ranges.",
      "parse": false,
      "encode": false,
      "encrypt": {
        "type": "AES",
        "key": ""
      },
      "external_name": "vpc_net"
    },
    "lborgatewayName": {
      "type": "string",
      "description": "LB (Load-Balancer) or Aviatrix gateway name.",
      "parse": false,
      "encode": false,
      "encrypt": {
        "type": "AES",
        "key": ""
      },
      "external_name": "lb_or_gateway_name"
    },
    "withVpn": {
      "type": "string",
      "description": "LB (Load-Balancer) or Aviatrix gateway name.",
      "parse": false,
      "encode": false,
      "encrypt": {
        "type": "AES",
        "key": ""
      },
      "external_name": "with_vpn"
    },
    "withTransit": {
      "type": "string",
      "description": "LB (Load-Balancer) or Aviatrix gateway name.",
      "parse": false,
      "encode": false,
      "encrypt": {
        "type": "AES",
        "key": ""
      },
      "external_name": "with_transit"
    },
    "withSite2cloudConn": {
      "type": "string",
      "description": "LB (Load-Balancer) or Aviatrix gateway name.",
      "parse": false,
      "encode": false,
      "encrypt": {
        "type": "AES",
        "key": ""
      },
      "external_name": "with_site2cloud_conn"
    },
    "vnetAndResourceGroupNames": {
      "type": "string",
      "description": "A string consisting of VNet and resource group names",
      "parse": false,
      "encode": false,
      "encrypt": {
        "type": "AES",
        "key": ""
      },
      "external_name": "vnet_and_resource_group_names"
    },
    "publicSubnet": {
      "type": "string",
      "description": "Public subnet INFO",
      "parse": false,
      "encode": false,
      "encrypt": {
        "type": "AES",
        "key": ""
      },
      "external_name": "public_subnet"
    },
    "gwName": {
      "type": "string",
      "description": "Name of the gateway which is going to be created",
      "parse": false,
      "encode": false,
      "encrypt": {
        "type": "AES",
        "key": ""
      },
      "external_name": "gw_name"
    },
    "gwSize": {
      "type": "string",
      "description": "Size of the gateway instance",
      "parse": false,
      "encode": false,
      "encrypt": {
        "type": "AES",
        "key": ""
      },
      "external_name": "gw_size"
    },
    "dnsServer": {
      "type": "string",
      "description": "Specify the DNS IP",
      "parse": false,
      "encode": false,
      "encrypt": {
        "type": "AES",
        "key": ""
      },
      "external_name": "dns_server"
    },
    "insaneMode": {
      "type": "string",
      "description": "Flag to enable high performance",
      "parse": false,
      "encode": false,
      "encrypt": {
        "type": "AES",
        "key": ""
      },
      "external_name": "insane_mode"
    },
    "reuseResourceGroup": {
      "type": "boolean",
      "description": "Specify whether to reuse the vnet resource group instead of adding a new one",
      "parse": false,
      "encode": false,
      "encrypt": {
        "type": "AES",
        "key": ""
      },
      "external_name": "reuse_resource_group"
    },
    "allocateNewEip": {
      "type": "string",
      "description": "When value is off, reuse an idle address in Elastic IP pool for this gateway. Otherwise, allocate a new Elastic IP and use it for this gateway",
      "parse": false,
      "encode": false,
      "encrypt": {
        "type": "AES",
        "key": ""
      },
      "external_name": "allocate_new_eip"
    },
    "enableActivemesh": {
      "type": "string",
      "description": "Flag to enable ActiveMesh mode",
      "parse": false,
      "encode": false,
      "encrypt": {
        "type": "AES",
        "key": ""
      },
      "external_name": "enable_activemesh"
    },
    "learnedCidrsApproval": {
      "type": "string",
      "description": "Option to enable learned CIDRs approval",
      "parse": false,
      "encode": false,
      "encrypt": {
        "type": "AES",
        "key": ""
      },
      "external_name": "learned_cidrs_approval"
    },
    "connectionName": {
      "type": "string",
      "description": "The name of the connection which is going to be created",
      "parse": false,
      "encode": false,
      "encrypt": {
        "type": "AES",
        "key": ""
      },
      "external_name": "connection_name"
    },
    "bgpVgwAccountName": {
      "type": "string",
      "description": "This parameter represents the name of a Cloud-Account in the Aviatrix controller that owns the VGW instance",
      "parse": false,
      "encode": false,
      "encrypt": {
        "type": "AES",
        "key": ""
      },
      "external_name": "bgp_vgw_account_name"
    },
    "bgpVgwRegion": {
      "type": "string",
      "description": "Region where the VGW locates.",
      "parse": false,
      "encode": false,
      "encrypt": {
        "type": "AES",
        "key": ""
      },
      "external_name": "bgp_vgw_region"
    },
    "vgwId": {
      "type": "string",
      "description": "VGW ID",
      "parse": false,
      "encode": false,
      "encrypt": {
        "type": "AES",
        "key": ""
      },
      "external_name": "vgw_id"
    },
    "transitGw": {
      "type": "string",
      "description": "Name of the transit gateway",
      "parse": false,
      "encode": false,
      "encrypt": {
        "type": "AES",
        "key": ""
      },
      "external_name": "transit_gw"
    },
    "bgpLocalAsNumber": {
      "type": "integer",
      "description": "BGW Local ASN (Autonomous System Number) in Transit VPC side",
      "parse": false,
      "encode": false,
      "encrypt": {
        "type": "AES",
        "key": ""
      },
      "external_name": "bgp_local_as_number"
    },
    "connectionPolicy": {
      "type": "boolean",
      "description": "Enables edge segmentation",
      "parse": false,
      "encode": false,
      "encrypt": {
        "type": "AES",
        "key": ""
      },
      "external_name": "connection_policy"
    },
    "cloudnAsNumber": {
      "type": "integer",
      "description": "CloudN local AS number",
      "parse": false,
      "encode": false,
      "encrypt": {
        "type": "AES",
        "key": ""
      },
      "external_name": "cloudn_as_number"
    },
    "cloudnIp": {
      "type": "string",
      "description": "CloudN IP address",
      "parse": false,
      "encode": false,
      "encrypt": {
        "type": "AES",
        "key": ""
      },
      "external_name": "cloudn_ip"
    },
    "cloudnNeighborIp": {
      "type": "string",
      "description": "CloudN neighbor IP address",
      "parse": false,
      "encode": false,
      "encrypt": {
        "type": "AES",
        "key": ""
      },
      "external_name": "cloudn_neighbor_ip"
    },
    "cloudnNeighborAsNumber": {
      "type": "integer",
      "description": "CloudN neighbor AS number",
      "parse": false,
      "encode": false,
      "encrypt": {
        "type": "AES",
        "key": ""
      },
      "external_name": "cloudn_neighbor_as_number"
    },
    "enableHa": {
      "type": "string",
      "description": "Flag to enable HA",
      "parse": false,
      "encode": false,
      "encrypt": {
        "type": "AES",
        "key": ""
      },
      "external_name": "enable_ha"
    },
    "directConnect": {
      "type": "string",
      "description": "Flag to enable direct connect",
      "parse": false,
      "encode": false,
      "encrypt": {
        "type": "AES",
        "key": ""
      },
      "external_name": "direct_connect"
    },
    "backupInsaneMode": {
      "type": "string",
      "description": "Flag to enable backup high performance",
      "parse": false,
      "encode": false,
      "encrypt": {
        "type": "AES",
        "key": ""
      },
      "external_name": "backup_insane_mode"
    },
    "backupCloudnAsNumber": {
      "type": "string",
      "description": "Flag to enable CloudN local AS number",
      "parse": false,
      "encode": false,
      "encrypt": {
        "type": "AES",
        "key": ""
      },
      "external_name": "backup_cloudn_as_number"
    },
    "backupExternalDeviceAsNumber": {
      "type": "string",
      "description": "Flag to enable backup external device AS number",
      "parse": false,
      "encode": false,
      "encrypt": {
        "type": "AES",
        "key": ""
      },
      "external_name": "backup_external_device_as_number"
    },
    "backupDirectConnect": {
      "type": "string",
      "description": "Flag to enable backup direct connect",
      "parse": false,
      "encode": false,
      "encrypt": {
        "type": "AES",
        "key": ""
      },
      "external_name": "backup_direct_connect"
    },
    "enableLoadBalancing": {
      "type": "string",
      "description": "Flag to enable load balancing",
      "parse": false,
      "encode": false,
      "encrypt": {
        "type": "AES",
        "key": ""
      },
      "external_name": "enable_load_balancing"
    },
    "backupCloudnNeighborAsNumber": {
      "type": "integer",
      "description": "Backup CloudN neighbor AS number",
      "parse": false,
      "encode": false,
      "encrypt": {
        "type": "AES",
        "key": ""
      },
      "external_name": "backup_cloudn_neighbor_as_number"
    },
    "backupCloudnNeighborIp": {
      "type": "string",
      "description": "Backup CloudN neighbor IP address",
      "parse": false,
      "encode": false,
      "encrypt": {
        "type": "AES",
        "key": ""
      },
      "external_name": "backup_cloudn_neighbor_ip"
    },
    "backupCloudnIp": {
      "type": "string",
      "description": "Backup CloudN IP address",
      "parse": false,
      "encode": false,
      "encrypt": {
        "type": "AES",
        "key": ""
      },
      "external_name": "backup_cloudn_ip"
    },
    "natEnabled": {
      "type": "string",
      "description": "Specify whether you are enabling NAT feature on the gateway or not",
      "parse": false,
      "encode": false,
      "encrypt": {
        "type": "AES",
        "key": ""
      },
      "external_name": "nat_enabled"
    },
    "skipRfc1918": {
      "type": "string",
      "description": "Specify whether to create gateway without RFC1918 routes",
      "parse": false,
      "encode": false,
      "encrypt": {
        "type": "AES",
        "key": ""
      },
      "external_name": "skip_rfc1918"
    },
    "newZone": {
      "type": "string",
      "description": "Zone",
      "parse": false,
      "encode": false,
      "encrypt": {
        "type": "AES",
        "key": ""
      },
      "external_name": "new_zone"
    },
    "spokeGw": {
      "type": "string",
      "description": "Name of the spoke gateway",
      "parse": false,
      "encode": false,
      "encrypt": {
        "type": "AES",
        "key": ""
      },
      "external_name": "spoke_gw"
    },
    "routeTableList": {
      "type": "string",
      "description": "Zone",
      "parse": false,
      "encode": false,
      "encrypt": {
        "type": "AES",
        "key": ""
      },
      "external_name": "route_table_list"
    },
    "poolName": {
      "type": "string",
      "description": "Name of the pool to be created",
      "parse": false,
      "encode": false,
      "encrypt": {
        "type": "AES",
        "key": ""
      },
      "external_name": "pool_name"
    },
    "vpcCidr": {
      "type": "string",
      "description": "VPC CIDR",
      "parse": false,
      "encode": false,
      "encrypt": {
        "type": "AES",
        "key": ""
      },
      "external_name": "vpc_cidr"
    },
    "vpcCounts": {
      "type": "integer",
      "description": "Maximum number of VPCs in this pool",
      "parse": false,
      "encode": false,
      "encrypt": {
        "type": "AES",
        "key": ""
      },
      "external_name": "vpc_counts"
    },
    "aviatrixTransitVpc": {
      "type": "string",
      "description": "Flag indicating to create Aviatrix transit VPC",
      "parse": false,
      "encode": false,
      "encrypt": {
        "type": "AES",
        "key": ""
      },
      "external_name": "aviatrix_transit_vpc"
    },
    "publicSubnets": {
      "type": "string",
      "description": "Flag indicating whether a public subnet would be created or not",
      "parse": false,
      "encode": false,
      "encrypt": {
        "type": "AES",
        "key": ""
      },
      "external_name": "public_subnets"
    },
    "addGateway": {
      "type": "string",
      "description": "Flag indicating whether the gateway would be launched after pool creation or not",
      "parse": false,
      "encode": false,
      "encrypt": {
        "type": "AES",
        "key": ""
      },
      "external_name": "add_gateway"
    },
    "vpcSize": {
      "type": "string",
      "description": "VPC size for this pool",
      "parse": false,
      "encode": false,
      "encrypt": {
        "type": "AES",
        "key": ""
      },
      "external_name": "vpc_size"
    },
    "securityUrl": {
      "type": "string",
      "description": "Security URL",
      "parse": false,
      "encode": false,
      "encrypt": {
        "type": "AES",
        "key": ""
      },
      "external_name": "security_url"
    },
    "subnetList": {
      "type": "array",
      "description": "Array of the subnets (includes name, region and CIDR)",
      "parse": false,
      "encode": false,
      "encrypt": {
        "type": "AES",
        "key": ""
      },
      "items": {
        "type": "object"
      },
      "external_name": "subnetList"
    },
    "poolNameOnly": {
      "type": "string",
      "description": "Flag indicating whether to display pool names only or not.",
      "parse": false,
      "encode": false,
      "encrypt": {
        "type": "AES",
        "key": ""
      },
      "external_name": "pool_name_only"
    },
    "vpcAccountName": {
      "type": "string",
      "description": "AWS account name for the VPC",
      "parse": false,
      "encode": false,
      "encrypt": {
        "type": "AES",
        "key": ""
      },
      "external_name": "vpc_account_name"
    },
    "vpcName": {
      "type": "string",
      "description": "VPC ID",
      "parse": false,
      "encode": false,
      "encrypt": {
        "type": "AES",
        "key": ""
      },
      "external_name": "vpc_name"
    },
    "tgwName": {
      "type": "string",
      "description": "Name of AWS TGW to be attached to",
      "parse": false,
      "encode": false,
      "encrypt": {
        "type": "AES",
        "key": ""
      },
      "external_name": "tgw_name"
    },
    "gatewayName": {
      "type": "string",
      "description": "Name of AWS transit gateway",
      "parse": false,
      "encode": false,
      "encrypt": {
        "type": "AES",
        "key": ""
      },
      "external_name": "gateway_name"
    }
  },
  "definitions": {}
}