{
  "cluster": {
    "arn": {},
    "certificateAuthority": {
      "data": {}
    },
    "clientRequestToken": {},
    "createdAt": {},
    "encryptionConfig": {},
    "endpoint": {},
    "identity": {
      "oidc": {
        "issuer": {}
      }
    },
    "kubernetesNetworkConfig": {
      "serviceIpv4Cidr": {}
    },
    "logging": {
      "clusterLogging": {}
    },
    "name": {},
    "platformVersion": {},
    "resourcesVpcConfig": {
      "clusterSecurityGroupId": {},
      "endpointPrivateAccess": {},
      "endpointPublicAccess": {},
      "publicAccessCidrs": {},
      "securityGroupIds": {},
      "subnetIds": {},
      "vpcId": {}
    },
    "roleArn": {},
    "status": {},
    "tags": {},
    "version": {}
  }
}