{
  "fargateProfile": {
    "clusterName": {},
    "createdAt": {},
    "fargateProfileArn": {},
    "fargateProfileName": {},
    "podExecutionRoleArn": {},
    "selectors": {},
    "status": {},
    "subnets": {},
    "tags": {}
  }
}