{
  "NextToken": "string",
  "PhoneNumberSummaryList": [ 
    { 
      "Arn": "string",
      "Id": "string",
      "PhoneNumber": "string",
      "PhoneNumberCountryCode": "string",
      "PhoneNumberType": "string"
    }
  ]
}
