{
  "$id": "schema.json",
  "type": "object",
  "schema": "http://json-schema.org/draft-07/schema#",
  "translate": true,
  "dynamicfields": true,
  "properties": {
    "ph_request_type": {
      "type": "string",
      "description": "type of request (internal to adapter)",
      "default": "createRoutingProfile",
      "enum": [
        "createRoutingProfile",
        "describeRoutingProfile",
        "associateRoutingProfileQueues",
        "updateRoutingProfileConcurrency",
        "updateRoutingProfileDefaultOutboundQueue",
        "disassociateRoutingProfileQueues",
        "updateRoutingProfileName",
        "listRoutingProfileQueues",
        "updateRoutingProfileQueues"
      ],
      "external_name": "ph_request_type"
    },
    "instanceId": {
      "type": "string",
      "description": "The identifier of the Amazon Connect instance.",
      "parse": false,
      "encode": false,
      "encrypt": {
        "type": "AES",
        "key": ""
      },
      "external_name": "InstanceId"
    },
    "routingProfileId": {
      "type": "string",
      "description": "The identifier of the routing profile.",
      "parse": false,
      "encode": false,
      "encrypt": {
        "type": "AES",
        "key": ""
      },
      "external_name": "RoutingProfileId"
    },
    "maxResults": {
      "type": "string",
      "description": "The maximum number of results to return per page.",
      "parse": false,
      "encode": false,
      "encrypt": {
        "type": "AES",
        "key": ""
      },
      "external_name": "MaxResults"
    },
    "nextToken": {
      "type": "string",
      "description": "The token for the next set of results. Use the value returned in the previous response in the next request to retrieve the next set of results.",
      "parse": false,
      "encode": false,
      "encrypt": {
        "type": "AES",
        "key": ""
      },
      "external_name": "NextToken"
    }
  },
  "definitions": {}
}
