{
  "actions": [
    {
      "name": "getSegmentResourceShares",
      "protocol": "REST",
      "method": "GET",
      "entitypath": "{base_path}/{version}/tenantnetworks/{pathv1}/segment-resource-shares?{query}",
      "requestSchema": "schema.json",
      "responseSchema": "schema.json",
      "timeout": 0,
      "sendEmpty": false,
      "sendGetBody": false,
      "requestDatatype": "JSON",
      "responseDatatype": "JSON",
      "headers": {},
      "responseObjects": [
        {
          "type": "default",
          "key": "",
          "mockFile": "mockdatafiles/getSegmentResourceShares-default.json"
        }
      ]
    },
    {
      "name": "createSegmentResourceShare",
      "protocol": "REST",
      "method": "POST",
      "entitypath": "{base_path}/{version}/tenantnetworks/{pathv1}/segment-resource-shares?{query}",
      "requestSchema": "schema.json",
      "responseSchema": "schema.json",
      "timeout": 0,
      "sendEmpty": false,
      "requestDatatype": "JSON",
      "responseDatatype": "JSON",
      "headers": {},
      "responseObjects": [
        {
          "type": "default",
          "key": "",
          "mockFile": ""
        }
      ]
    },
    {
      "name": "getSegmentResourceShare",
      "protocol": "REST",
      "method": "GET",
      "entitypath": "{base_path}/{version}/tenantnetworks/{pathv1}/segment-resource-shares/{pathv2}?{query}",
      "requestSchema": "schema.json",
      "responseSchema": "schema.json",
      "timeout": 0,
      "sendEmpty": false,
      "sendGetBody": false,
      "requestDatatype": "JSON",
      "responseDatatype": "JSON",
      "headers": {},
      "responseObjects": [
        {
          "type": "default",
          "key": "",
          "mockFile": ""
        }
      ]
    },
    {
      "name": "updateSegmentResourceShare",
      "protocol": "REST",
      "method": "PUT",
      "entitypath": "{base_path}/{version}/tenantnetworks/{pathv1}/segment-resource-shares/{pathv2}?{query}",
      "requestSchema": "schema.json",
      "responseSchema": "schema.json",
      "timeout": 0,
      "sendEmpty": false,
      "requestDatatype": "JSON",
      "responseDatatype": "JSON",
      "headers": {},
      "responseObjects": [
        {
          "type": "default",
          "key": "",
          "mockFile": ""
        }
      ]
    },
    {
      "name": "deleteSegmentResourceShare",
      "protocol": "REST",
      "method": "DELETE",
      "entitypath": "{base_path}/{version}/tenantnetworks/{pathv1}/segment-resource-shares/{pathv2}?{query}",
      "requestSchema": "schema.json",
      "responseSchema": "schema.json",
      "timeout": 0,
      "sendEmpty": false,
      "requestDatatype": "JSON",
      "responseDatatype": "JSON",
      "headers": {},
      "responseObjects": [
        {
          "type": "default",
          "key": "",
          "mockFile": ""
        }
      ]
    }
  ]
}