{
  "actions": [
    {
      "name": "getActiveNatTranslation",
      "protocol": "REST",
      "method": "POST",
      "entitypath": "{base_path}/{version}/tenantnetworks/{pathv1}/connectors/{pathv2}/troubleshooting/active-nat-translations?{query}",
      "requestSchema": "schema.json",
      "responseSchema": "schema.json",
      "timeout": 0,
      "sendEmpty": false,
      "requestDatatype": "JSON",
      "responseDatatype": "JSON",
      "headers": {},
      "responseObjects": [
        {
          "type": "default",
          "key": "",
          "mockFile": ""
        }
      ]
    },
    {
      "name": "getActiveNatTranslationForResourceShare",
      "protocol": "REST",
      "method": "POST",
      "entitypath": "{base_path}/{version}/tenantnetworks/{pathv1}/segment-resource-shares/{pathv2}/troubleshooting/active-nat-translations?{query}",
      "requestSchema": "schema.json",
      "responseSchema": "schema.json",
      "timeout": 0,
      "sendEmpty": false,
      "requestDatatype": "JSON",
      "responseDatatype": "JSON",
      "headers": {},
      "responseObjects": [
        {
          "type": "default",
          "key": "",
          "mockFile": ""
        }
      ]
    }
  ]
}