[
  {
    "id": 96,
    "name": "sr1",
    "serviceId": -1,
    "serviceList": [
      1,
      8,
      5,
      1,
      2
    ],
    "designatedSegment": "HR",
    "designatedSegmentId": 78,
    "endAResources": [
      10,
      45
    ],
    "endBResources": [
      77,
      96
    ],
    "endARouteLimit": 100,
    "endBRouteLimit": 100,
    "endASegmentId": 78,
    "endBSegmentId": 89,
    "state": {},
    "direction": null,
    "lastConfigUpdatedAt": 6
  },
  {
    "id": 96,
    "name": "sr1",
    "serviceId": -1,
    "serviceList": [
      7,
      7,
      1,
      6,
      6,
      3,
      4,
      2,
      10
    ],
    "designatedSegment": "HR",
    "designatedSegmentId": 78,
    "endAResources": [
      10,
      45
    ],
    "endBResources": [
      77,
      96
    ],
    "endARouteLimit": 100,
    "endBRouteLimit": 100,
    "endASegmentId": 78,
    "endBSegmentId": 89,
    "state": {},
    "direction": null,
    "lastConfigUpdatedAt": 10
  }
]