{
  "email": "john@abc.com",
  "firstName": "John",
  "id": "78772b5e-ed20-11ea-adc1-0242ac120777",
  "idpId": "78772b5e-ed20-11ea-adc1-0242ac120002",
  "lastLoggedIn": 10,
  "lastName": "Doe",
  "password": "string",
  "roles": [
    "netadmin"
  ],
  "tenantId": "1",
  "userName": "john",
  "userType": null,
  "jwksUri": "https://www.alkira.com",
  "serviceProvider": null
}