[
  {
    "billingTags": [
      4,
      8,
      9
    ],
    "type": null,
    "ciscoEdgeInfo": [
      {
        "cloudInitFile": "vinitparam:\n - otp : xUKTOMk1CAmBh4I1bk5pehI36MnMOsbk\n - vbond : vbond-7732976.abcdefg.net\n - uuid : dabc5ee2-c10d-4d43-ae3d-a9cb517b87bd\n - org : alk-sdwan - 835965\n",
        "cloudInitFileName": "a29d5318-e8e1-11ec-8fea-0242ac120002.txt",
        "credentialId": "ae31fb52-e8e1-11ec-8fea-0242ac120002",
        "sshKeyPairCredentialId": "ae31fb52-e8e1-11ec-8fea-0242ac120002",
        "hostName": "myhost",
        "id": 12,
        "name": "head-office"
      },
      {
        "cloudInitFile": "vinitparam:\n - otp : xUKTOMk1CAmBh4I1bk5pehI36MnMOsbk\n - vbond : vbond-7732976.abcdefg.net\n - uuid : dabc5ee2-c10d-4d43-ae3d-a9cb517b87bd\n - org : alk-sdwan - 835965\n",
        "cloudInitFileName": "a29d5318-e8e1-11ec-8fea-0242ac120002.txt",
        "credentialId": "ae31fb52-e8e1-11ec-8fea-0242ac120002",
        "sshKeyPairCredentialId": "ae31fb52-e8e1-11ec-8fea-0242ac120002",
        "hostName": "myhost",
        "id": 12,
        "name": "head-office"
      },
      {
        "cloudInitFile": "vinitparam:\n - otp : xUKTOMk1CAmBh4I1bk5pehI36MnMOsbk\n - vbond : vbond-7732976.abcdefg.net\n - uuid : dabc5ee2-c10d-4d43-ae3d-a9cb517b87bd\n - org : alk-sdwan - 835965\n",
        "cloudInitFileName": "a29d5318-e8e1-11ec-8fea-0242ac120002.txt",
        "credentialId": "ae31fb52-e8e1-11ec-8fea-0242ac120002",
        "sshKeyPairCredentialId": "ae31fb52-e8e1-11ec-8fea-0242ac120002",
        "hostName": "myhost",
        "id": 12,
        "name": "head-office"
      },
      {
        "cloudInitFile": "vinitparam:\n - otp : xUKTOMk1CAmBh4I1bk5pehI36MnMOsbk\n - vbond : vbond-7732976.abcdefg.net\n - uuid : dabc5ee2-c10d-4d43-ae3d-a9cb517b87bd\n - org : alk-sdwan - 835965\n",
        "cloudInitFileName": "a29d5318-e8e1-11ec-8fea-0242ac120002.txt",
        "credentialId": "ae31fb52-e8e1-11ec-8fea-0242ac120002",
        "sshKeyPairCredentialId": "ae31fb52-e8e1-11ec-8fea-0242ac120002",
        "hostName": "myhost",
        "id": 12,
        "name": "head-office"
      },
      {
        "cloudInitFile": "vinitparam:\n - otp : xUKTOMk1CAmBh4I1bk5pehI36MnMOsbk\n - vbond : vbond-7732976.abcdefg.net\n - uuid : dabc5ee2-c10d-4d43-ae3d-a9cb517b87bd\n - org : alk-sdwan - 835965\n",
        "cloudInitFileName": "a29d5318-e8e1-11ec-8fea-0242ac120002.txt",
        "credentialId": "ae31fb52-e8e1-11ec-8fea-0242ac120002",
        "sshKeyPairCredentialId": "ae31fb52-e8e1-11ec-8fea-0242ac120002",
        "hostName": "myhost",
        "id": 12,
        "name": "head-office"
      },
      {
        "cloudInitFile": "vinitparam:\n - otp : xUKTOMk1CAmBh4I1bk5pehI36MnMOsbk\n - vbond : vbond-7732976.abcdefg.net\n - uuid : dabc5ee2-c10d-4d43-ae3d-a9cb517b87bd\n - org : alk-sdwan - 835965\n",
        "cloudInitFileName": "a29d5318-e8e1-11ec-8fea-0242ac120002.txt",
        "credentialId": "ae31fb52-e8e1-11ec-8fea-0242ac120002",
        "sshKeyPairCredentialId": "ae31fb52-e8e1-11ec-8fea-0242ac120002",
        "hostName": "myhost",
        "id": 12,
        "name": "head-office"
      },
      {
        "cloudInitFile": "vinitparam:\n - otp : xUKTOMk1CAmBh4I1bk5pehI36MnMOsbk\n - vbond : vbond-7732976.abcdefg.net\n - uuid : dabc5ee2-c10d-4d43-ae3d-a9cb517b87bd\n - org : alk-sdwan - 835965\n",
        "cloudInitFileName": "a29d5318-e8e1-11ec-8fea-0242ac120002.txt",
        "credentialId": "ae31fb52-e8e1-11ec-8fea-0242ac120002",
        "sshKeyPairCredentialId": "ae31fb52-e8e1-11ec-8fea-0242ac120002",
        "hostName": "myhost",
        "id": 12,
        "name": "head-office"
      },
      {
        "cloudInitFile": "vinitparam:\n - otp : xUKTOMk1CAmBh4I1bk5pehI36MnMOsbk\n - vbond : vbond-7732976.abcdefg.net\n - uuid : dabc5ee2-c10d-4d43-ae3d-a9cb517b87bd\n - org : alk-sdwan - 835965\n",
        "cloudInitFileName": "a29d5318-e8e1-11ec-8fea-0242ac120002.txt",
        "credentialId": "ae31fb52-e8e1-11ec-8fea-0242ac120002",
        "sshKeyPairCredentialId": "ae31fb52-e8e1-11ec-8fea-0242ac120002",
        "hostName": "myhost",
        "id": 12,
        "name": "head-office"
      }
    ],
    "ciscoEdgeVRFMappings": [
      {
        "advertiseOnPremRoutes": true,
        "disableInternetExit": true,
        "segmentId": 77,
        "vrf": 17,
        "customerAsn": 100
      },
      {
        "advertiseOnPremRoutes": false,
        "disableInternetExit": true,
        "segmentId": 77,
        "vrf": 17,
        "customerAsn": 100
      },
      {
        "advertiseOnPremRoutes": true,
        "disableInternetExit": true,
        "segmentId": 77,
        "vrf": 17,
        "customerAsn": 100
      },
      {
        "advertiseOnPremRoutes": true,
        "disableInternetExit": true,
        "segmentId": 77,
        "vrf": 17,
        "customerAsn": 100
      },
      {
        "advertiseOnPremRoutes": true,
        "disableInternetExit": true,
        "segmentId": 77,
        "vrf": 17,
        "customerAsn": 100
      },
      {
        "advertiseOnPremRoutes": true,
        "disableInternetExit": true,
        "segmentId": 77,
        "vrf": 17,
        "customerAsn": 100
      },
      {
        "advertiseOnPremRoutes": false,
        "disableInternetExit": true,
        "segmentId": 77,
        "vrf": 17,
        "customerAsn": 100
      }
    ],
    "version": "18.3.0",
    "size": null,
    "enabled": true
  },
  {
    "billingTags": [
      9,
      8,
      10,
      6
    ],
    "type": null,
    "ciscoEdgeInfo": [
      {
        "cloudInitFile": "vinitparam:\n - otp : xUKTOMk1CAmBh4I1bk5pehI36MnMOsbk\n - vbond : vbond-7732976.abcdefg.net\n - uuid : dabc5ee2-c10d-4d43-ae3d-a9cb517b87bd\n - org : alk-sdwan - 835965\n",
        "cloudInitFileName": "a29d5318-e8e1-11ec-8fea-0242ac120002.txt",
        "credentialId": "ae31fb52-e8e1-11ec-8fea-0242ac120002",
        "sshKeyPairCredentialId": "ae31fb52-e8e1-11ec-8fea-0242ac120002",
        "hostName": "myhost",
        "id": 12,
        "name": "head-office"
      },
      {
        "cloudInitFile": "vinitparam:\n - otp : xUKTOMk1CAmBh4I1bk5pehI36MnMOsbk\n - vbond : vbond-7732976.abcdefg.net\n - uuid : dabc5ee2-c10d-4d43-ae3d-a9cb517b87bd\n - org : alk-sdwan - 835965\n",
        "cloudInitFileName": "a29d5318-e8e1-11ec-8fea-0242ac120002.txt",
        "credentialId": "ae31fb52-e8e1-11ec-8fea-0242ac120002",
        "sshKeyPairCredentialId": "ae31fb52-e8e1-11ec-8fea-0242ac120002",
        "hostName": "myhost",
        "id": 12,
        "name": "head-office"
      },
      {
        "cloudInitFile": "vinitparam:\n - otp : xUKTOMk1CAmBh4I1bk5pehI36MnMOsbk\n - vbond : vbond-7732976.abcdefg.net\n - uuid : dabc5ee2-c10d-4d43-ae3d-a9cb517b87bd\n - org : alk-sdwan - 835965\n",
        "cloudInitFileName": "a29d5318-e8e1-11ec-8fea-0242ac120002.txt",
        "credentialId": "ae31fb52-e8e1-11ec-8fea-0242ac120002",
        "sshKeyPairCredentialId": "ae31fb52-e8e1-11ec-8fea-0242ac120002",
        "hostName": "myhost",
        "id": 12,
        "name": "head-office"
      },
      {
        "cloudInitFile": "vinitparam:\n - otp : xUKTOMk1CAmBh4I1bk5pehI36MnMOsbk\n - vbond : vbond-7732976.abcdefg.net\n - uuid : dabc5ee2-c10d-4d43-ae3d-a9cb517b87bd\n - org : alk-sdwan - 835965\n",
        "cloudInitFileName": "a29d5318-e8e1-11ec-8fea-0242ac120002.txt",
        "credentialId": "ae31fb52-e8e1-11ec-8fea-0242ac120002",
        "sshKeyPairCredentialId": "ae31fb52-e8e1-11ec-8fea-0242ac120002",
        "hostName": "myhost",
        "id": 12,
        "name": "head-office"
      },
      {
        "cloudInitFile": "vinitparam:\n - otp : xUKTOMk1CAmBh4I1bk5pehI36MnMOsbk\n - vbond : vbond-7732976.abcdefg.net\n - uuid : dabc5ee2-c10d-4d43-ae3d-a9cb517b87bd\n - org : alk-sdwan - 835965\n",
        "cloudInitFileName": "a29d5318-e8e1-11ec-8fea-0242ac120002.txt",
        "credentialId": "ae31fb52-e8e1-11ec-8fea-0242ac120002",
        "sshKeyPairCredentialId": "ae31fb52-e8e1-11ec-8fea-0242ac120002",
        "hostName": "myhost",
        "id": 12,
        "name": "head-office"
      },
      {
        "cloudInitFile": "vinitparam:\n - otp : xUKTOMk1CAmBh4I1bk5pehI36MnMOsbk\n - vbond : vbond-7732976.abcdefg.net\n - uuid : dabc5ee2-c10d-4d43-ae3d-a9cb517b87bd\n - org : alk-sdwan - 835965\n",
        "cloudInitFileName": "a29d5318-e8e1-11ec-8fea-0242ac120002.txt",
        "credentialId": "ae31fb52-e8e1-11ec-8fea-0242ac120002",
        "sshKeyPairCredentialId": "ae31fb52-e8e1-11ec-8fea-0242ac120002",
        "hostName": "myhost",
        "id": 12,
        "name": "head-office"
      },
      {
        "cloudInitFile": "vinitparam:\n - otp : xUKTOMk1CAmBh4I1bk5pehI36MnMOsbk\n - vbond : vbond-7732976.abcdefg.net\n - uuid : dabc5ee2-c10d-4d43-ae3d-a9cb517b87bd\n - org : alk-sdwan - 835965\n",
        "cloudInitFileName": "a29d5318-e8e1-11ec-8fea-0242ac120002.txt",
        "credentialId": "ae31fb52-e8e1-11ec-8fea-0242ac120002",
        "sshKeyPairCredentialId": "ae31fb52-e8e1-11ec-8fea-0242ac120002",
        "hostName": "myhost",
        "id": 12,
        "name": "head-office"
      },
      {
        "cloudInitFile": "vinitparam:\n - otp : xUKTOMk1CAmBh4I1bk5pehI36MnMOsbk\n - vbond : vbond-7732976.abcdefg.net\n - uuid : dabc5ee2-c10d-4d43-ae3d-a9cb517b87bd\n - org : alk-sdwan - 835965\n",
        "cloudInitFileName": "a29d5318-e8e1-11ec-8fea-0242ac120002.txt",
        "credentialId": "ae31fb52-e8e1-11ec-8fea-0242ac120002",
        "sshKeyPairCredentialId": "ae31fb52-e8e1-11ec-8fea-0242ac120002",
        "hostName": "myhost",
        "id": 12,
        "name": "head-office"
      },
      {
        "cloudInitFile": "vinitparam:\n - otp : xUKTOMk1CAmBh4I1bk5pehI36MnMOsbk\n - vbond : vbond-7732976.abcdefg.net\n - uuid : dabc5ee2-c10d-4d43-ae3d-a9cb517b87bd\n - org : alk-sdwan - 835965\n",
        "cloudInitFileName": "a29d5318-e8e1-11ec-8fea-0242ac120002.txt",
        "credentialId": "ae31fb52-e8e1-11ec-8fea-0242ac120002",
        "sshKeyPairCredentialId": "ae31fb52-e8e1-11ec-8fea-0242ac120002",
        "hostName": "myhost",
        "id": 12,
        "name": "head-office"
      },
      {
        "cloudInitFile": "vinitparam:\n - otp : xUKTOMk1CAmBh4I1bk5pehI36MnMOsbk\n - vbond : vbond-7732976.abcdefg.net\n - uuid : dabc5ee2-c10d-4d43-ae3d-a9cb517b87bd\n - org : alk-sdwan - 835965\n",
        "cloudInitFileName": "a29d5318-e8e1-11ec-8fea-0242ac120002.txt",
        "credentialId": "ae31fb52-e8e1-11ec-8fea-0242ac120002",
        "sshKeyPairCredentialId": "ae31fb52-e8e1-11ec-8fea-0242ac120002",
        "hostName": "myhost",
        "id": 12,
        "name": "head-office"
      }
    ],
    "ciscoEdgeVRFMappings": [
      {
        "advertiseOnPremRoutes": true,
        "disableInternetExit": true,
        "segmentId": 77,
        "vrf": 17,
        "customerAsn": 100
      },
      {
        "advertiseOnPremRoutes": false,
        "disableInternetExit": true,
        "segmentId": 77,
        "vrf": 17,
        "customerAsn": 100
      },
      {
        "advertiseOnPremRoutes": true,
        "disableInternetExit": true,
        "segmentId": 77,
        "vrf": 17,
        "customerAsn": 100
      },
      {
        "advertiseOnPremRoutes": false,
        "disableInternetExit": true,
        "segmentId": 77,
        "vrf": 17,
        "customerAsn": 100
      },
      {
        "advertiseOnPremRoutes": false,
        "disableInternetExit": true,
        "segmentId": 77,
        "vrf": 17,
        "customerAsn": 100
      },
      {
        "advertiseOnPremRoutes": true,
        "disableInternetExit": true,
        "segmentId": 77,
        "vrf": 17,
        "customerAsn": 100
      },
      {
        "advertiseOnPremRoutes": true,
        "disableInternetExit": true,
        "segmentId": 77,
        "vrf": 17,
        "customerAsn": 100
      },
      {
        "advertiseOnPremRoutes": false,
        "disableInternetExit": true,
        "segmentId": 77,
        "vrf": 17,
        "customerAsn": 100
      },
      {
        "advertiseOnPremRoutes": true,
        "disableInternetExit": true,
        "segmentId": 77,
        "vrf": 17,
        "customerAsn": 100
      }
    ],
    "version": "18.3.0",
    "size": null,
    "enabled": true
  },
  {
    "billingTags": [
      10,
      3,
      3,
      3,
      9
    ],
    "type": null,
    "ciscoEdgeInfo": [
      {
        "cloudInitFile": "vinitparam:\n - otp : xUKTOMk1CAmBh4I1bk5pehI36MnMOsbk\n - vbond : vbond-7732976.abcdefg.net\n - uuid : dabc5ee2-c10d-4d43-ae3d-a9cb517b87bd\n - org : alk-sdwan - 835965\n",
        "cloudInitFileName": "a29d5318-e8e1-11ec-8fea-0242ac120002.txt",
        "credentialId": "ae31fb52-e8e1-11ec-8fea-0242ac120002",
        "sshKeyPairCredentialId": "ae31fb52-e8e1-11ec-8fea-0242ac120002",
        "hostName": "myhost",
        "id": 12,
        "name": "head-office"
      },
      {
        "cloudInitFile": "vinitparam:\n - otp : xUKTOMk1CAmBh4I1bk5pehI36MnMOsbk\n - vbond : vbond-7732976.abcdefg.net\n - uuid : dabc5ee2-c10d-4d43-ae3d-a9cb517b87bd\n - org : alk-sdwan - 835965\n",
        "cloudInitFileName": "a29d5318-e8e1-11ec-8fea-0242ac120002.txt",
        "credentialId": "ae31fb52-e8e1-11ec-8fea-0242ac120002",
        "sshKeyPairCredentialId": "ae31fb52-e8e1-11ec-8fea-0242ac120002",
        "hostName": "myhost",
        "id": 12,
        "name": "head-office"
      },
      {
        "cloudInitFile": "vinitparam:\n - otp : xUKTOMk1CAmBh4I1bk5pehI36MnMOsbk\n - vbond : vbond-7732976.abcdefg.net\n - uuid : dabc5ee2-c10d-4d43-ae3d-a9cb517b87bd\n - org : alk-sdwan - 835965\n",
        "cloudInitFileName": "a29d5318-e8e1-11ec-8fea-0242ac120002.txt",
        "credentialId": "ae31fb52-e8e1-11ec-8fea-0242ac120002",
        "sshKeyPairCredentialId": "ae31fb52-e8e1-11ec-8fea-0242ac120002",
        "hostName": "myhost",
        "id": 12,
        "name": "head-office"
      },
      {
        "cloudInitFile": "vinitparam:\n - otp : xUKTOMk1CAmBh4I1bk5pehI36MnMOsbk\n - vbond : vbond-7732976.abcdefg.net\n - uuid : dabc5ee2-c10d-4d43-ae3d-a9cb517b87bd\n - org : alk-sdwan - 835965\n",
        "cloudInitFileName": "a29d5318-e8e1-11ec-8fea-0242ac120002.txt",
        "credentialId": "ae31fb52-e8e1-11ec-8fea-0242ac120002",
        "sshKeyPairCredentialId": "ae31fb52-e8e1-11ec-8fea-0242ac120002",
        "hostName": "myhost",
        "id": 12,
        "name": "head-office"
      },
      {
        "cloudInitFile": "vinitparam:\n - otp : xUKTOMk1CAmBh4I1bk5pehI36MnMOsbk\n - vbond : vbond-7732976.abcdefg.net\n - uuid : dabc5ee2-c10d-4d43-ae3d-a9cb517b87bd\n - org : alk-sdwan - 835965\n",
        "cloudInitFileName": "a29d5318-e8e1-11ec-8fea-0242ac120002.txt",
        "credentialId": "ae31fb52-e8e1-11ec-8fea-0242ac120002",
        "sshKeyPairCredentialId": "ae31fb52-e8e1-11ec-8fea-0242ac120002",
        "hostName": "myhost",
        "id": 12,
        "name": "head-office"
      },
      {
        "cloudInitFile": "vinitparam:\n - otp : xUKTOMk1CAmBh4I1bk5pehI36MnMOsbk\n - vbond : vbond-7732976.abcdefg.net\n - uuid : dabc5ee2-c10d-4d43-ae3d-a9cb517b87bd\n - org : alk-sdwan - 835965\n",
        "cloudInitFileName": "a29d5318-e8e1-11ec-8fea-0242ac120002.txt",
        "credentialId": "ae31fb52-e8e1-11ec-8fea-0242ac120002",
        "sshKeyPairCredentialId": "ae31fb52-e8e1-11ec-8fea-0242ac120002",
        "hostName": "myhost",
        "id": 12,
        "name": "head-office"
      },
      {
        "cloudInitFile": "vinitparam:\n - otp : xUKTOMk1CAmBh4I1bk5pehI36MnMOsbk\n - vbond : vbond-7732976.abcdefg.net\n - uuid : dabc5ee2-c10d-4d43-ae3d-a9cb517b87bd\n - org : alk-sdwan - 835965\n",
        "cloudInitFileName": "a29d5318-e8e1-11ec-8fea-0242ac120002.txt",
        "credentialId": "ae31fb52-e8e1-11ec-8fea-0242ac120002",
        "sshKeyPairCredentialId": "ae31fb52-e8e1-11ec-8fea-0242ac120002",
        "hostName": "myhost",
        "id": 12,
        "name": "head-office"
      }
    ],
    "ciscoEdgeVRFMappings": [
      {
        "advertiseOnPremRoutes": true,
        "disableInternetExit": true,
        "segmentId": 77,
        "vrf": 17,
        "customerAsn": 100
      },
      {
        "advertiseOnPremRoutes": true,
        "disableInternetExit": true,
        "segmentId": 77,
        "vrf": 17,
        "customerAsn": 100
      },
      {
        "advertiseOnPremRoutes": false,
        "disableInternetExit": true,
        "segmentId": 77,
        "vrf": 17,
        "customerAsn": 100
      },
      {
        "advertiseOnPremRoutes": false,
        "disableInternetExit": true,
        "segmentId": 77,
        "vrf": 17,
        "customerAsn": 100
      },
      {
        "advertiseOnPremRoutes": false,
        "disableInternetExit": true,
        "segmentId": 77,
        "vrf": 17,
        "customerAsn": 100
      },
      {
        "advertiseOnPremRoutes": true,
        "disableInternetExit": true,
        "segmentId": 77,
        "vrf": 17,
        "customerAsn": 100
      },
      {
        "advertiseOnPremRoutes": false,
        "disableInternetExit": true,
        "segmentId": 77,
        "vrf": 17,
        "customerAsn": 100
      },
      {
        "advertiseOnPremRoutes": true,
        "disableInternetExit": true,
        "segmentId": 77,
        "vrf": 17,
        "customerAsn": 100
      }
    ],
    "version": "18.3.0",
    "size": null,
    "enabled": true
  },
  {
    "billingTags": [
      6,
      4,
      3,
      9,
      2,
      7,
      10,
      3
    ],
    "type": null,
    "ciscoEdgeInfo": [
      {
        "cloudInitFile": "vinitparam:\n - otp : xUKTOMk1CAmBh4I1bk5pehI36MnMOsbk\n - vbond : vbond-7732976.abcdefg.net\n - uuid : dabc5ee2-c10d-4d43-ae3d-a9cb517b87bd\n - org : alk-sdwan - 835965\n",
        "cloudInitFileName": "a29d5318-e8e1-11ec-8fea-0242ac120002.txt",
        "credentialId": "ae31fb52-e8e1-11ec-8fea-0242ac120002",
        "sshKeyPairCredentialId": "ae31fb52-e8e1-11ec-8fea-0242ac120002",
        "hostName": "myhost",
        "id": 12,
        "name": "head-office"
      },
      {
        "cloudInitFile": "vinitparam:\n - otp : xUKTOMk1CAmBh4I1bk5pehI36MnMOsbk\n - vbond : vbond-7732976.abcdefg.net\n - uuid : dabc5ee2-c10d-4d43-ae3d-a9cb517b87bd\n - org : alk-sdwan - 835965\n",
        "cloudInitFileName": "a29d5318-e8e1-11ec-8fea-0242ac120002.txt",
        "credentialId": "ae31fb52-e8e1-11ec-8fea-0242ac120002",
        "sshKeyPairCredentialId": "ae31fb52-e8e1-11ec-8fea-0242ac120002",
        "hostName": "myhost",
        "id": 12,
        "name": "head-office"
      },
      {
        "cloudInitFile": "vinitparam:\n - otp : xUKTOMk1CAmBh4I1bk5pehI36MnMOsbk\n - vbond : vbond-7732976.abcdefg.net\n - uuid : dabc5ee2-c10d-4d43-ae3d-a9cb517b87bd\n - org : alk-sdwan - 835965\n",
        "cloudInitFileName": "a29d5318-e8e1-11ec-8fea-0242ac120002.txt",
        "credentialId": "ae31fb52-e8e1-11ec-8fea-0242ac120002",
        "sshKeyPairCredentialId": "ae31fb52-e8e1-11ec-8fea-0242ac120002",
        "hostName": "myhost",
        "id": 12,
        "name": "head-office"
      },
      {
        "cloudInitFile": "vinitparam:\n - otp : xUKTOMk1CAmBh4I1bk5pehI36MnMOsbk\n - vbond : vbond-7732976.abcdefg.net\n - uuid : dabc5ee2-c10d-4d43-ae3d-a9cb517b87bd\n - org : alk-sdwan - 835965\n",
        "cloudInitFileName": "a29d5318-e8e1-11ec-8fea-0242ac120002.txt",
        "credentialId": "ae31fb52-e8e1-11ec-8fea-0242ac120002",
        "sshKeyPairCredentialId": "ae31fb52-e8e1-11ec-8fea-0242ac120002",
        "hostName": "myhost",
        "id": 12,
        "name": "head-office"
      },
      {
        "cloudInitFile": "vinitparam:\n - otp : xUKTOMk1CAmBh4I1bk5pehI36MnMOsbk\n - vbond : vbond-7732976.abcdefg.net\n - uuid : dabc5ee2-c10d-4d43-ae3d-a9cb517b87bd\n - org : alk-sdwan - 835965\n",
        "cloudInitFileName": "a29d5318-e8e1-11ec-8fea-0242ac120002.txt",
        "credentialId": "ae31fb52-e8e1-11ec-8fea-0242ac120002",
        "sshKeyPairCredentialId": "ae31fb52-e8e1-11ec-8fea-0242ac120002",
        "hostName": "myhost",
        "id": 12,
        "name": "head-office"
      },
      {
        "cloudInitFile": "vinitparam:\n - otp : xUKTOMk1CAmBh4I1bk5pehI36MnMOsbk\n - vbond : vbond-7732976.abcdefg.net\n - uuid : dabc5ee2-c10d-4d43-ae3d-a9cb517b87bd\n - org : alk-sdwan - 835965\n",
        "cloudInitFileName": "a29d5318-e8e1-11ec-8fea-0242ac120002.txt",
        "credentialId": "ae31fb52-e8e1-11ec-8fea-0242ac120002",
        "sshKeyPairCredentialId": "ae31fb52-e8e1-11ec-8fea-0242ac120002",
        "hostName": "myhost",
        "id": 12,
        "name": "head-office"
      }
    ],
    "ciscoEdgeVRFMappings": [
      {
        "advertiseOnPremRoutes": false,
        "disableInternetExit": true,
        "segmentId": 77,
        "vrf": 17,
        "customerAsn": 100
      },
      {
        "advertiseOnPremRoutes": false,
        "disableInternetExit": true,
        "segmentId": 77,
        "vrf": 17,
        "customerAsn": 100
      },
      {
        "advertiseOnPremRoutes": true,
        "disableInternetExit": true,
        "segmentId": 77,
        "vrf": 17,
        "customerAsn": 100
      },
      {
        "advertiseOnPremRoutes": true,
        "disableInternetExit": true,
        "segmentId": 77,
        "vrf": 17,
        "customerAsn": 100
      },
      {
        "advertiseOnPremRoutes": true,
        "disableInternetExit": true,
        "segmentId": 77,
        "vrf": 17,
        "customerAsn": 100
      },
      {
        "advertiseOnPremRoutes": true,
        "disableInternetExit": true,
        "segmentId": 77,
        "vrf": 17,
        "customerAsn": 100
      }
    ],
    "version": "18.3.0",
    "size": null,
    "enabled": true
  }
]