[
  {
    "id": "c0faeeec-3df1-11ec-9bbc-0242ac130002",
    "tenantId": 1,
    "name": "string",
    "credentialId": "string",
    "cloudProvider": null,
    "autoSync": null,
    "nativeId": "3789001020101",
    "nativeName": "TestAccount"
  },
  {
    "id": "c0faeeec-3df1-11ec-9bbc-0242ac130002",
    "tenantId": 1,
    "name": "string",
    "credentialId": "string",
    "cloudProvider": null,
    "autoSync": null,
    "nativeId": "3789001020101",
    "nativeName": "TestAccount"
  },
  {
    "id": "c0faeeec-3df1-11ec-9bbc-0242ac130002",
    "tenantId": 1,
    "name": "string",
    "credentialId": "string",
    "cloudProvider": null,
    "autoSync": null,
    "nativeId": "3789001020101",
    "nativeName": "TestAccount"
  }
]