{
  "actions": [
    {
      "name": "getsegments",
      "protocol": "REST",
      "method": "GET",
      "entitypath": "{base_path}/{version}/tenantnetworks/{pathv1}/segments?{query}",
      "requestSchema": "schema.json",
      "responseSchema": "schema.json",
      "timeout": 0,
      "sendEmpty": false,
      "sendGetBody": false,
      "requestDatatype": "JSON",
      "responseDatatype": "JSON",
      "headers": {},
      "responseObjects": [
        {
          "type": "default",
          "key": "",
          "mockFile": "mockdatafiles/getsegments-default.json"
        }
      ]
    },
    {
      "name": "createSegment",
      "protocol": "REST",
      "method": "POST",
      "entitypath": "{base_path}/{version}/tenantnetworks/{pathv1}/segments?{query}",
      "requestSchema": "schema.json",
      "responseSchema": "schema.json",
      "timeout": 0,
      "sendEmpty": false,
      "requestDatatype": "JSON",
      "responseDatatype": "JSON",
      "headers": {},
      "responseObjects": [
        {
          "type": "default",
          "key": "",
          "mockFile": ""
        }
      ]
    },
    {
      "name": "getSegment",
      "protocol": "REST",
      "method": "GET",
      "entitypath": "{base_path}/{version}/tenantnetworks/{pathv1}/segments/{pathv2}?{query}",
      "requestSchema": "schema.json",
      "responseSchema": "schema.json",
      "timeout": 0,
      "sendEmpty": false,
      "sendGetBody": false,
      "requestDatatype": "JSON",
      "responseDatatype": "JSON",
      "headers": {},
      "responseObjects": [
        {
          "type": "default",
          "key": "",
          "mockFile": ""
        }
      ]
    },
    {
      "name": "updateSegment",
      "protocol": "REST",
      "method": "PUT",
      "entitypath": "{base_path}/{version}/tenantnetworks/{pathv1}/segments/{pathv2}?{query}",
      "requestSchema": "schema.json",
      "responseSchema": "schema.json",
      "timeout": 0,
      "sendEmpty": false,
      "requestDatatype": "JSON",
      "responseDatatype": "JSON",
      "headers": {},
      "responseObjects": [
        {
          "type": "default",
          "key": "",
          "mockFile": ""
        }
      ]
    },
    {
      "name": "deleteSegment",
      "protocol": "REST",
      "method": "DELETE",
      "entitypath": "{base_path}/{version}/tenantnetworks/{pathv1}/segments/{pathv2}?{query}",
      "requestSchema": "schema.json",
      "responseSchema": "schema.json",
      "timeout": 0,
      "sendEmpty": false,
      "requestDatatype": "JSON",
      "responseDatatype": "JSON",
      "headers": {},
      "responseObjects": [
        {
          "type": "default",
          "key": "",
          "mockFile": ""
        }
      ]
    }
  ]
}