[
  {
    "name": "My Alert",
    "attributes": null,
    "subType": null,
    "type": "NOTIFICATION"
  },
  {
    "name": "My Alert",
    "attributes": null,
    "subType": null,
    "type": "NOTIFICATION"
  },
  {
    "name": "My Alert",
    "attributes": null,
    "subType": null,
    "type": "NOTIFICATION"
  }
]