[
  {
    "id": "787723d4-ed20-11ea-adc1-0242ac120002",
    "idpName": "network_administrators",
    "name": "netadmin",
    "permissions": [
      "network-configuration-write",
      "user-management-read"
    ],
    "readOnly": true
  },
  {
    "id": "787723d4-ed20-11ea-adc1-0242ac120002",
    "idpName": "network_administrators",
    "name": "netadmin",
    "permissions": [
      "network-configuration-write",
      "user-management-read"
    ],
    "readOnly": true
  }
]