{
  "actions": [
    {
      "name": "getRulelists",
      "protocol": "REST",
      "method": "GET",
      "entitypath": "{base_path}/{version}/tenantnetworks/{pathv1}/rulelists?{query}",
      "requestSchema": "schema.json",
      "responseSchema": "schema.json",
      "timeout": 0,
      "sendEmpty": false,
      "sendGetBody": false,
      "requestDatatype": "JSON",
      "responseDatatype": "JSON",
      "headers": {},
      "responseObjects": [
        {
          "type": "default",
          "key": "",
          "mockFile": "mockdatafiles/getRulelists-default.json"
        }
      ]
    },
    {
      "name": "createRulelist",
      "protocol": "REST",
      "method": "POST",
      "entitypath": "{base_path}/{version}/tenantnetworks/{pathv1}/rulelists?{query}",
      "requestSchema": "schema.json",
      "responseSchema": "schema.json",
      "timeout": 0,
      "sendEmpty": false,
      "requestDatatype": "JSON",
      "responseDatatype": "JSON",
      "headers": {},
      "responseObjects": [
        {
          "type": "default",
          "key": "",
          "mockFile": ""
        }
      ]
    },
    {
      "name": "getRulelist",
      "protocol": "REST",
      "method": "GET",
      "entitypath": "{base_path}/{version}/tenantnetworks/{pathv1}/rulelists/{pathv2}?{query}",
      "requestSchema": "schema.json",
      "responseSchema": "schema.json",
      "timeout": 0,
      "sendEmpty": false,
      "sendGetBody": false,
      "requestDatatype": "JSON",
      "responseDatatype": "JSON",
      "headers": {},
      "responseObjects": [
        {
          "type": "default",
          "key": "",
          "mockFile": ""
        }
      ]
    },
    {
      "name": "updateRulelist",
      "protocol": "REST",
      "method": "PUT",
      "entitypath": "{base_path}/{version}/tenantnetworks/{pathv1}/rulelists/{pathv2}?{query}",
      "requestSchema": "schema.json",
      "responseSchema": "schema.json",
      "timeout": 0,
      "sendEmpty": false,
      "requestDatatype": "JSON",
      "responseDatatype": "JSON",
      "headers": {},
      "responseObjects": [
        {
          "type": "default",
          "key": "",
          "mockFile": ""
        }
      ]
    },
    {
      "name": "deleteRulelist",
      "protocol": "REST",
      "method": "DELETE",
      "entitypath": "{base_path}/{version}/tenantnetworks/{pathv1}/rulelists/{pathv2}?{query}",
      "requestSchema": "schema.json",
      "responseSchema": "schema.json",
      "timeout": 0,
      "sendEmpty": false,
      "requestDatatype": "JSON",
      "responseDatatype": "JSON",
      "headers": {},
      "responseObjects": [
        {
          "type": "default",
          "key": "",
          "mockFile": ""
        }
      ]
    }
  ]
}