{
  "actions": [
    {
      "name": "getSessionCountUsingGET",
      "protocol": "REST",
      "method": "GET",
      "entitypath": "{base_path}/{version}/tenantnetworks/{pathv1}/stats/application-sessions/{pathv2}?{query}",
      "requestSchema": "schema.json",
      "responseSchema": "schema.json",
      "timeout": 0,
      "sendEmpty": false,
      "sendGetBody": false,
      "requestDatatype": "JSON",
      "responseDatatype": "JSON",
      "headers": {},
      "responseObjects": [
        {
          "type": "default",
          "key": "",
          "mockFile": ""
        }
      ]
    },
    {
      "name": "getAppNameTimeSeriesUsingGET",
      "protocol": "REST",
      "method": "GET",
      "entitypath": "{base_path}/{version}/tenantnetworks/{pathv1}/stats/applications?{query}",
      "requestSchema": "schema.json",
      "responseSchema": "schema.json",
      "timeout": 0,
      "sendEmpty": false,
      "sendGetBody": false,
      "requestDatatype": "JSON",
      "responseDatatype": "JSON",
      "headers": {},
      "responseObjects": [
        {
          "type": "default",
          "key": "",
          "mockFile": ""
        }
      ]
    },
    {
      "name": "getRuleNameTimeSeriesUsingGET",
      "protocol": "REST",
      "method": "GET",
      "entitypath": "{base_path}/{version}/tenantnetworks/{pathv1}/stats/policyhits?{query}",
      "requestSchema": "schema.json",
      "responseSchema": "schema.json",
      "timeout": 0,
      "sendEmpty": false,
      "sendGetBody": false,
      "requestDatatype": "JSON",
      "responseDatatype": "JSON",
      "headers": {},
      "responseObjects": [
        {
          "type": "default",
          "key": "",
          "mockFile": ""
        }
      ]
    },
    {
      "name": "getTopApplicationsUsingGET",
      "protocol": "REST",
      "method": "GET",
      "entitypath": "{base_path}/{version}/tenantnetworks/{pathv1}/stats/topapplications?{query}",
      "requestSchema": "schema.json",
      "responseSchema": "schema.json",
      "timeout": 0,
      "sendEmpty": false,
      "sendGetBody": false,
      "requestDatatype": "JSON",
      "responseDatatype": "JSON",
      "headers": {},
      "responseObjects": [
        {
          "type": "default",
          "key": "",
          "mockFile": ""
        }
      ]
    },
    {
      "name": "getTopApplicationsbyConnectorUsingGET",
      "protocol": "REST",
      "method": "GET",
      "entitypath": "{base_path}/{version}/tenantnetworks/{pathv1}/stats/topapplications/{pathv2}?{query}",
      "requestSchema": "schema.json",
      "responseSchema": "schema.json",
      "timeout": 0,
      "sendEmpty": false,
      "sendGetBody": false,
      "requestDatatype": "JSON",
      "responseDatatype": "JSON",
      "headers": {},
      "responseObjects": [
        {
          "type": "default",
          "key": "",
          "mockFile": ""
        }
      ]
    },
    {
      "name": "getTopPolicyHitsUsingGET",
      "protocol": "REST",
      "method": "GET",
      "entitypath": "{base_path}/{version}/tenantnetworks/{pathv1}/stats/toppolicyhits?{query}",
      "requestSchema": "schema.json",
      "responseSchema": "schema.json",
      "timeout": 0,
      "sendEmpty": false,
      "sendGetBody": false,
      "requestDatatype": "JSON",
      "responseDatatype": "JSON",
      "headers": {},
      "responseObjects": [
        {
          "type": "default",
          "key": "",
          "mockFile": ""
        }
      ]
    },
    {
      "name": "getTopPolicyHitsbyConnectorUsingGET",
      "protocol": "REST",
      "method": "GET",
      "entitypath": "{base_path}/{version}/tenantnetworks/{pathv1}/stats/toppolicyhits/{pathv2}?{query}",
      "requestSchema": "schema.json",
      "responseSchema": "schema.json",
      "timeout": 0,
      "sendEmpty": false,
      "sendGetBody": false,
      "requestDatatype": "JSON",
      "responseDatatype": "JSON",
      "headers": {},
      "responseObjects": [
        {
          "type": "default",
          "key": "",
          "mockFile": ""
        }
      ]
    }
  ]
}