[
  {
    "id": 7,
    "internalName": "svc-ftntfw-089f0f9e-8740-11eb-8dcd-0242ac130003",
    "state": {},
    "name": "string",
    "size": null,
    "cxp": null,
    "version": "7.0.1",
    "credentialId": "34e47b10-7af2-11ec-90d6-0242ac120003",
    "managementServer": {
      "ipAddress": "10.0.1.1",
      "segment": "OPS"
    },
    "licenseType": "PAY_AS_YOU_GO",
    "instances": [
      {
        "id": 9,
        "state": {},
        "name": "Fortinet FW Instance 1",
        "hostName": "svc-instance-1",
        "internalName": "svci-ftntfw-fd514a8a-873f-11eb-8dcd-0242ac130003",
        "serialNumber": "FGC01010100010101U",
        "credentialId": "6f1541f2-7af7-11ec-90d6-0242ac120003"
      },
      {
        "id": 9,
        "state": {},
        "name": "Fortinet FW Instance 1",
        "hostName": "svc-instance-1",
        "internalName": "svci-ftntfw-fd514a8a-873f-11eb-8dcd-0242ac130003",
        "serialNumber": "FGC01010100010101U",
        "credentialId": "6f1541f2-7af7-11ec-90d6-0242ac120003"
      }
    ],
    "minInstanceCount": 9,
    "maxInstanceCount": 3,
    "segments": [
      "string",
      "string",
      "string"
    ],
    "segmentOptions": {
      "ENG": {
        "segmentId": 1,
        "zonesToGroups": {
          "DEFAULT": [
            "G1"
          ]
        }
      }
    },
    "billingTags": [
      903
    ],
    "tunnelProtocol": null,
    "autoScale": "OFF"
  },
  {
    "id": 4,
    "internalName": "svc-ftntfw-089f0f9e-8740-11eb-8dcd-0242ac130003",
    "state": {},
    "name": "string",
    "size": null,
    "cxp": null,
    "version": "7.0.1",
    "credentialId": "34e47b10-7af2-11ec-90d6-0242ac120003",
    "managementServer": {
      "ipAddress": "10.0.1.1",
      "segment": "OPS"
    },
    "licenseType": "PAY_AS_YOU_GO",
    "instances": [
      {
        "id": 5,
        "state": {},
        "name": "Fortinet FW Instance 1",
        "hostName": "svc-instance-1",
        "internalName": "svci-ftntfw-fd514a8a-873f-11eb-8dcd-0242ac130003",
        "serialNumber": "FGC01010100010101U",
        "credentialId": "6f1541f2-7af7-11ec-90d6-0242ac120003"
      },
      {
        "id": 5,
        "state": {},
        "name": "Fortinet FW Instance 1",
        "hostName": "svc-instance-1",
        "internalName": "svci-ftntfw-fd514a8a-873f-11eb-8dcd-0242ac130003",
        "serialNumber": "FGC01010100010101U",
        "credentialId": "6f1541f2-7af7-11ec-90d6-0242ac120003"
      },
      {
        "id": 4,
        "state": {},
        "name": "Fortinet FW Instance 1",
        "hostName": "svc-instance-1",
        "internalName": "svci-ftntfw-fd514a8a-873f-11eb-8dcd-0242ac130003",
        "serialNumber": "FGC01010100010101U",
        "credentialId": "6f1541f2-7af7-11ec-90d6-0242ac120003"
      },
      {
        "id": 7,
        "state": {},
        "name": "Fortinet FW Instance 1",
        "hostName": "svc-instance-1",
        "internalName": "svci-ftntfw-fd514a8a-873f-11eb-8dcd-0242ac130003",
        "serialNumber": "FGC01010100010101U",
        "credentialId": "6f1541f2-7af7-11ec-90d6-0242ac120003"
      },
      {
        "id": 9,
        "state": {},
        "name": "Fortinet FW Instance 1",
        "hostName": "svc-instance-1",
        "internalName": "svci-ftntfw-fd514a8a-873f-11eb-8dcd-0242ac130003",
        "serialNumber": "FGC01010100010101U",
        "credentialId": "6f1541f2-7af7-11ec-90d6-0242ac120003"
      },
      {
        "id": 7,
        "state": {},
        "name": "Fortinet FW Instance 1",
        "hostName": "svc-instance-1",
        "internalName": "svci-ftntfw-fd514a8a-873f-11eb-8dcd-0242ac130003",
        "serialNumber": "FGC01010100010101U",
        "credentialId": "6f1541f2-7af7-11ec-90d6-0242ac120003"
      }
    ],
    "minInstanceCount": 4,
    "maxInstanceCount": 9,
    "segments": [
      "string",
      "string",
      "string",
      "string",
      "string",
      "string"
    ],
    "segmentOptions": {
      "ENG": {
        "segmentId": 1,
        "zonesToGroups": {
          "DEFAULT": [
            "G1"
          ]
        }
      }
    },
    "billingTags": [
      903
    ],
    "tunnelProtocol": null,
    "autoScale": "OFF"
  }
]