[
  {
    "pagination": {
      "offset": 250,
      "limit": 50,
      "hits": 1025
    },
    "data": [
      {
        "referrer": "string",
        "ip": "string",
        "createdAt": 6
      },
      {
        "referrer": "string",
        "ip": "string",
        "createdAt": 10
      },
      {
        "referrer": "string",
        "ip": "string",
        "createdAt": 5
      },
      {
        "referrer": "string",
        "ip": "string",
        "createdAt": 8
      },
      {
        "referrer": "string",
        "ip": "string",
        "createdAt": 2
      },
      {
        "referrer": "string",
        "ip": "string",
        "createdAt": 1
      },
      {
        "referrer": "string",
        "ip": "string",
        "createdAt": 4
      },
      {
        "referrer": "string",
        "ip": "string",
        "createdAt": 6
      },
      {
        "referrer": "string",
        "ip": "string",
        "createdAt": 8
      },
      {
        "referrer": "string",
        "ip": "string",
        "createdAt": 5
      }
    ]
  },
  {
    "pagination": {
      "offset": 250,
      "limit": 50,
      "hits": 1025
    },
    "data": [
      {
        "referrer": "string",
        "ip": "string",
        "createdAt": 10
      },
      {
        "referrer": "string",
        "ip": "string",
        "createdAt": 4
      },
      {
        "referrer": "string",
        "ip": "string",
        "createdAt": 5
      },
      {
        "referrer": "string",
        "ip": "string",
        "createdAt": 3
      },
      {
        "referrer": "string",
        "ip": "string",
        "createdAt": 8
      },
      {
        "referrer": "string",
        "ip": "string",
        "createdAt": 6
      },
      {
        "referrer": "string",
        "ip": "string",
        "createdAt": 7
      },
      {
        "referrer": "string",
        "ip": "string",
        "createdAt": 6
      }
    ]
  }
]