[
  {
    "id": 1,
    "name": "blox-us-west",
    "internalName": "svc-infoblox-256d7193-6634-4ff9-bb0e-513fa921",
    "description": "InfoBlox service for the US-WEST region",
    "cxp": null,
    "segments": [
      "HR"
    ],
    "billingTags": [
      1,
      2
    ],
    "globalCidrListId": 3,
    "anycast": {
      "enabled": true,
      "ips": [
        "10.10.10.10"
      ],
      "backupCxps": [
        "US-WEST"
      ]
    },
    "serviceGroupId": 45,
    "serviceGroupName": "blox-us-west-svc-group",
    "gridMaster": {
      "ip": "172.16.1.1",
      "name": "alkira-infoblox",
      "external": false,
      "gridMasterCredentialId": "e61acb8c-c043-11ec-9d64-0242ac120002",
      "sharedSecretCredentialId": "f1083d40-c043-11ec-9d64-0242ac120002"
    },
    "licenseType": null,
    "instances": [
      {
        "id": 1,
        "name": "member1.localdomain",
        "internalName": "svci-infoblox-b1ce40de-19bc-4e2e-bfe4-bb5a5171",
        "hostName": "member1.localdomain",
        "credentialId": "string",
        "model": "TE-V825",
        "type": null,
        "managementPrefix": "10.2.0.30/28",
        "lanPrefix": "10.2.0.60/28",
        "publicIp": "10.2.0.60",
        "configuredMasterIp": "172.17.2.248",
        "productId": "98a34e46-42af-459c-99ed-e6bc45d28e7e",
        "anyCastEnabled": false,
        "version": "8.6.0"
      },
      {
        "id": 1,
        "name": "member1.localdomain",
        "internalName": "svci-infoblox-b1ce40de-19bc-4e2e-bfe4-bb5a5171",
        "hostName": "member1.localdomain",
        "credentialId": "string",
        "model": "TE-V825",
        "type": null,
        "managementPrefix": "10.2.0.30/28",
        "lanPrefix": "10.2.0.60/28",
        "publicIp": "10.2.0.60",
        "configuredMasterIp": "172.17.2.248",
        "productId": "98a34e46-42af-459c-99ed-e6bc45d28e7e",
        "anyCastEnabled": true,
        "version": "8.6.0"
      },
      {
        "id": 1,
        "name": "member1.localdomain",
        "internalName": "svci-infoblox-b1ce40de-19bc-4e2e-bfe4-bb5a5171",
        "hostName": "member1.localdomain",
        "credentialId": "string",
        "model": "TE-V825",
        "type": null,
        "managementPrefix": "10.2.0.30/28",
        "lanPrefix": "10.2.0.60/28",
        "publicIp": "10.2.0.60",
        "configuredMasterIp": "172.17.2.248",
        "productId": "98a34e46-42af-459c-99ed-e6bc45d28e7e",
        "anyCastEnabled": false,
        "version": "8.6.0"
      },
      {
        "id": 1,
        "name": "member1.localdomain",
        "internalName": "svci-infoblox-b1ce40de-19bc-4e2e-bfe4-bb5a5171",
        "hostName": "member1.localdomain",
        "credentialId": "string",
        "model": "TE-V825",
        "type": null,
        "managementPrefix": "10.2.0.30/28",
        "lanPrefix": "10.2.0.60/28",
        "publicIp": "10.2.0.60",
        "configuredMasterIp": "172.17.2.248",
        "productId": "98a34e46-42af-459c-99ed-e6bc45d28e7e",
        "anyCastEnabled": false,
        "version": "8.6.0"
      },
      {
        "id": 1,
        "name": "member1.localdomain",
        "internalName": "svci-infoblox-b1ce40de-19bc-4e2e-bfe4-bb5a5171",
        "hostName": "member1.localdomain",
        "credentialId": "string",
        "model": "TE-V825",
        "type": null,
        "managementPrefix": "10.2.0.30/28",
        "lanPrefix": "10.2.0.60/28",
        "publicIp": "10.2.0.60",
        "configuredMasterIp": "172.17.2.248",
        "productId": "98a34e46-42af-459c-99ed-e6bc45d28e7e",
        "anyCastEnabled": true,
        "version": "8.6.0"
      }
    ],
    "size": "SMALL"
  },
  {
    "id": 1,
    "name": "blox-us-west",
    "internalName": "svc-infoblox-256d7193-6634-4ff9-bb0e-513fa921",
    "description": "InfoBlox service for the US-WEST region",
    "cxp": null,
    "segments": [
      "HR"
    ],
    "billingTags": [
      1,
      2
    ],
    "globalCidrListId": 5,
    "anycast": {
      "enabled": true,
      "ips": [
        "10.10.10.10"
      ],
      "backupCxps": [
        "US-WEST"
      ]
    },
    "serviceGroupId": 45,
    "serviceGroupName": "blox-us-west-svc-group",
    "gridMaster": {
      "ip": "172.16.1.1",
      "name": "alkira-infoblox",
      "external": true,
      "gridMasterCredentialId": "e61acb8c-c043-11ec-9d64-0242ac120002",
      "sharedSecretCredentialId": "f1083d40-c043-11ec-9d64-0242ac120002"
    },
    "licenseType": null,
    "instances": [
      {
        "id": 1,
        "name": "member1.localdomain",
        "internalName": "svci-infoblox-b1ce40de-19bc-4e2e-bfe4-bb5a5171",
        "hostName": "member1.localdomain",
        "credentialId": "string",
        "model": "TE-V825",
        "type": null,
        "managementPrefix": "10.2.0.30/28",
        "lanPrefix": "10.2.0.60/28",
        "publicIp": "10.2.0.60",
        "configuredMasterIp": "172.17.2.248",
        "productId": "98a34e46-42af-459c-99ed-e6bc45d28e7e",
        "anyCastEnabled": true,
        "version": "8.6.0"
      },
      {
        "id": 1,
        "name": "member1.localdomain",
        "internalName": "svci-infoblox-b1ce40de-19bc-4e2e-bfe4-bb5a5171",
        "hostName": "member1.localdomain",
        "credentialId": "string",
        "model": "TE-V825",
        "type": null,
        "managementPrefix": "10.2.0.30/28",
        "lanPrefix": "10.2.0.60/28",
        "publicIp": "10.2.0.60",
        "configuredMasterIp": "172.17.2.248",
        "productId": "98a34e46-42af-459c-99ed-e6bc45d28e7e",
        "anyCastEnabled": false,
        "version": "8.6.0"
      },
      {
        "id": 1,
        "name": "member1.localdomain",
        "internalName": "svci-infoblox-b1ce40de-19bc-4e2e-bfe4-bb5a5171",
        "hostName": "member1.localdomain",
        "credentialId": "string",
        "model": "TE-V825",
        "type": null,
        "managementPrefix": "10.2.0.30/28",
        "lanPrefix": "10.2.0.60/28",
        "publicIp": "10.2.0.60",
        "configuredMasterIp": "172.17.2.248",
        "productId": "98a34e46-42af-459c-99ed-e6bc45d28e7e",
        "anyCastEnabled": false,
        "version": "8.6.0"
      },
      {
        "id": 1,
        "name": "member1.localdomain",
        "internalName": "svci-infoblox-b1ce40de-19bc-4e2e-bfe4-bb5a5171",
        "hostName": "member1.localdomain",
        "credentialId": "string",
        "model": "TE-V825",
        "type": null,
        "managementPrefix": "10.2.0.30/28",
        "lanPrefix": "10.2.0.60/28",
        "publicIp": "10.2.0.60",
        "configuredMasterIp": "172.17.2.248",
        "productId": "98a34e46-42af-459c-99ed-e6bc45d28e7e",
        "anyCastEnabled": false,
        "version": "8.6.0"
      }
    ],
    "size": "SMALL"
  }
]