[
  {
    "requestId": "1f58cec4-36af-4a0b-aff2-868a4fddb9a8",
    "offset": 1,
    "type": "FLOWCAPTURE_RESPONSE",
    "tenantId": 10,
    "tenantNetworkId": 5,
    "message": null,
    "lastMessage": true,
    "messageTime": 1593640997,
    "requestContext": {}
  },
  {
    "requestId": "1f58cec4-36af-4a0b-aff2-868a4fddb9a8",
    "offset": 1,
    "type": "UNSTRUCTURED",
    "tenantId": 5,
    "tenantNetworkId": 2,
    "message": null,
    "lastMessage": true,
    "messageTime": 1593640997,
    "requestContext": {}
  },
  {
    "requestId": "1f58cec4-36af-4a0b-aff2-868a4fddb9a8",
    "offset": 1,
    "type": "TRACE_ROUTE_RESPONSE",
    "tenantId": 10,
    "tenantNetworkId": 8,
    "message": null,
    "lastMessage": true,
    "messageTime": 1593640997,
    "requestContext": {}
  },
  {
    "requestId": "1f58cec4-36af-4a0b-aff2-868a4fddb9a8",
    "offset": 1,
    "type": "UNSTRUCTURED",
    "tenantId": 7,
    "tenantNetworkId": 8,
    "message": null,
    "lastMessage": true,
    "messageTime": 1593640997,
    "requestContext": {}
  }
]