[
  {
    "connectivityStatus": 1,
    "id": 4,
    "instances": [
      {
        "connectivityStatus": 5,
        "id": 4,
        "segments": "string",
        "status": 8,
        "tunnels": [
          {
            "bgpStatus": 5,
            "segments": "string",
            "tunnelName": "string",
            "tunnelStatus": 9,
            "zoneName": "string"
          },
          {
            "bgpStatus": 10,
            "segments": "string",
            "tunnelName": "string",
            "tunnelStatus": 7,
            "zoneName": "string"
          },
          {
            "bgpStatus": 10,
            "segments": "string",
            "tunnelName": "string",
            "tunnelStatus": 4,
            "zoneName": "string"
          },
          {
            "bgpStatus": 2,
            "segments": "string",
            "tunnelName": "string",
            "tunnelStatus": 1,
            "zoneName": "string"
          },
          {
            "bgpStatus": 2,
            "segments": "string",
            "tunnelName": "string",
            "tunnelStatus": 7,
            "zoneName": "string"
          },
          {
            "bgpStatus": 2,
            "segments": "string",
            "tunnelName": "string",
            "tunnelStatus": 9,
            "zoneName": "string"
          },
          {
            "bgpStatus": 6,
            "segments": "string",
            "tunnelName": "string",
            "tunnelStatus": 5,
            "zoneName": "string"
          },
          {
            "bgpStatus": 5,
            "segments": "string",
            "tunnelName": "string",
            "tunnelStatus": 3,
            "zoneName": "string"
          },
          {
            "bgpStatus": 4,
            "segments": "string",
            "tunnelName": "string",
            "tunnelStatus": 1,
            "zoneName": "string"
          }
        ]
      },
      {
        "connectivityStatus": 2,
        "id": 6,
        "segments": "string",
        "status": 3,
        "tunnels": [
          {
            "bgpStatus": 2,
            "segments": "string",
            "tunnelName": "string",
            "tunnelStatus": 2,
            "zoneName": "string"
          },
          {
            "bgpStatus": 5,
            "segments": "string",
            "tunnelName": "string",
            "tunnelStatus": 1,
            "zoneName": "string"
          },
          {
            "bgpStatus": 1,
            "segments": "string",
            "tunnelName": "string",
            "tunnelStatus": 4,
            "zoneName": "string"
          },
          {
            "bgpStatus": 9,
            "segments": "string",
            "tunnelName": "string",
            "tunnelStatus": 4,
            "zoneName": "string"
          },
          {
            "bgpStatus": 2,
            "segments": "string",
            "tunnelName": "string",
            "tunnelStatus": 6,
            "zoneName": "string"
          },
          {
            "bgpStatus": 2,
            "segments": "string",
            "tunnelName": "string",
            "tunnelStatus": 2,
            "zoneName": "string"
          },
          {
            "bgpStatus": 2,
            "segments": "string",
            "tunnelName": "string",
            "tunnelStatus": 3,
            "zoneName": "string"
          },
          {
            "bgpStatus": 9,
            "segments": "string",
            "tunnelName": "string",
            "tunnelStatus": 5,
            "zoneName": "string"
          }
        ]
      },
      {
        "connectivityStatus": 8,
        "id": 7,
        "segments": "string",
        "status": 10,
        "tunnels": [
          {
            "bgpStatus": 7,
            "segments": "string",
            "tunnelName": "string",
            "tunnelStatus": 6,
            "zoneName": "string"
          },
          {
            "bgpStatus": 6,
            "segments": "string",
            "tunnelName": "string",
            "tunnelStatus": 3,
            "zoneName": "string"
          },
          {
            "bgpStatus": 9,
            "segments": "string",
            "tunnelName": "string",
            "tunnelStatus": 7,
            "zoneName": "string"
          },
          {
            "bgpStatus": 2,
            "segments": "string",
            "tunnelName": "string",
            "tunnelStatus": 3,
            "zoneName": "string"
          },
          {
            "bgpStatus": 6,
            "segments": "string",
            "tunnelName": "string",
            "tunnelStatus": 3,
            "zoneName": "string"
          },
          {
            "bgpStatus": 7,
            "segments": "string",
            "tunnelName": "string",
            "tunnelStatus": 9,
            "zoneName": "string"
          },
          {
            "bgpStatus": 6,
            "segments": "string",
            "tunnelName": "string",
            "tunnelStatus": 6,
            "zoneName": "string"
          },
          {
            "bgpStatus": 10,
            "segments": "string",
            "tunnelName": "string",
            "tunnelStatus": 4,
            "zoneName": "string"
          },
          {
            "bgpStatus": 1,
            "segments": "string",
            "tunnelName": "string",
            "tunnelStatus": 6,
            "zoneName": "string"
          },
          {
            "bgpStatus": 6,
            "segments": "string",
            "tunnelName": "string",
            "tunnelStatus": 6,
            "zoneName": "string"
          }
        ]
      },
      {
        "connectivityStatus": 3,
        "id": 5,
        "segments": "string",
        "status": 3,
        "tunnels": [
          {
            "bgpStatus": 3,
            "segments": "string",
            "tunnelName": "string",
            "tunnelStatus": 3,
            "zoneName": "string"
          },
          {
            "bgpStatus": 7,
            "segments": "string",
            "tunnelName": "string",
            "tunnelStatus": 6,
            "zoneName": "string"
          }
        ]
      },
      {
        "connectivityStatus": 7,
        "id": 6,
        "segments": "string",
        "status": 2,
        "tunnels": [
          {
            "bgpStatus": 5,
            "segments": "string",
            "tunnelName": "string",
            "tunnelStatus": 2,
            "zoneName": "string"
          },
          {
            "bgpStatus": 10,
            "segments": "string",
            "tunnelName": "string",
            "tunnelStatus": 3,
            "zoneName": "string"
          },
          {
            "bgpStatus": 2,
            "segments": "string",
            "tunnelName": "string",
            "tunnelStatus": 4,
            "zoneName": "string"
          },
          {
            "bgpStatus": 7,
            "segments": "string",
            "tunnelName": "string",
            "tunnelStatus": 4,
            "zoneName": "string"
          },
          {
            "bgpStatus": 9,
            "segments": "string",
            "tunnelName": "string",
            "tunnelStatus": 1,
            "zoneName": "string"
          }
        ]
      },
      {
        "connectivityStatus": 1,
        "id": 5,
        "segments": "string",
        "status": 10,
        "tunnels": [
          {
            "bgpStatus": 9,
            "segments": "string",
            "tunnelName": "string",
            "tunnelStatus": 1,
            "zoneName": "string"
          },
          {
            "bgpStatus": 8,
            "segments": "string",
            "tunnelName": "string",
            "tunnelStatus": 9,
            "zoneName": "string"
          },
          {
            "bgpStatus": 6,
            "segments": "string",
            "tunnelName": "string",
            "tunnelStatus": 1,
            "zoneName": "string"
          },
          {
            "bgpStatus": 9,
            "segments": "string",
            "tunnelName": "string",
            "tunnelStatus": 4,
            "zoneName": "string"
          }
        ]
      },
      {
        "connectivityStatus": 6,
        "id": 6,
        "segments": "string",
        "status": 6,
        "tunnels": [
          {
            "bgpStatus": 10,
            "segments": "string",
            "tunnelName": "string",
            "tunnelStatus": 6,
            "zoneName": "string"
          },
          {
            "bgpStatus": 4,
            "segments": "string",
            "tunnelName": "string",
            "tunnelStatus": 9,
            "zoneName": "string"
          }
        ]
      },
      {
        "connectivityStatus": 8,
        "id": 2,
        "segments": "string",
        "status": 4,
        "tunnels": [
          {
            "bgpStatus": 8,
            "segments": "string",
            "tunnelName": "string",
            "tunnelStatus": 10,
            "zoneName": "string"
          },
          {
            "bgpStatus": 6,
            "segments": "string",
            "tunnelName": "string",
            "tunnelStatus": 4,
            "zoneName": "string"
          },
          {
            "bgpStatus": 6,
            "segments": "string",
            "tunnelName": "string",
            "tunnelStatus": 5,
            "zoneName": "string"
          },
          {
            "bgpStatus": 1,
            "segments": "string",
            "tunnelName": "string",
            "tunnelStatus": 1,
            "zoneName": "string"
          }
        ]
      }
    ],
    "segments": "string",
    "status": 1,
    "tunnels": [
      {
        "bgpStatus": 10,
        "segments": "string",
        "tunnelName": "string",
        "tunnelStatus": 2,
        "zoneName": "string"
      },
      {
        "bgpStatus": 2,
        "segments": "string",
        "tunnelName": "string",
        "tunnelStatus": 8,
        "zoneName": "string"
      }
    ],
    "type": "string"
  }
]