[
  {
    "id": 5,
    "internalName": "svc-cscoftdv-089f0f9e-8740-11eb-8dcd-0242ac130003",
    "state": null,
    "name": "My Firewall",
    "globalCidrListId": 10,
    "size": null,
    "credentialId": "02064342-be34-4108-b68a-c67032c46924",
    "cxp": null,
    "managementServer": {
      "ipAddress": "10.0.0.1",
      "segment": "HR",
      "segmentId": 3
    },
    "servicesIpAllowList": [
      "10.2.0.2",
      "10.2.0.3"
    ],
    "instances": [
      {
        "id": 1,
        "licenseType": null,
        "state": null,
        "hostName": "string",
        "internalName": "svci-cscoftdv-fd514a8a-873f-11eb-8dcd-0242ac130003",
        "credentialId": "d6a75232-b964-4892-83cc-e013f3dde33d",
        "version": "7.1.0-92"
      },
      {
        "id": 1,
        "licenseType": null,
        "state": null,
        "hostName": "string",
        "internalName": "svci-cscoftdv-fd514a8a-873f-11eb-8dcd-0242ac130003",
        "credentialId": "d6a75232-b964-4892-83cc-e013f3dde33d",
        "version": "7.1.0-92"
      },
      {
        "id": 1,
        "licenseType": null,
        "state": null,
        "hostName": "string",
        "internalName": "svci-cscoftdv-fd514a8a-873f-11eb-8dcd-0242ac130003",
        "credentialId": "d6a75232-b964-4892-83cc-e013f3dde33d",
        "version": "7.1.0-92"
      }
    ],
    "minInstanceCount": 9,
    "maxInstanceCount": 9,
    "segments": [
      "HR",
      "ENG"
    ],
    "segmentOptions": {
      "ENG": {
        "segmentId": 1,
        "zonesToGroups": {
          "DEFAULT": [
            "G1"
          ]
        }
      }
    },
    "billingTags": [
      903
    ],
    "tunnelProtocol": "IPSEC",
    "autoScale": null
  },
  {
    "id": 1,
    "internalName": "svc-cscoftdv-089f0f9e-8740-11eb-8dcd-0242ac130003",
    "state": null,
    "name": "My Firewall",
    "globalCidrListId": 10,
    "size": null,
    "credentialId": "02064342-be34-4108-b68a-c67032c46924",
    "cxp": null,
    "managementServer": {
      "ipAddress": "10.0.0.1",
      "segment": "HR",
      "segmentId": 4
    },
    "servicesIpAllowList": [
      "10.2.0.2",
      "10.2.0.3"
    ],
    "instances": [
      {
        "id": 1,
        "licenseType": null,
        "state": null,
        "hostName": "string",
        "internalName": "svci-cscoftdv-fd514a8a-873f-11eb-8dcd-0242ac130003",
        "credentialId": "d6a75232-b964-4892-83cc-e013f3dde33d",
        "version": "7.1.0-92"
      },
      {
        "id": 1,
        "licenseType": null,
        "state": null,
        "hostName": "string",
        "internalName": "svci-cscoftdv-fd514a8a-873f-11eb-8dcd-0242ac130003",
        "credentialId": "d6a75232-b964-4892-83cc-e013f3dde33d",
        "version": "7.1.0-92"
      },
      {
        "id": 1,
        "licenseType": null,
        "state": null,
        "hostName": "string",
        "internalName": "svci-cscoftdv-fd514a8a-873f-11eb-8dcd-0242ac130003",
        "credentialId": "d6a75232-b964-4892-83cc-e013f3dde33d",
        "version": "7.1.0-92"
      },
      {
        "id": 1,
        "licenseType": null,
        "state": null,
        "hostName": "string",
        "internalName": "svci-cscoftdv-fd514a8a-873f-11eb-8dcd-0242ac130003",
        "credentialId": "d6a75232-b964-4892-83cc-e013f3dde33d",
        "version": "7.1.0-92"
      },
      {
        "id": 1,
        "licenseType": null,
        "state": null,
        "hostName": "string",
        "internalName": "svci-cscoftdv-fd514a8a-873f-11eb-8dcd-0242ac130003",
        "credentialId": "d6a75232-b964-4892-83cc-e013f3dde33d",
        "version": "7.1.0-92"
      },
      {
        "id": 1,
        "licenseType": null,
        "state": null,
        "hostName": "string",
        "internalName": "svci-cscoftdv-fd514a8a-873f-11eb-8dcd-0242ac130003",
        "credentialId": "d6a75232-b964-4892-83cc-e013f3dde33d",
        "version": "7.1.0-92"
      }
    ],
    "minInstanceCount": 2,
    "maxInstanceCount": 5,
    "segments": [
      "HR",
      "ENG"
    ],
    "segmentOptions": {
      "ENG": {
        "segmentId": 1,
        "zonesToGroups": {
          "DEFAULT": [
            "G1"
          ]
        }
      }
    },
    "billingTags": [
      903
    ],
    "tunnelProtocol": "IPSEC",
    "autoScale": null
  },
  {
    "id": 4,
    "internalName": "svc-cscoftdv-089f0f9e-8740-11eb-8dcd-0242ac130003",
    "state": null,
    "name": "My Firewall",
    "globalCidrListId": 10,
    "size": null,
    "credentialId": "02064342-be34-4108-b68a-c67032c46924",
    "cxp": null,
    "managementServer": {
      "ipAddress": "10.0.0.1",
      "segment": "HR",
      "segmentId": 8
    },
    "servicesIpAllowList": [
      "10.2.0.2",
      "10.2.0.3"
    ],
    "instances": [
      {
        "id": 1,
        "licenseType": null,
        "state": null,
        "hostName": "string",
        "internalName": "svci-cscoftdv-fd514a8a-873f-11eb-8dcd-0242ac130003",
        "credentialId": "d6a75232-b964-4892-83cc-e013f3dde33d",
        "version": "7.1.0-92"
      },
      {
        "id": 1,
        "licenseType": null,
        "state": null,
        "hostName": "string",
        "internalName": "svci-cscoftdv-fd514a8a-873f-11eb-8dcd-0242ac130003",
        "credentialId": "d6a75232-b964-4892-83cc-e013f3dde33d",
        "version": "7.1.0-92"
      },
      {
        "id": 1,
        "licenseType": null,
        "state": null,
        "hostName": "string",
        "internalName": "svci-cscoftdv-fd514a8a-873f-11eb-8dcd-0242ac130003",
        "credentialId": "d6a75232-b964-4892-83cc-e013f3dde33d",
        "version": "7.1.0-92"
      },
      {
        "id": 1,
        "licenseType": null,
        "state": null,
        "hostName": "string",
        "internalName": "svci-cscoftdv-fd514a8a-873f-11eb-8dcd-0242ac130003",
        "credentialId": "d6a75232-b964-4892-83cc-e013f3dde33d",
        "version": "7.1.0-92"
      }
    ],
    "minInstanceCount": 5,
    "maxInstanceCount": 4,
    "segments": [
      "HR",
      "ENG"
    ],
    "segmentOptions": {
      "ENG": {
        "segmentId": 1,
        "zonesToGroups": {
          "DEFAULT": [
            "G1"
          ]
        }
      }
    },
    "billingTags": [
      903
    ],
    "tunnelProtocol": "IPSEC",
    "autoScale": null
  }
]