[
  {
    "id": 2,
    "tenantId": 3,
    "tenantNetworkId": 2,
    "description": "string",
    "encodedTags": [
      "string",
      "string",
      "string",
      "string",
      "string",
      "string",
      "string",
      "string",
      "string"
    ],
    "firewallZoneIds": [
      10,
      8,
      4,
      7
    ],
    "internalName": "string",
    "name": "string",
    "systemGenerated": false,
    "tags": [
      5
    ],
    "type": null
  },
  {
    "id": 5,
    "tenantId": 1,
    "tenantNetworkId": 8,
    "description": "string",
    "encodedTags": [
      "string",
      "string",
      "string",
      "string",
      "string",
      "string",
      "string",
      "string",
      "string"
    ],
    "firewallZoneIds": [
      4,
      1,
      3,
      9,
      5,
      6,
      1,
      3
    ],
    "internalName": "string",
    "name": "string",
    "systemGenerated": false,
    "tags": [
      3,
      1,
      5,
      8,
      9,
      10,
      7,
      6,
      9
    ],
    "type": null
  },
  {
    "id": 8,
    "tenantId": 9,
    "tenantNetworkId": 8,
    "description": "string",
    "encodedTags": [
      "string",
      "string",
      "string",
      "string",
      "string",
      "string"
    ],
    "firewallZoneIds": [
      9,
      3,
      9
    ],
    "internalName": "string",
    "name": "string",
    "systemGenerated": true,
    "tags": [
      5,
      8,
      9,
      7,
      4,
      8,
      9,
      7
    ],
    "type": null
  }
]