[
  {
    "id": 1,
    "tenantId": 1234,
    "tenantNetworkId": 1234,
    "name": "connector1",
    "internalName": "string",
    "description": "hadoop clusters",
    "cxp": null,
    "cxpId": "5c003a92-77df-11ec-90d6-0242ac120003",
    "type": null,
    "productId": "47709960-77e3-11ec-90d6-0242ac120003",
    "group": "INTERNAL",
    "groupId": 76,
    "tagId": 47,
    "implicitGroupId": 32,
    "segments": [
      "ENGG"
    ],
    "segmentIds": [
      55
    ],
    "segmentOptions": {},
    "extraAttributes": {},
    "instances": [
      {
        "id": 44,
        "name": "test",
        "tenantId": 1234,
        "tenantNetworkId": 1234,
        "connectorId": 1,
        "productId": "e504d25e-77e3-11ec-90d6-0242ac120003",
        "state": {},
        "internalName": "coni-sd_wan-0cfa42bc-04ed-4da2-afae-43327c3d",
        "docState": {},
        "deletedAt": 1642458243000,
        "configAvailable": true,
        "enableTunnelRedundancy": true,
        "billingTags": [
          1,
          2
        ],
        "extraAttributes": {}
      }
    ],
    "state": {},
    "size": null,
    "asn": 65512,
    "docState": {},
    "deletedAt": -1,
    "lastProvisionedAt": 1657063116,
    "lastEnabled": 1657063116,
    "lastConfigUpdatedAt": 1657061851242,
    "configDownloadedAt": 1657070000,
    "configAvailable": true,
    "billingTags": [
      1,
      2
    ]
  },
  {
    "id": 1,
    "tenantId": 1234,
    "tenantNetworkId": 1234,
    "name": "connector1",
    "internalName": "string",
    "description": "hadoop clusters",
    "cxp": null,
    "cxpId": "5c003a92-77df-11ec-90d6-0242ac120003",
    "type": null,
    "productId": "47709960-77e3-11ec-90d6-0242ac120003",
    "group": "INTERNAL",
    "groupId": 76,
    "tagId": 47,
    "implicitGroupId": 32,
    "segments": [
      "ENGG"
    ],
    "segmentIds": [
      55
    ],
    "segmentOptions": {},
    "extraAttributes": {},
    "instances": [
      {
        "id": 44,
        "name": "test",
        "tenantId": 1234,
        "tenantNetworkId": 1234,
        "connectorId": 1,
        "productId": "e504d25e-77e3-11ec-90d6-0242ac120003",
        "state": {},
        "internalName": "coni-sd_wan-0cfa42bc-04ed-4da2-afae-43327c3d",
        "docState": {},
        "deletedAt": 1642458243000,
        "configAvailable": true,
        "enableTunnelRedundancy": false,
        "billingTags": [
          1,
          2
        ],
        "extraAttributes": {}
      },
      {
        "id": 44,
        "name": "test",
        "tenantId": 1234,
        "tenantNetworkId": 1234,
        "connectorId": 1,
        "productId": "e504d25e-77e3-11ec-90d6-0242ac120003",
        "state": {},
        "internalName": "coni-sd_wan-0cfa42bc-04ed-4da2-afae-43327c3d",
        "docState": {},
        "deletedAt": 1642458243000,
        "configAvailable": true,
        "enableTunnelRedundancy": false,
        "billingTags": [
          1,
          2
        ],
        "extraAttributes": {}
      },
      {
        "id": 44,
        "name": "test",
        "tenantId": 1234,
        "tenantNetworkId": 1234,
        "connectorId": 1,
        "productId": "e504d25e-77e3-11ec-90d6-0242ac120003",
        "state": {},
        "internalName": "coni-sd_wan-0cfa42bc-04ed-4da2-afae-43327c3d",
        "docState": {},
        "deletedAt": 1642458243000,
        "configAvailable": true,
        "enableTunnelRedundancy": true,
        "billingTags": [
          1,
          2
        ],
        "extraAttributes": {}
      },
      {
        "id": 44,
        "name": "test",
        "tenantId": 1234,
        "tenantNetworkId": 1234,
        "connectorId": 1,
        "productId": "e504d25e-77e3-11ec-90d6-0242ac120003",
        "state": {},
        "internalName": "coni-sd_wan-0cfa42bc-04ed-4da2-afae-43327c3d",
        "docState": {},
        "deletedAt": 1642458243000,
        "configAvailable": true,
        "enableTunnelRedundancy": false,
        "billingTags": [
          1,
          2
        ],
        "extraAttributes": {}
      },
      {
        "id": 44,
        "name": "test",
        "tenantId": 1234,
        "tenantNetworkId": 1234,
        "connectorId": 1,
        "productId": "e504d25e-77e3-11ec-90d6-0242ac120003",
        "state": {},
        "internalName": "coni-sd_wan-0cfa42bc-04ed-4da2-afae-43327c3d",
        "docState": {},
        "deletedAt": 1642458243000,
        "configAvailable": true,
        "enableTunnelRedundancy": false,
        "billingTags": [
          1,
          2
        ],
        "extraAttributes": {}
      },
      {
        "id": 44,
        "name": "test",
        "tenantId": 1234,
        "tenantNetworkId": 1234,
        "connectorId": 1,
        "productId": "e504d25e-77e3-11ec-90d6-0242ac120003",
        "state": {},
        "internalName": "coni-sd_wan-0cfa42bc-04ed-4da2-afae-43327c3d",
        "docState": {},
        "deletedAt": 1642458243000,
        "configAvailable": true,
        "enableTunnelRedundancy": true,
        "billingTags": [
          1,
          2
        ],
        "extraAttributes": {}
      }
    ],
    "state": {},
    "size": null,
    "asn": 65512,
    "docState": {},
    "deletedAt": -1,
    "lastProvisionedAt": 1657063116,
    "lastEnabled": 1657063116,
    "lastConfigUpdatedAt": 1657061851242,
    "configDownloadedAt": 1657070000,
    "configAvailable": true,
    "billingTags": [
      1,
      2
    ]
  },
  {
    "id": 1,
    "tenantId": 1234,
    "tenantNetworkId": 1234,
    "name": "connector1",
    "internalName": "string",
    "description": "hadoop clusters",
    "cxp": null,
    "cxpId": "5c003a92-77df-11ec-90d6-0242ac120003",
    "type": null,
    "productId": "47709960-77e3-11ec-90d6-0242ac120003",
    "group": "INTERNAL",
    "groupId": 76,
    "tagId": 47,
    "implicitGroupId": 32,
    "segments": [
      "ENGG"
    ],
    "segmentIds": [
      55
    ],
    "segmentOptions": {},
    "extraAttributes": {},
    "instances": [
      {
        "id": 44,
        "name": "test",
        "tenantId": 1234,
        "tenantNetworkId": 1234,
        "connectorId": 1,
        "productId": "e504d25e-77e3-11ec-90d6-0242ac120003",
        "state": {},
        "internalName": "coni-sd_wan-0cfa42bc-04ed-4da2-afae-43327c3d",
        "docState": {},
        "deletedAt": 1642458243000,
        "configAvailable": true,
        "enableTunnelRedundancy": false,
        "billingTags": [
          1,
          2
        ],
        "extraAttributes": {}
      },
      {
        "id": 44,
        "name": "test",
        "tenantId": 1234,
        "tenantNetworkId": 1234,
        "connectorId": 1,
        "productId": "e504d25e-77e3-11ec-90d6-0242ac120003",
        "state": {},
        "internalName": "coni-sd_wan-0cfa42bc-04ed-4da2-afae-43327c3d",
        "docState": {},
        "deletedAt": 1642458243000,
        "configAvailable": true,
        "enableTunnelRedundancy": true,
        "billingTags": [
          1,
          2
        ],
        "extraAttributes": {}
      },
      {
        "id": 44,
        "name": "test",
        "tenantId": 1234,
        "tenantNetworkId": 1234,
        "connectorId": 1,
        "productId": "e504d25e-77e3-11ec-90d6-0242ac120003",
        "state": {},
        "internalName": "coni-sd_wan-0cfa42bc-04ed-4da2-afae-43327c3d",
        "docState": {},
        "deletedAt": 1642458243000,
        "configAvailable": true,
        "enableTunnelRedundancy": false,
        "billingTags": [
          1,
          2
        ],
        "extraAttributes": {}
      },
      {
        "id": 44,
        "name": "test",
        "tenantId": 1234,
        "tenantNetworkId": 1234,
        "connectorId": 1,
        "productId": "e504d25e-77e3-11ec-90d6-0242ac120003",
        "state": {},
        "internalName": "coni-sd_wan-0cfa42bc-04ed-4da2-afae-43327c3d",
        "docState": {},
        "deletedAt": 1642458243000,
        "configAvailable": true,
        "enableTunnelRedundancy": true,
        "billingTags": [
          1,
          2
        ],
        "extraAttributes": {}
      },
      {
        "id": 44,
        "name": "test",
        "tenantId": 1234,
        "tenantNetworkId": 1234,
        "connectorId": 1,
        "productId": "e504d25e-77e3-11ec-90d6-0242ac120003",
        "state": {},
        "internalName": "coni-sd_wan-0cfa42bc-04ed-4da2-afae-43327c3d",
        "docState": {},
        "deletedAt": 1642458243000,
        "configAvailable": true,
        "enableTunnelRedundancy": true,
        "billingTags": [
          1,
          2
        ],
        "extraAttributes": {}
      }
    ],
    "state": {},
    "size": null,
    "asn": 65512,
    "docState": {},
    "deletedAt": -1,
    "lastProvisionedAt": 1657063116,
    "lastEnabled": 1657063116,
    "lastConfigUpdatedAt": 1657061851242,
    "configDownloadedAt": 1657070000,
    "configAvailable": true,
    "billingTags": [
      1,
      2
    ]
  }
]