[
  {
    "id": 2,
    "name": "string",
    "description": "string",
    "values": [
      "string",
      "string"
    ],
    "lastConfigUpdatedAt": 8
  },
  {
    "id": 3,
    "name": "string",
    "description": "string",
    "values": [
      "string",
      "string",
      "string",
      "string",
      "string",
      "string",
      "string",
      "string",
      "string",
      "string"
    ],
    "lastConfigUpdatedAt": 8
  },
  {
    "id": 3,
    "name": "string",
    "description": "string",
    "values": [
      "string",
      "string",
      "string",
      "string"
    ],
    "lastConfigUpdatedAt": 10
  }
]