[
  {
    "id": 1234,
    "name": "East-NAT-Policy",
    "description": "NAT policy",
    "type": null,
    "segment": "Seg1",
    "segmentId": 1,
    "includedGroups": [
      2
    ],
    "excludedGroups": [
      1
    ],
    "natRuleIds": [
      1
    ],
    "docState": {},
    "state": {},
    "previousState": {},
    "lastConfigUpdatedAt": 1628615448831,
    "updatedBy": "username"
  },
  {
    "id": 1234,
    "name": "East-NAT-Policy",
    "description": "NAT policy",
    "type": null,
    "segment": "Seg1",
    "segmentId": 1,
    "includedGroups": [
      2
    ],
    "excludedGroups": [
      1
    ],
    "natRuleIds": [
      1
    ],
    "docState": {},
    "state": {},
    "previousState": {},
    "lastConfigUpdatedAt": 1628615448831,
    "updatedBy": "username"
  }
]