[
  {
    "id": 107,
    "name": "string",
    "description": "string",
    "values": [
      "10.1.1.0/24"
    ],
    "tags": [
      "INFOBLOX"
    ],
    "cxp": null
  },
  {
    "id": 107,
    "name": "string",
    "description": "string",
    "values": [
      "10.1.1.0/24"
    ],
    "tags": [
      "INFOBLOX"
    ],
    "cxp": null
  },
  {
    "id": 107,
    "name": "string",
    "description": "string",
    "values": [
      "10.1.1.0/24"
    ],
    "tags": [
      "INFOBLOX"
    ],
    "cxp": null
  },
  {
    "id": 107,
    "name": "string",
    "description": "string",
    "values": [
      "10.1.1.0/24"
    ],
    "tags": [
      "INFOBLOX"
    ],
    "cxp": null
  }
]