{
  "$id": "schema.json",
  "type": "object",
  "schema": "http://json-schema.org/draft-07/schema#",
  "translate": true,
  "dynamicfields": true,
  "properties": {
    "ph_request_type": {
      "type": "string",
      "description": "type of request (internal to adapter)",
      "default": "getGlobalCidrLists",
      "enum": [
        "getGlobalCidrLists",
        "createGlobalCidrList",
        "getGlobalCidrList",
        "updateGlobalCidrList",
        "deleteGlobalCidrList"
      ],
      "external_name": "ph_request_type"
    },
    "globalCidrListId": {
      "type": "number",
      "description": "A unique identifier for a &#39;GlobalCidrList&#39;",
      "parse": false,
      "encode": false,
      "encrypt": {
        "type": "AES",
        "key": ""
      },
      "external_name": "GlobalCidrListId"
    }
  },
  "definitions": {}
}