{
  "actions": [
    {
      "name": "getTenantPreferences",
      "protocol": "REST",
      "method": "GET",
      "entitypath": "{base_path}/{version}/tenants/{pathv1}/preferences?{query}",
      "requestSchema": "schema.json",
      "responseSchema": "schema.json",
      "timeout": 0,
      "sendEmpty": false,
      "sendGetBody": false,
      "requestDatatype": "JSON",
      "responseDatatype": "JSON",
      "headers": {},
      "responseObjects": [
        {
          "type": "default",
          "key": "",
          "mockFile": "mockdatafiles/getTenantPreferences-default.json"
        }
      ]
    },
    {
      "name": "updateTenantPreferences",
      "protocol": "REST",
      "method": "PUT",
      "entitypath": "{base_path}/{version}/tenants/{pathv1}/preferences?{query}",
      "requestSchema": "schema.json",
      "responseSchema": "schema.json",
      "timeout": 0,
      "sendEmpty": false,
      "requestDatatype": "JSON",
      "responseDatatype": "JSON",
      "headers": {},
      "responseObjects": [
        {
          "type": "default",
          "key": "",
          "mockFile": ""
        }
      ]
    }
  ]
}