[
  {
    "id": 4,
    "name": "string",
    "description": "string",
    "internalName": "string",
    "tenantId": 1,
    "tenantNetworkId": 4,
    "type": null,
    "rulelistId": 5,
    "segmentIds": [
      null,
      null,
      null,
      null,
      null,
      null,
      null
    ],
    "fromGroups": [
      null,
      null,
      null,
      null,
      null,
      null
    ],
    "toGroups": [
      null,
      null,
      null,
      null,
      null,
      null
    ],
    "enabled": false,
    "state": {},
    "lastUpdatedDate": "string",
    "docSate": {},
    "updatedBy": "string"
  }
]