[
  {
    "requestId": "1f58cec4-36af-4a0b-aff2-868a4fddb9a8",
    "offset": 1,
    "type": "TRACE_ROUTE_RESPONSE",
    "tenantId": 9,
    "tenantNetworkId": 6,
    "message": null,
    "lastMessage": true,
    "messageTime": 1593640997,
    "requestContext": {}
  },
  {
    "requestId": "1f58cec4-36af-4a0b-aff2-868a4fddb9a8",
    "offset": 1,
    "type": "FLOWCAPTURE_RESPONSE",
    "tenantId": 1,
    "tenantNetworkId": 10,
    "message": null,
    "lastMessage": false,
    "messageTime": 1593640997,
    "requestContext": {}
  },
  {
    "requestId": "1f58cec4-36af-4a0b-aff2-868a4fddb9a8",
    "offset": 1,
    "type": "FLOWCAPTURE_RESPONSE",
    "tenantId": 5,
    "tenantNetworkId": 7,
    "message": null,
    "lastMessage": true,
    "messageTime": 1593640997,
    "requestContext": {}
  }
]