{
  "id": 10,
  "templateId": 1,
  "name": "remote-access-connector-US-WEST-1-RemoteUserAccess",
  "internalName": "con-remote_a-4f8a090f-048f-4c59-ac0b-2d1b0d66",
  "cxp": null,
  "tagId": 1234,
  "size": null,
  "billingTags": [
    6,
    9
  ],
  "segments": [
    "HR"
  ],
  "segmentIds": [
    32
  ],
  "segmentOptions": [
    {
      "name": "eng",
      "userGroupMappings": [
        {
          "billingTag": 1234,
          "groupId": 1,
          "name": "VPN-Eng-Users",
          "prefixListId": 1234,
          "routingTagId": 1234,
          "splitTunneling": true,
          "subnets": [
            "string",
            "string",
            "string",
            "string",
            "string"
          ],
          "userGroupId": "990e721d-bac9-41a0-a598-96aae1b85652"
        },
        {
          "billingTag": 1234,
          "groupId": 1,
          "name": "VPN-Eng-Users",
          "prefixListId": 1234,
          "routingTagId": 1234,
          "splitTunneling": true,
          "subnets": [
            "string",
            "string",
            "string",
            "string",
            "string",
            "string",
            "string",
            "string"
          ],
          "userGroupId": "990e721d-bac9-41a0-a598-96aae1b85652"
        },
        {
          "billingTag": 1234,
          "groupId": 1,
          "name": "VPN-Eng-Users",
          "prefixListId": 1234,
          "routingTagId": 1234,
          "splitTunneling": true,
          "subnets": [
            "string",
            "string",
            "string",
            "string",
            "string",
            "string",
            "string"
          ],
          "userGroupId": "990e721d-bac9-41a0-a598-96aae1b85652"
        },
        {
          "billingTag": 1234,
          "groupId": 1,
          "name": "VPN-Eng-Users",
          "prefixListId": 1234,
          "routingTagId": 1234,
          "splitTunneling": true,
          "subnets": [
            "string",
            "string",
            "string",
            "string",
            "string",
            "string",
            "string",
            "string"
          ],
          "userGroupId": "990e721d-bac9-41a0-a598-96aae1b85652"
        },
        {
          "billingTag": 1234,
          "groupId": 1,
          "name": "VPN-Eng-Users",
          "prefixListId": 1234,
          "routingTagId": 1234,
          "splitTunneling": true,
          "subnets": [
            "string",
            "string",
            "string",
            "string",
            "string",
            "string"
          ],
          "userGroupId": "990e721d-bac9-41a0-a598-96aae1b85652"
        },
        {
          "billingTag": 1234,
          "groupId": 1,
          "name": "VPN-Eng-Users",
          "prefixListId": 1234,
          "routingTagId": 1234,
          "splitTunneling": true,
          "subnets": [
            "string",
            "string"
          ],
          "userGroupId": "990e721d-bac9-41a0-a598-96aae1b85652"
        },
        {
          "billingTag": 1234,
          "groupId": 1,
          "name": "VPN-Eng-Users",
          "prefixListId": 1234,
          "routingTagId": 1234,
          "splitTunneling": true,
          "subnets": [
            "string",
            "string",
            "string"
          ],
          "userGroupId": "990e721d-bac9-41a0-a598-96aae1b85652"
        }
      ]
    },
    {
      "name": "eng",
      "userGroupMappings": [
        {
          "billingTag": 1234,
          "groupId": 1,
          "name": "VPN-Eng-Users",
          "prefixListId": 1234,
          "routingTagId": 1234,
          "splitTunneling": true,
          "subnets": [
            "string",
            "string",
            "string",
            "string"
          ],
          "userGroupId": "990e721d-bac9-41a0-a598-96aae1b85652"
        },
        {
          "billingTag": 1234,
          "groupId": 1,
          "name": "VPN-Eng-Users",
          "prefixListId": 1234,
          "routingTagId": 1234,
          "splitTunneling": true,
          "subnets": [
            "string",
            "string",
            "string",
            "string",
            "string",
            "string"
          ],
          "userGroupId": "990e721d-bac9-41a0-a598-96aae1b85652"
        },
        {
          "billingTag": 1234,
          "groupId": 1,
          "name": "VPN-Eng-Users",
          "prefixListId": 1234,
          "routingTagId": 1234,
          "splitTunneling": true,
          "subnets": [
            "string",
            "string",
            "string",
            "string",
            "string",
            "string",
            "string",
            "string",
            "string",
            "string"
          ],
          "userGroupId": "990e721d-bac9-41a0-a598-96aae1b85652"
        },
        {
          "billingTag": 1234,
          "groupId": 1,
          "name": "VPN-Eng-Users",
          "prefixListId": 1234,
          "routingTagId": 1234,
          "splitTunneling": true,
          "subnets": [
            "string",
            "string",
            "string",
            "string",
            "string",
            "string"
          ],
          "userGroupId": "990e721d-bac9-41a0-a598-96aae1b85652"
        },
        {
          "billingTag": 1234,
          "groupId": 1,
          "name": "VPN-Eng-Users",
          "prefixListId": 1234,
          "routingTagId": 1234,
          "splitTunneling": true,
          "subnets": [
            "string",
            "string",
            "string"
          ],
          "userGroupId": "990e721d-bac9-41a0-a598-96aae1b85652"
        },
        {
          "billingTag": 1234,
          "groupId": 1,
          "name": "VPN-Eng-Users",
          "prefixListId": 1234,
          "routingTagId": 1234,
          "splitTunneling": true,
          "subnets": [
            "string",
            "string",
            "string",
            "string",
            "string"
          ],
          "userGroupId": "990e721d-bac9-41a0-a598-96aae1b85652"
        },
        {
          "billingTag": 1234,
          "groupId": 1,
          "name": "VPN-Eng-Users",
          "prefixListId": 1234,
          "routingTagId": 1234,
          "splitTunneling": true,
          "subnets": [
            "string"
          ],
          "userGroupId": "990e721d-bac9-41a0-a598-96aae1b85652"
        },
        {
          "billingTag": 1234,
          "groupId": 1,
          "name": "VPN-Eng-Users",
          "prefixListId": 1234,
          "routingTagId": 1234,
          "splitTunneling": true,
          "subnets": [
            "string",
            "string",
            "string",
            "string",
            "string",
            "string",
            "string"
          ],
          "userGroupId": "990e721d-bac9-41a0-a598-96aae1b85652"
        },
        {
          "billingTag": 1234,
          "groupId": 1,
          "name": "VPN-Eng-Users",
          "prefixListId": 1234,
          "routingTagId": 1234,
          "splitTunneling": true,
          "subnets": [
            "string",
            "string",
            "string",
            "string",
            "string",
            "string"
          ],
          "userGroupId": "990e721d-bac9-41a0-a598-96aae1b85652"
        },
        {
          "billingTag": 1234,
          "groupId": 1,
          "name": "VPN-Eng-Users",
          "prefixListId": 1234,
          "routingTagId": 1234,
          "splitTunneling": true,
          "subnets": [
            "string",
            "string",
            "string",
            "string",
            "string",
            "string",
            "string",
            "string",
            "string",
            "string"
          ],
          "userGroupId": "990e721d-bac9-41a0-a598-96aae1b85652"
        }
      ]
    },
    {
      "name": "eng",
      "userGroupMappings": [
        {
          "billingTag": 1234,
          "groupId": 1,
          "name": "VPN-Eng-Users",
          "prefixListId": 1234,
          "routingTagId": 1234,
          "splitTunneling": true,
          "subnets": [
            "string",
            "string",
            "string",
            "string",
            "string",
            "string",
            "string",
            "string"
          ],
          "userGroupId": "990e721d-bac9-41a0-a598-96aae1b85652"
        },
        {
          "billingTag": 1234,
          "groupId": 1,
          "name": "VPN-Eng-Users",
          "prefixListId": 1234,
          "routingTagId": 1234,
          "splitTunneling": true,
          "subnets": [
            "string",
            "string",
            "string"
          ],
          "userGroupId": "990e721d-bac9-41a0-a598-96aae1b85652"
        }
      ]
    },
    {
      "name": "eng",
      "userGroupMappings": [
        {
          "billingTag": 1234,
          "groupId": 1,
          "name": "VPN-Eng-Users",
          "prefixListId": 1234,
          "routingTagId": 1234,
          "splitTunneling": true,
          "subnets": [
            "string",
            "string",
            "string",
            "string",
            "string",
            "string",
            "string",
            "string"
          ],
          "userGroupId": "990e721d-bac9-41a0-a598-96aae1b85652"
        },
        {
          "billingTag": 1234,
          "groupId": 1,
          "name": "VPN-Eng-Users",
          "prefixListId": 1234,
          "routingTagId": 1234,
          "splitTunneling": true,
          "subnets": [
            "string",
            "string",
            "string",
            "string",
            "string",
            "string",
            "string"
          ],
          "userGroupId": "990e721d-bac9-41a0-a598-96aae1b85652"
        },
        {
          "billingTag": 1234,
          "groupId": 1,
          "name": "VPN-Eng-Users",
          "prefixListId": 1234,
          "routingTagId": 1234,
          "splitTunneling": true,
          "subnets": [
            "string",
            "string",
            "string",
            "string",
            "string",
            "string",
            "string",
            "string",
            "string",
            "string"
          ],
          "userGroupId": "990e721d-bac9-41a0-a598-96aae1b85652"
        },
        {
          "billingTag": 1234,
          "groupId": 1,
          "name": "VPN-Eng-Users",
          "prefixListId": 1234,
          "routingTagId": 1234,
          "splitTunneling": true,
          "subnets": [
            "string",
            "string",
            "string",
            "string",
            "string"
          ],
          "userGroupId": "990e721d-bac9-41a0-a598-96aae1b85652"
        },
        {
          "billingTag": 1234,
          "groupId": 1,
          "name": "VPN-Eng-Users",
          "prefixListId": 1234,
          "routingTagId": 1234,
          "splitTunneling": true,
          "subnets": [
            "string",
            "string",
            "string",
            "string"
          ],
          "userGroupId": "990e721d-bac9-41a0-a598-96aae1b85652"
        },
        {
          "billingTag": 1234,
          "groupId": 1,
          "name": "VPN-Eng-Users",
          "prefixListId": 1234,
          "routingTagId": 1234,
          "splitTunneling": true,
          "subnets": [
            "string",
            "string",
            "string",
            "string",
            "string"
          ],
          "userGroupId": "990e721d-bac9-41a0-a598-96aae1b85652"
        },
        {
          "billingTag": 1234,
          "groupId": 1,
          "name": "VPN-Eng-Users",
          "prefixListId": 1234,
          "routingTagId": 1234,
          "splitTunneling": true,
          "subnets": [
            "string",
            "string",
            "string",
            "string",
            "string",
            "string"
          ],
          "userGroupId": "990e721d-bac9-41a0-a598-96aae1b85652"
        },
        {
          "billingTag": 1234,
          "groupId": 1,
          "name": "VPN-Eng-Users",
          "prefixListId": 1234,
          "routingTagId": 1234,
          "splitTunneling": true,
          "subnets": [
            "string",
            "string",
            "string",
            "string"
          ],
          "userGroupId": "990e721d-bac9-41a0-a598-96aae1b85652"
        },
        {
          "billingTag": 1234,
          "groupId": 1,
          "name": "VPN-Eng-Users",
          "prefixListId": 1234,
          "routingTagId": 1234,
          "splitTunneling": true,
          "subnets": [
            "string",
            "string",
            "string",
            "string"
          ],
          "userGroupId": "990e721d-bac9-41a0-a598-96aae1b85652"
        }
      ]
    },
    {
      "name": "eng",
      "userGroupMappings": [
        {
          "billingTag": 1234,
          "groupId": 1,
          "name": "VPN-Eng-Users",
          "prefixListId": 1234,
          "routingTagId": 1234,
          "splitTunneling": true,
          "subnets": [
            "string",
            "string",
            "string",
            "string",
            "string",
            "string"
          ],
          "userGroupId": "990e721d-bac9-41a0-a598-96aae1b85652"
        },
        {
          "billingTag": 1234,
          "groupId": 1,
          "name": "VPN-Eng-Users",
          "prefixListId": 1234,
          "routingTagId": 1234,
          "splitTunneling": true,
          "subnets": [
            "string",
            "string",
            "string"
          ],
          "userGroupId": "990e721d-bac9-41a0-a598-96aae1b85652"
        },
        {
          "billingTag": 1234,
          "groupId": 1,
          "name": "VPN-Eng-Users",
          "prefixListId": 1234,
          "routingTagId": 1234,
          "splitTunneling": true,
          "subnets": [
            "string"
          ],
          "userGroupId": "990e721d-bac9-41a0-a598-96aae1b85652"
        },
        {
          "billingTag": 1234,
          "groupId": 1,
          "name": "VPN-Eng-Users",
          "prefixListId": 1234,
          "routingTagId": 1234,
          "splitTunneling": true,
          "subnets": [
            "string",
            "string",
            "string"
          ],
          "userGroupId": "990e721d-bac9-41a0-a598-96aae1b85652"
        },
        {
          "billingTag": 1234,
          "groupId": 1,
          "name": "VPN-Eng-Users",
          "prefixListId": 1234,
          "routingTagId": 1234,
          "splitTunneling": true,
          "subnets": [
            "string",
            "string",
            "string",
            "string",
            "string",
            "string",
            "string",
            "string",
            "string"
          ],
          "userGroupId": "990e721d-bac9-41a0-a598-96aae1b85652"
        }
      ]
    },
    {
      "name": "eng",
      "userGroupMappings": [
        {
          "billingTag": 1234,
          "groupId": 1,
          "name": "VPN-Eng-Users",
          "prefixListId": 1234,
          "routingTagId": 1234,
          "splitTunneling": true,
          "subnets": [
            "string",
            "string",
            "string",
            "string",
            "string",
            "string",
            "string",
            "string"
          ],
          "userGroupId": "990e721d-bac9-41a0-a598-96aae1b85652"
        },
        {
          "billingTag": 1234,
          "groupId": 1,
          "name": "VPN-Eng-Users",
          "prefixListId": 1234,
          "routingTagId": 1234,
          "splitTunneling": true,
          "subnets": [
            "string",
            "string",
            "string"
          ],
          "userGroupId": "990e721d-bac9-41a0-a598-96aae1b85652"
        }
      ]
    }
  ],
  "authenticationOptions": {
    "ldapSettings": {
      "bindUserDomain": "cn=Administrator,cn=Users,dc=alkira,dc=com",
      "credentialId": "0bd6bed6-3a4c-4a03-aa86-dc78345b0d01",
      "destinationAddress": "1.1.1.1",
      "ldapType": null,
      "managementSegment": "HR",
      "searchScopeDomain": "cn=Users,dc=alkira,dc=com"
    },
    "supportedModes": [
      "LDAP"
    ]
  },
  "advancedOptions": {
    "enableDynamicRegionMapping": true,
    "maxActiveUsersThreshold": 80,
    "nameServer": "9.9.4.4"
  },
  "docState": {},
  "state": {},
  "dhParamKeysId": 1234,
  "maxActiveUsers": 100,
  "serverCertificates": [
    {
      "serverCertificateId": 1234,
      "serverRootCertificateId": 1234
    },
    {
      "serverCertificateId": 1234,
      "serverRootCertificateId": 1234
    }
  ]
}