[
  {
    "prefix": "127.0.0.0/24",
    "cxp": null,
    "id": 1,
    "cloudProvider": null,
    "description": "Example",
    "extraAttributes": null,
    "onboardingStatus": null,
    "usageCount": 3,
    "createdAt": 1636134597000,
    "poolId": "ipv4pool-ec2-1234e123f87654321",
    "doNotAdvertise": "False",
    "errorMessage": "None"
  },
  {
    "prefix": "127.0.0.0/24",
    "cxp": null,
    "id": 1,
    "cloudProvider": null,
    "description": "Example",
    "extraAttributes": null,
    "onboardingStatus": null,
    "usageCount": 3,
    "createdAt": 1636134597000,
    "poolId": "ipv4pool-ec2-1234e123f87654321",
    "doNotAdvertise": "False",
    "errorMessage": "None"
  },
  {
    "prefix": "127.0.0.0/24",
    "cxp": null,
    "id": 1,
    "cloudProvider": null,
    "description": "Example",
    "extraAttributes": null,
    "onboardingStatus": null,
    "usageCount": 3,
    "createdAt": 1636134597000,
    "poolId": "ipv4pool-ec2-1234e123f87654321",
    "doNotAdvertise": "False",
    "errorMessage": "None"
  },
  {
    "prefix": "127.0.0.0/24",
    "cxp": null,
    "id": 1,
    "cloudProvider": null,
    "description": "Example",
    "extraAttributes": null,
    "onboardingStatus": null,
    "usageCount": 3,
    "createdAt": 1636134597000,
    "poolId": "ipv4pool-ec2-1234e123f87654321",
    "doNotAdvertise": "False",
    "errorMessage": "None"
  }
]