[
  {
    "name": "string",
    "series": [
      {
        "interval": 6,
        "rx": 8,
        "tx": 9
      },
      {
        "interval": 1,
        "rx": 3,
        "tx": 1
      },
      {
        "interval": 3,
        "rx": 7,
        "tx": 5
      },
      {
        "interval": 2,
        "rx": 10,
        "tx": 2
      },
      {
        "interval": 9,
        "rx": 7,
        "tx": 8
      }
    ],
    "unit": "byte"
  },
  {
    "name": "string",
    "series": [
      {
        "interval": 4,
        "rx": 8,
        "tx": 4
      },
      {
        "interval": 6,
        "rx": 4,
        "tx": 9
      }
    ],
    "unit": "byte"
  },
  {
    "name": "string",
    "series": [
      {
        "interval": 3,
        "rx": 1,
        "tx": 7
      },
      {
        "interval": 10,
        "rx": 8,
        "tx": 2
      },
      {
        "interval": 6,
        "rx": 9,
        "tx": 6
      },
      {
        "interval": 8,
        "rx": 2,
        "tx": 10
      }
    ],
    "unit": "byte"
  },
  {
    "name": "string",
    "series": [
      {
        "interval": 9,
        "rx": 2,
        "tx": 3
      },
      {
        "interval": 7,
        "rx": 5,
        "tx": 7
      },
      {
        "interval": 4,
        "rx": 9,
        "tx": 4
      },
      {
        "interval": 1,
        "rx": 4,
        "tx": 10
      },
      {
        "interval": 6,
        "rx": 5,
        "tx": 3
      },
      {
        "interval": 1,
        "rx": 2,
        "tx": 5
      },
      {
        "interval": 2,
        "rx": 4,
        "tx": 2
      },
      {
        "interval": 7,
        "rx": 9,
        "tx": 9
      },
      {
        "interval": 2,
        "rx": 4,
        "tx": 2
      }
    ],
    "unit": "byte"
  }
]