[
  {
    "id": 6,
    "tenantId": 7,
    "tenantNetworkId": 1,
    "cxp": null,
    "groupIds": [
      8,
      4,
      2,
      2,
      2,
      1,
      7,
      6,
      1
    ],
    "groupNames": [
      "string",
      "string",
      "string",
      "string",
      "string",
      "string",
      "string",
      "string",
      "string",
      "string"
    ],
    "name": "string",
    "segmentId": 1,
    "segmentName": "string",
    "serviceId": 4,
    "tagId": 10
  },
  {
    "id": 1,
    "tenantId": 6,
    "tenantNetworkId": 10,
    "cxp": null,
    "groupIds": [
      6,
      9,
      8,
      7,
      2,
      3,
      1,
      4,
      6
    ],
    "groupNames": [
      "string",
      "string",
      "string",
      "string",
      "string",
      "string"
    ],
    "name": "string",
    "segmentId": 2,
    "segmentName": "string",
    "serviceId": 7,
    "tagId": 2
  },
  {
    "id": 2,
    "tenantId": 2,
    "tenantNetworkId": 8,
    "cxp": null,
    "groupIds": [
      2,
      5,
      4
    ],
    "groupNames": [
      "string",
      "string",
      "string",
      "string",
      "string",
      "string",
      "string"
    ],
    "name": "string",
    "segmentId": 10,
    "segmentName": "string",
    "serviceId": 1,
    "tagId": 7
  }
]