[
  {
    "id": 8,
    "name": "string",
    "description": "string",
    "tenantId": 7,
    "tenantNetworkId": 1,
    "type": null,
    "matchCondition": {
      "srcIp": "string",
      "dstIp": "string",
      "dscp": "string",
      "protocol": "string",
      "srcPrefixListId": 7,
      "dstPrefixListId": 3,
      "srcPortList": [
        null,
        null,
        null,
        null
      ],
      "dstPortList": [
        null,
        null,
        null,
        null,
        null,
        null,
        null,
        null,
        null
      ],
      "applicationList": [
        null,
        null,
        null,
        null,
        null,
        null,
        null,
        null,
        null
      ],
      "applicationFamilyList": [
        null
      ],
      "internetApplicationId": 4
    },
    "ruleAction": {
      "action": null,
      "serviceTypeList": [
        null,
        null,
        null,
        null,
        null,
        null
      ],
      "serviceList": [
        null,
        null,
        null,
        null,
        null,
        null,
        null,
        null
      ]
    },
    "state": {},
    "lastUpdatedDate": "string",
    "internalName": "string",
    "docSate": {},
    "updatedBy": "string"
  }
]