[
  {
    "device-name": "PON-Blade-1",
    "state": "activated",
    "interface-name": "PON-Blade-1-Provider-Interface",
    "interface-id": "1",
    "multipoint-inner-vlan-id": "none",
    "multipoint-outer-vlan-id": "untagged",
    "profile-vector-name": "",
    "content-provider-name": "Content-Provider"
  },
  {
    "device-name": "PON-Blade-1",
    "state": "activated",
    "interface-name": "PON-Blade-1-Provider-Interface",
    "interface-id": "1",
    "multipoint-inner-vlan-id": "none",
    "multipoint-outer-vlan-id": "untagged",
    "profile-vector-name": "",
    "content-provider-name": "Content-Provider"
  },
  {
    "device-name": "PON-Blade-1",
    "state": "activated",
    "interface-name": "PON-Blade-1-Provider-Interface",
    "interface-id": "1",
    "multipoint-inner-vlan-id": "none",
    "multipoint-outer-vlan-id": "untagged",
    "profile-vector-name": "",
    "content-provider-name": "Content-Provider"
  }
]