{
  "$id": "schema.json",
  "type": "object",
  "schema": "http://json-schema.org/draft-07/schema#",
  "translate": true,
  "dynamicfields": true,
  "properties": {
    "ph_request_type": {
      "type": "string",
      "description": "type of request (internal to adapter)",
      "default": "dataFilterByPayloadBundle",
      "enum": [
        "dataFilterByPayloadBundle",
        "dataFilterByPayloadInterface",
        "dataFilterByPayloadDevice",
        "dataFilterContainsoperator",
        "dataFilterLikeoperator",
        "dataFilterJoinoperator",
        "dataFilterDepthFirstoperator",
        "dataFilterCountoperator"
      ],
      "external_name": "ph_request_type"
    },
    "singleActionSvcIntName": {
      "type": "string",
      "description": "",
      "parse": false,
      "encode": false,
      "encrypt": {
        "type": "AES",
        "key": ""
      },
      "external_name": "single-action-svc-int-name"
    }
  },
  "definitions": {}
}