{
  "output": {
    "state": "creating",
    "completion-status": "in-progress",
    "transaction-id": "5c6ddea1-ba53-4095-ad2b-99602c92a6ac",
    "error-description": "",
    "object-onboarding-detail": [
      {
        "object-name": "Test-Device-1",
        "state": "creating",
        "completion-status": "completed-ok",
        "error-description": "",
        "object-type": "device"
      },
      {
        "object-name": "Test-Device-1/0/1",
        "state": "creating",
        "completion-status": "in-progress",
        "error-description": "",
        "object-type": "interface"
      },
      {
        "object-name": "Test-Device-1/0/2",
        "state": "creating",
        "completion-status": "in-progress",
        "error-description": "",
        "object-type": "interface"
      },
      {
        "object-name": "Test-Device-1-gpon-0",
        "state": "creating",
        "completion-status": "completed-ok",
        "error-description": "",
        "object-type": "bundle"
      },
      {
        "object-name": "Test-Device-1-gpon-1",
        "state": "creating",
        "completion-status": "completed-ok",
        "error-description": "",
        "object-type": "bundle"
      }
    ]
  }
}