{
  "module": [
    {
      "name": "adtran-cloud-platform-uiworkflow",
      "permission": [
        "adtran-cloud-platform-uiworkflow:read-uiworkflow-transitions",
        "adtran-cloud-platform-uiworkflow:run-uiworkflow-configure",
        "adtran-cloud-platform-uiworkflow:run-uiworkflow-deploy",
        "adtran-cloud-platform-uiworkflow:run-uiworkflow-undeploy",
        "adtran-cloud-platform-uiworkflow:run-uiworkflow-delete",
        "adtran-cloud-platform-uiworkflow:run-uiworkflow-activate",
        "adtran-cloud-platform-uiworkflow:run-uiworkflow-deactivate",
        "adtran-cloud-platform-uiworkflow:run-uiworkflow-notify",
        "adtran-cloud-platform-uiworkflow:read-uiworkflow-catalog",
        "adtran-cloud-platform-uiworkflow:run-uiworkflow-onboard-device",
        "adtran-cloud-platform-uiworkflow:force-delete"
      ]
    },
    {
      "name": "adtran-auth-permission",
      "permission": [
        "adtran-auth-permission:all",
        "adtran-auth-permission:anonymous"
      ]
    },
    {
      "name": "adtran-export-data-service",
      "permission": [
        "adtran-export-data-service:export-data-service"
      ]
    },
    {
      "name": "adtran-cloud-platform-profiles-gfast-types",
      "permission": []
    },
    {
      "name": "adtran-cloud-platform-profiles-service",
      "permission": []
    },
    {
      "name": "adtran-cloud-platform-topics",
      "permission": [
        "adtran-cloud-platform-topics:configure-topics",
        "adtran-cloud-platform-topics:read-topics"
      ]
    },
    {
      "name": "adtran-captive-portal-aoe",
      "permission": []
    },
    {
      "name": "adtran-cloud-platform-profiles-voice-protocol",
      "permission": []
    },
    {
      "name": "adtran-cloud-platform-profiles-multicast",
      "permission": []
    },
    {
      "name": "adtran-cloud-platform-jobs",
      "permission": [
        "adtran-cloud-platform-jobs:read-adtn-cld-pfrm-job",
        "adtran-cloud-platform-jobs:modify-adtn-cld-pfrm-job"
      ]
    },
    {
      "name": "adtran-cxui-vqm-data",
      "permission": []
    },
    {
      "name": "adtran-cp-profiles-gfast-channel-threshold-profile-body",
      "permission": []
    },
    {
      "name": "adtran-cloud-platform-software-upgrade-service",
      "permission": [
        "adtran-cloud-platform-software-upgrade-service:download-software",
        "adtran-cloud-platform-software-upgrade-service:commit-software",
        "adtran-cloud-platform-software-upgrade-service:activate-software",
        "adtran-cloud-platform-software-upgrade-service:commit-and-activate-software",
        "adtran-cloud-platform-software-upgrade-service:reboot-device"
      ]
    },
    {
      "name": "adtran-ffui-settings",
      "permission": [
        "adtran-ffui-settings:modify-settings",
        "adtran-ffui-settings:read-settings"
      ]
    },
    {
      "name": "adtran-cloud-platform-server-coordination",
      "permission": [
        "adtran-cloud-platform-server-coordination:config-servers",
        "adtran-cloud-platform-server-coordination:deploy-servers",
        "adtran-cloud-platform-server-coordination:activate-servers",
        "adtran-cloud-platform-server-coordination:undeploy-servers",
        "adtran-cloud-platform-server-coordination:deactivate-servers",
        "adtran-cloud-platform-server-coordination:delete-servers",
        "adtran-cloud-platform-server-coordination:communicate-servers"
      ]
    },
    {
      "name": "adtran-cloud-platform-job-upgrade",
      "permission": []
    },
    {
      "name": "adtran-captive-portal-service-work",
      "permission": []
    },
    {
      "name": "adtran-cloud-platform-uiworkflow-services-types",
      "permission": []
    },
    {
      "name": "adtran-captive-portal-service-profiles",
      "permission": []
    },
    {
      "name": "adtran-cp-profiles-gfast-handshake-profile-body",
      "permission": []
    },
    {
      "name": "adtran-cloud-platform-profiles-voice-dialing",
      "permission": []
    },
    {
      "name": "adtran-auth-tech-support",
      "permission": [
        "adtran-auth-tech-support:generate-tech-support-challenges"
      ]
    },
    {
      "name": "adtran-cloud-platform-profiles-sip-trunk",
      "permission": []
    },
    {
      "name": "adtran-captive-portal-etos",
      "permission": []
    },
    {
      "name": "adtran-cloud-platform-profiles-diameter-route",
      "permission": []
    },
    {
      "name": "adtran-captive-portal-user-actions",
      "permission": []
    },
    {
      "name": "adtran-cloud-platform-profiles-pon-igmp",
      "permission": []
    },
    {
      "name": "adtran-auth-domain",
      "permission": [
        "adtran-auth-domain:modify-domains"
      ]
    },
    {
      "name": "adtran-cloud-platform-settings-gfast",
      "permission": []
    },
    {
      "name": "adtran-cloud-platform-uiworkflow-topology",
      "permission": [
        "adtran-cloud-platform-uiworkflow-topology:read-uiworkflow-topology",
        "adtran-cloud-platform-uiworkflow-topology:run-uiworkflow-topology"
      ]
    },
    {
      "name": "adtran-cloud-platform-profiles-gfast",
      "permission": []
    },
    {
      "name": "adtran-cloud-platform-search-object-status",
      "permission": []
    },
    {
      "name": "adtran-device-proxy-notifications",
      "permission": []
    },
    {
      "name": "adtran-cloud-platform-management-domains",
      "permission": [
        "adtran-cloud-platform-management-domains:read-adtn-cld-pfrm-md",
        "adtran-cloud-platform-management-domains:modify-adtn-cld-pfrm-md"
      ]
    },
    {
      "name": "adtran-captive-portal-server-credentials",
      "permission": []
    },
    {
      "name": "adtran-dpoe-node",
      "permission": []
    },
    {
      "name": "adtran-cloud-platform-profiles-venet-interface",
      "permission": []
    },
    {
      "name": "adtran-cloud-platform-elasticsearch-rollover-indices",
      "permission": [
        "adtran-cloud-platform-elasticsearch-rollover-indices:rollover-cron-update",
        "adtran-cloud-platform-elasticsearch-rollover-indices:read-adtn-cld-pfrm-es-rlvr-indcs",
        "adtran-cloud-platform-elasticsearch-rollover-indices:modify-adtn-cld-pfrm-es-rlvr-indcs"
      ]
    },
    {
      "name": "adtran-nms-inventory",
      "permission": [
        "adtran-nms-inventory:read-inventory"
      ]
    },
    {
      "name": "adtran-cloud-platform-profiles-ethernet",
      "permission": []
    },
    {
      "name": "adtran-captive-portal-policers",
      "permission": [
        "adtran-captive-portal-policers:read-policer",
        "adtran-captive-portal-policers:modify-policer"
      ]
    },
    {
      "name": "adtran-cloud-platform-uiworkflow-management-domains-types",
      "permission": []
    },
    {
      "name": "adtran-ffui-workboards-yds",
      "permission": [
        "adtran-ffui-workboards-yds:modify-workboards",
        "adtran-ffui-workboards-yds:read-workboards"
      ]
    },
    {
      "name": "adtran-cloud-platform-event-workflow",
      "permission": [
        "adtran-cloud-platform-event-workflow:event-read",
        "adtran-cloud-platform-event-workflow:event-write",
        "adtran-cloud-platform-event-workflow:event-clear",
        "adtran-cloud-platform-event-workflow:read-event-workflow-transitions"
      ]
    },
    {
      "name": "adtran-cloud-platform-connections-yds",
      "permission": []
    },
    {
      "name": "adtran-cloud-platform-hardware",
      "permission": [
        "adtran-cloud-platform-hardware:read-profile"
      ]
    },
    {
      "name": "adtran-yang-datastore",
      "permission": [
        "adtran-yang-datastore:read-yang-model",
        "adtran-yang-datastore:write-yang-model"
      ]
    },
    {
      "name": "adtran-vssm-gx-subscriber-data",
      "permission": [
        "adtran-vssm-gx-subscriber-data:read-subscriber-data"
      ]
    },
    {
      "name": "adtran-cloud-platform-dhcp-config",
      "permission": [
        "adtran-cloud-platform-dhcp-config:dhcp-config"
      ]
    },
    {
      "name": "adtran-cloud-platform-uiworkflow-jobs",
      "permission": [
        "adtran-cloud-platform-uiworkflow-jobs:read-job",
        "adtran-cloud-platform-uiworkflow-jobs:read-trigger",
        "adtran-cloud-platform-uiworkflow-jobs:read-action",
        "adtran-cloud-platform-uiworkflow-jobs:get-job-context",
        "adtran-cloud-platform-uiworkflow-jobs:run-job",
        "adtran-cloud-platform-uiworkflow-jobs:run-job-with-parameters",
        "adtran-cloud-platform-uiworkflow-jobs:read-run-job-transitions"
      ]
    },
    {
      "name": "adtran-cloud-platform-services",
      "permission": [
        "adtran-cloud-platform-services:read-service",
        "adtran-cloud-platform-services:modify-service"
      ]
    },
    {
      "name": "adtran-cloud-platform-software-upgrade-maintenance-service",
      "permission": [
        "adtran-cloud-platform-software-upgrade-maintenance-service:initiate-upgrade",
        "adtran-cloud-platform-software-upgrade-maintenance-service:get-upgrade-status",
        "adtran-cloud-platform-software-upgrade-maintenance-service:get-upgrade-summary-status"
      ]
    },
    {
      "name": "adtran-cloud-platform-dhcp-subscriber-profile-mapping",
      "permission": [
        "adtran-cloud-platform-dhcp-subscriber-profile-mapping:modify-subscriber-profile-mapping",
        "adtran-cloud-platform-dhcp-subscriber-profile-mapping:read-subscriber-profile-mapping"
      ]
    },
    {
      "name": "adtran-cloud-platform-maintenance-service-work",
      "permission": []
    },
    {
      "name": "adtran-cloud-platform-profiles-pools",
      "permission": [
        "adtran-cloud-platform-profiles-pools:read-profile-pool",
        "adtran-cloud-platform-profiles-pools:modify-profile-pools"
      ]
    },
    {
      "name": "adtran-cloud-platform-y1731-session-measurement-report",
      "permission": [
        "adtran-cloud-platform-y1731-session-measurement-report:read-report"
      ]
    },
    {
      "name": "adtran-cloud-platform-entity-transformation-gfast-types",
      "permission": []
    },
    {
      "name": "adtran-cloud-platform-uiworkflow-force-actions",
      "permission": []
    },
    {
      "name": "adtran-cp-profiles-gfast-vectoring-profile-body",
      "permission": []
    },
    {
      "name": "adtran-cloud-platform-profiles-voice-codec",
      "permission": []
    },
    {
      "name": "adtran-auth-user",
      "permission": [
        "adtran-auth-user:modify-users",
        "adtran-auth-user:administer-users"
      ]
    },
    {
      "name": "adtran-cloud-platform-bundles",
      "permission": [
        "adtran-cloud-platform-bundles:read-adtn-cld-pfrm-bndl",
        "adtran-cloud-platform-bundles:modify-adtn-cld-pfrm-bndl"
      ]
    },
    {
      "name": "adtran-cloud-platform-service-test-rfc2544",
      "permission": [
        "adtran-cloud-platform-service-test-rfc2544:read-rfc2544-tests",
        "adtran-cloud-platform-service-test-rfc2544:run-test-rfc2544"
      ]
    },
    {
      "name": "adtran-vssm-gx-handler",
      "permission": [
        "adtran-vssm-gx-handler:gx-handler"
      ]
    },
    {
      "name": "adtran-cloud-platform-profiles-y1731-meg",
      "permission": []
    },
    {
      "name": "adtran-cxui-sip-stats",
      "permission": []
    },
    {
      "name": "adtran-device-proxy-snmp",
      "permission": []
    },
    {
      "name": "adtran-cloud-platform-profiles-ethernet-cfm",
      "permission": []
    },
    {
      "name": "adtran-nms-inventory-synchronization",
      "permission": []
    },
    {
      "name": "adtran-cloud-platform-profiles-device-connectivity",
      "permission": []
    },
    {
      "name": "adtran-cloud-platform-deferred-intents",
      "permission": [
        "adtran-cloud-platform-deferred-intents:read-deferred-intents"
      ]
    },
    {
      "name": "adtran-cloud-platform-servers",
      "permission": [
        "adtran-cloud-platform-servers:read-adtn-cld-pfrm-srvr",
        "adtran-cloud-platform-servers:modify-adtn-cld-pfrm-srvr"
      ]
    },
    {
      "name": "adtran-cloud-platform-data-centers",
      "permission": [
        "adtran-cloud-platform-data-centers:read-adtn-cld-pfrm-data-ctr",
        "adtran-cloud-platform-data-centers:modify-adtn-cld-pfrm-data-ctr"
      ]
    },
    {
      "name": "adtran-cloud-platform-profiles-snmp",
      "permission": []
    },
    {
      "name": "adtran-captive-portal-activation-logs",
      "permission": []
    },
    {
      "name": "adtran-cloud-platform-profiles-vdsl",
      "permission": []
    },
    {
      "name": "adtran-dhcp-autoprov-info",
      "permission": [
        "adtran-dhcp-autoprov-info:read-adtn-dhcp-ap-info"
      ]
    },
    {
      "name": "adtran-cloud-platform-business-service-management",
      "permission": [
        "adtran-cloud-platform-business-service-management:service-read",
        "adtran-cloud-platform-business-service-management:service-write"
      ]
    },
    {
      "name": "adtran-cloud-platform-profiles-service-segment",
      "permission": []
    },
    {
      "name": "adtran-cloud-platform-search-alarms",
      "permission": []
    },
    {
      "name": "adtran-cloud-platform-profiles-common-types",
      "permission": []
    },
    {
      "name": "adtran-cloud-platform-search-global-types",
      "permission": []
    },
    {
      "name": "adtran-cloud-platform-profiles-ancp",
      "permission": []
    },
    {
      "name": "adtran-cloud-platform-uiworkflow-credentials",
      "permission": [
        "adtran-cloud-platform-uiworkflow-credentials:read-adtn-cld-pfrm-uiw-crdls"
      ]
    },
    {
      "name": "adtran-cloud-platform-plugin-ta5k-fttp-segment-data",
      "permission": []
    },
    {
      "name": "adtran-auth-config",
      "permission": [
        "adtran-auth-config:modify-config"
      ]
    },
    {
      "name": "adtran-aoe-access",
      "permission": []
    },
    {
      "name": "adtran-cloud-platform-uiworkflow-servers",
      "permission": [
        "adtran-cloud-platform-uiworkflow-servers:read-uiworkflow-servers"
      ]
    },
    {
      "name": "adtran-cloud-platform-devices-ngpon2",
      "permission": []
    },
    {
      "name": "adtran-cloud-platform-uiworkflow-interface-types",
      "permission": []
    },
    {
      "name": "adtran-cloud-platform-search-accounting-logs",
      "permission": []
    },
    {
      "name": "adtran-cloud-platform-search",
      "permission": [
        "adtran-cloud-platform-search:execute-search",
        "adtran-cloud-platform-search:administer-search"
      ]
    },
    {
      "name": "adtran-cp-profiles-gfast-retransmission-profile-body",
      "permission": []
    },
    {
      "name": "adtran-cloud-platform-profiles-scoped-policing",
      "permission": []
    },
    {
      "name": "adtran-manifests",
      "permission": [
        "adtran-manifests:read-adtn-manif"
      ]
    },
    {
      "name": "adtran-cloud-platform-uiworkflow-bundles-types",
      "permission": []
    },
    {
      "name": "adtran-cloud-platform-profiles-entity-transformation",
      "permission": []
    },
    {
      "name": "adtran-cloud-platform-vssm-diameter-statistics",
      "permission": [
        "adtran-cloud-platform-vssm-diameter-statistics:diameter-stats-perm"
      ]
    },
    {
      "name": "adtran-cloud-platform-table",
      "permission": []
    },
    {
      "name": "adtran-cloud-platform-services-sip",
      "permission": []
    },
    {
      "name": "adtran-captive-portal-sla-profiles",
      "permission": [
        "adtran-captive-portal-sla-profiles:read-sla-profile",
        "adtran-captive-portal-sla-profiles:modify-sla-profile"
      ]
    },
    {
      "name": "adtran-cloud-platform-ancp",
      "permission": []
    },
    {
      "name": "adtran-cloud-platform-uiworkflow-data-center-types",
      "permission": [
        "adtran-cloud-platform-uiworkflow-data-center-types:read-uiworkflow-data-center-type"
      ]
    },
    {
      "name": "adtran-cloud-platform-diagnostic-data-maintenance-service",
      "permission": [
        "adtran-cloud-platform-diagnostic-data-maintenance-service:get-diagnostic-job-info"
      ]
    },
    {
      "name": "adtran-cloud-platform-uiworkflow-management-domains",
      "permission": [
        "adtran-cloud-platform-uiworkflow-management-domains:read-uiworkflow-management-domain-types",
        "adtran-cloud-platform-uiworkflow-management-domains:read-uiworkflow-management-domains"
      ]
    },
    {
      "name": "adtran-captive-portal-wholesale-activations",
      "permission": []
    },
    {
      "name": "adtran-auth-token",
      "permission": []
    },
    {
      "name": "adtran-auth-config-external",
      "permission": [
        "adtran-auth-config-external:modify-config-ext"
      ]
    },
    {
      "name": "adtran-cloud-platform-trap-hosts",
      "permission": []
    },
    {
      "name": "adtran-cloud-platform-uiworkflow-subscribers",
      "permission": [
        "adtran-cloud-platform-uiworkflow-subscribers:read-uiworkflow-subscribers",
        "adtran-cloud-platform-uiworkflow-subscribers:filter-uiworkflow-subscriber-resources"
      ]
    },
    {
      "name": "adtran-auth-accounting",
      "permission": [
        "adtran-auth-accounting:read-accounting-logs"
      ]
    },
    {
      "name": "adtran-cloud-platform-uiworkflow-devices-gfast",
      "permission": []
    },
    {
      "name": "adtran-cloud-platform-profiles-tcont-name",
      "permission": []
    },
    {
      "name": "adtran-cloud-platform-subscriber-policy",
      "permission": [
        "adtran-cloud-platform-subscriber-policy:modify-subs-policy",
        "adtran-cloud-platform-subscriber-policy:read-subs-policy"
      ]
    },
    {
      "name": "adtran-captive-portal-content-providers",
      "permission": [
        "adtran-captive-portal-content-providers:read-content-provider",
        "adtran-captive-portal-content-providers:modify-content-provider"
      ]
    },
    {
      "name": "adtran-cloud-platform-device-upgrade",
      "permission": []
    },
    {
      "name": "adtran-captive-portal-ncommand",
      "permission": []
    },
    {
      "name": "adtran-cloud-platform-devices",
      "permission": [
        "adtran-cloud-platform-devices:read-adtn-cld-pfrm-dev",
        "adtran-cloud-platform-devices:modify-adtn-cld-pfrm-dev"
      ]
    },
    {
      "name": "adtran-cp-profiles-gfast-rfi-profile-body",
      "permission": []
    },
    {
      "name": "adtran-nbi-pm",
      "permission": [
        "adtran-nbi-pm:pm-config",
        "adtran-nbi-pm:pm-read"
      ]
    },
    {
      "name": "adtran-cloud-platform-profiles-system",
      "permission": []
    },
    {
      "name": "adtran-cloud-platform-subscribers",
      "permission": [
        "adtran-cloud-platform-subscribers:read-adtn-cld-pfrm-subs",
        "adtran-cloud-platform-subscribers:modify-adtn-cld-pfrm-subs"
      ]
    },
    {
      "name": "adtran-cloud-platform-search-usage-tracking-data",
      "permission": []
    },
    {
      "name": "adtran-cloud-platform-profiles",
      "permission": [
        "adtran-cloud-platform-profiles:config-profile",
        "adtran-cloud-platform-profiles:read-profile"
      ]
    },
    {
      "name": "adtran-cloud-platform-profiles-aes-config",
      "permission": []
    },
    {
      "name": "adtran-cp-profiles-gfast-tdd-profile-body",
      "permission": []
    },
    {
      "name": "adtran-cassandra-manager",
      "permission": []
    },
    {
      "name": "adtran-cloud-platform-ui-inspect",
      "permission": [
        "adtran-cloud-platform-ui-inspect:run-request",
        "adtran-cloud-platform-ui-inspect:run-action"
      ]
    },
    {
      "name": "adtran-cloud-platform-mqtt-yds",
      "permission": []
    },
    {
      "name": "adtran-cloud-platform-devices-gfast",
      "permission": []
    },
    {
      "name": "adtran-cloud-platform-profiles-custom-index",
      "permission": []
    },
    {
      "name": "adtran-cloud-platform-alarm-logger",
      "permission": [
        "adtran-cloud-platform-alarm-logger:read-alarm-logs"
      ]
    },
    {
      "name": "adtran-server-proxy-by-name",
      "permission": [
        "adtran-server-proxy-by-name:server-read"
      ]
    },
    {
      "name": "adtran-cloud-platform-labels",
      "permission": [
        "adtran-cloud-platform-labels:read-labels",
        "adtran-cloud-platform-labels:modify-labels"
      ]
    },
    {
      "name": "adtran-cloud-platform-profiles-default-host-interface",
      "permission": []
    },
    {
      "name": "adtran-cloud-platform-profiles-allocation",
      "permission": []
    },
    {
      "name": "adtran-device-proxy-snmp-transactions",
      "permission": []
    },
    {
      "name": "adtran-cloud-platform-profiles-traffic-management",
      "permission": []
    },
    {
      "name": "adtran-cloud-platform-uiworkflow-devices-ngpon2",
      "permission": []
    },
    {
      "name": "adtran-cloud-platform-event-description",
      "permission": [
        "adtran-cloud-platform-event-description:configure-event-description",
        "adtran-cloud-platform-event-description:read-event-description"
      ]
    },
    {
      "name": "adtran-cloud-platform-proxy-service",
      "permission": [
        "adtran-cloud-platform-proxy-service:device-read",
        "adtran-cloud-platform-proxy-service:device-write",
        "adtran-cloud-platform-proxy-service:mount-point-read",
        "adtran-cloud-platform-proxy-service:server-read",
        "adtran-cloud-platform-proxy-service:server-write"
      ]
    },
    {
      "name": "adtran-cloud-platform-plugin",
      "permission": [
        "adtran-cloud-platform-plugin:reload-plugins",
        "adtran-cloud-platform-plugin:get-plugins"
      ]
    },
    {
      "name": "adtran-cloud-platform-information",
      "permission": [
        "adtran-cloud-platform-information:read-information"
      ]
    },
    {
      "name": "adtran-cloud-platform-uiworkflow-jobs-types",
      "permission": []
    },
    {
      "name": "adtran-cloud-platform-interfaces",
      "permission": [
        "adtran-cloud-platform-interfaces:read-adtn-cld-pfrm-int",
        "adtran-cloud-platform-interfaces:modify-adtn-cld-pfrm-int"
      ]
    },
    {
      "name": "adtran-cloud-platform-profiles-user",
      "permission": []
    },
    {
      "name": "adtran-cloud-platform-search-all-labels",
      "permission": []
    },
    {
      "name": "adtran-cloud-platform-profiles-legacy-gpon",
      "permission": []
    },
    {
      "name": "adtran-cloud-platform-uiworkflow-interfaces",
      "permission": [
        "adtran-cloud-platform-uiworkflow-interfaces:read-uiworkflow-interface-type",
        "adtran-cloud-platform-uiworkflow-interfaces:read-uiworkflow-interfaces",
        "adtran-cloud-platform-uiworkflow-interfaces:filter-uiworkflow-interface-resources",
        "adtran-cloud-platform-uiworkflow-interfaces:filter-uiworkflow-physical-resources"
      ]
    },
    {
      "name": "adtran-cloud-platform-profiles-melt",
      "permission": []
    },
    {
      "name": "adtran-cloud-platform-profiles-lci-policy",
      "permission": []
    },
    {
      "name": "adtran-automation-portal-residential-activation",
      "permission": []
    },
    {
      "name": "adtran-cp-profiles-gfast-upstream-power-back-off-profile-body",
      "permission": []
    },
    {
      "name": "adtran-cp-profiles-gfast-data-rate-profile-body",
      "permission": []
    },
    {
      "name": "adtran-captive-portal-dpus",
      "permission": []
    },
    {
      "name": "adtran-cloud-platform-connection-monitor",
      "permission": [
        "adtran-cloud-platform-connection-monitor:aggregate-sessions-count"
      ]
    },
    {
      "name": "adtran-cloud-platform-system-monitor",
      "permission": [
        "adtran-cloud-platform-system-monitor:read-system-monitor-node-status"
      ]
    },
    {
      "name": "adtran-cp-profiles-gfast-line-spectrum-profile-body",
      "permission": []
    },
    {
      "name": "adtran-cloud-platform-dfn-route-configuration",
      "permission": [
        "adtran-cloud-platform-dfn-route-configuration:modify-dfn-rt-configuration",
        "adtran-cloud-platform-dfn-route-configuration:read-dfn-rt-configuration"
      ]
    },
    {
      "name": "adtran-cloud-platform-uiworkflow-inspect",
      "permission": [
        "adtran-cloud-platform-uiworkflow-inspect:inspect-uiworkflow-devices",
        "adtran-cloud-platform-uiworkflow-inspect:inspect-uiworkflow-profiles",
        "adtran-cloud-platform-uiworkflow-inspect:inspect-uiworkflow-interfaces",
        "adtran-cloud-platform-uiworkflow-inspect:inspect-uiworkflow-server",
        "adtran-cloud-platform-uiworkflow-inspect:manage-uiworkflow-dpu"
      ]
    },
    {
      "name": "adtran-cloud-platform-profiles-traffic-management-types",
      "permission": []
    },
    {
      "name": "adtran-cloud-platform-uiworkflow-devices",
      "permission": [
        "adtran-cloud-platform-uiworkflow-devices:read-uiworkflow-devices"
      ]
    },
    {
      "name": "adtran-cloud-platform-uiworkflow-behaviors",
      "permission": [
        "adtran-cloud-platform-uiworkflow-behaviors:run-uiworkflow-behavior",
        "adtran-cloud-platform-uiworkflow-behaviors:read-uiworkflow-behavior"
      ]
    },
    {
      "name": "adtran-cloud-platform-base-configurations",
      "permission": [
        "adtran-cloud-platform-base-configurations:read-adtn-cld-pfrm-bc",
        "adtran-cloud-platform-base-configurations:modify-adtn-cld-pfrm-bc"
      ]
    },
    {
      "name": "adtran-captive-portal-wholesale-helpers",
      "permission": [
        "adtran-captive-portal-wholesale-helpers:configure-interface",
        "adtran-captive-portal-wholesale-helpers:create-dpu-mgmt-svcs-for-l2s",
        "adtran-captive-portal-wholesale-helpers:delete-dpu-mgmt-svcs-for-l2s",
        "adtran-captive-portal-wholesale-helpers:commission-dpu",
        "adtran-captive-portal-wholesale-helpers:decommission-dpu",
        "adtran-captive-portal-wholesale-helpers:create-l2s-device-mgmt-svcs",
        "adtran-captive-portal-wholesale-helpers:delete-l2s-device-mgmt-svcs",
        "adtran-captive-portal-wholesale-helpers:commission-l2s-device",
        "adtran-captive-portal-wholesale-helpers:decommission-l2s-device",
        "adtran-captive-portal-wholesale-helpers:create-content-provider",
        "adtran-captive-portal-wholesale-helpers:delete-content-provider",
        "adtran-captive-portal-wholesale-helpers:create-l2s-service",
        "adtran-captive-portal-wholesale-helpers:delete-l2s-service",
        "adtran-captive-portal-wholesale-helpers:create-dpu-service",
        "adtran-captive-portal-wholesale-helpers:delete-dpu-service",
        "adtran-captive-portal-wholesale-helpers:activate-service",
        "adtran-captive-portal-wholesale-helpers:deactivate-service",
        "adtran-captive-portal-wholesale-helpers:add-ont",
        "adtran-captive-portal-wholesale-helpers:modify-ont",
        "adtran-captive-portal-wholesale-helpers:remove-ont",
        "adtran-captive-portal-wholesale-helpers:replace-ont",
        "adtran-captive-portal-wholesale-helpers:create-ses-service",
        "adtran-captive-portal-wholesale-helpers:delete-ses-service",
        "adtran-captive-portal-wholesale-helpers:create-pon-system",
        "adtran-captive-portal-wholesale-helpers:update-pon-system",
        "adtran-captive-portal-wholesale-helpers:update-pon",
        "adtran-captive-portal-wholesale-helpers:delete-pon-system",
        "adtran-captive-portal-wholesale-helpers:delete-channel-partition",
        "adtran-captive-portal-wholesale-helpers:get-pons-of-channel-partition"
      ]
    },
    {
      "name": "adtran-cp-profiles-gfast-reinitialization-policy-profile-body",
      "permission": []
    },
    {
      "name": "adtran-cloud-platform-subscriber-accounting",
      "permission": [
        "adtran-cloud-platform-subscriber-accounting:write-config",
        "adtran-cloud-platform-subscriber-accounting:read-config"
      ]
    },
    {
      "name": "adtran-cloud-platform-profiles-file-transfer-server",
      "permission": []
    },
    {
      "name": "adtran-cp-profiles-gfast-fast-retrain-policy-profile-body",
      "permission": []
    },
    {
      "name": "adtran-nbi-ipaa-ssh",
      "permission": [
        "adtran-nbi-ipaa-ssh:ipaa-config-ssh"
      ]
    },
    {
      "name": "adtran-system-config",
      "permission": [
        "adtran-system-config:modify-config"
      ]
    },
    {
      "name": "adtran-cloud-platform-profiles-voice-media",
      "permission": []
    },
    {
      "name": "adtran-cloud-platform-search-by-label",
      "permission": []
    },
    {
      "name": "adtran-cp-profiles-gfast-fast-rate-adaptation-profile-body",
      "permission": []
    },
    {
      "name": "adtran-cloud-platform-profiles-device-software-upgrade",
      "permission": []
    },
    {
      "name": "adtran-vssm-gx-session",
      "permission": [
        "adtran-vssm-gx-session:gx-session"
      ]
    },
    {
      "name": "adtran-cloud-platform-uiworkflow-services-sip",
      "permission": []
    },
    {
      "name": "adtran-cloud-platform-restconf-streams",
      "permission": [
        "adtran-cloud-platform-restconf-streams:stream-read"
      ]
    },
    {
      "name": "adtran-cloud-platform-dhcp-lease",
      "permission": [
        "adtran-cloud-platform-dhcp-lease:read-dhcp-lease"
      ]
    },
    {
      "name": "adtran-cloud-platform-uiworkflow-inventory",
      "permission": []
    },
    {
      "name": "adtran-cloud-platform-plugin-adtn-1u-olt-yds-data",
      "permission": []
    },
    {
      "name": "adtran-cloud-platform-profiles-melt-types",
      "permission": []
    },
    {
      "name": "adtran-cloud-platform-profiles-alarm",
      "permission": []
    },
    {
      "name": "adtran-cloud-platform-device-credentials",
      "permission": [
        "adtran-cloud-platform-device-credentials:read-adtn-cld-pfrm-dev-crdls",
        "adtran-cloud-platform-device-credentials:modify-adtn-cld-pfrm-dev-crdls"
      ]
    },
    {
      "name": "adtran-cloud-platform-uiworkflow-services",
      "permission": [
        "adtran-cloud-platform-uiworkflow-services:read-uiworkflow-service-profiles",
        "adtran-cloud-platform-uiworkflow-services:read-uiworkflow-services",
        "adtran-cloud-platform-uiworkflow-services:read-uiworkflow-content-providers"
      ]
    },
    {
      "name": "adtran-cloud-platform-search-object-filter",
      "permission": []
    },
    {
      "name": "adtran-cp-profiles-gfast-vdsl-crosstalk-detection-profile-body",
      "permission": []
    },
    {
      "name": "adtran-cloud-platform-uiworkflow-servers-types",
      "permission": []
    },
    {
      "name": "adtran-trap-forwarder",
      "permission": [
        "adtran-trap-forwarder:trap-config-read",
        "adtran-trap-forwarder:trap-config-write"
      ]
    },
    {
      "name": "adtran-cloud-platform-plugin-service-segment-data",
      "permission": []
    },
    {
      "name": "adtran-device-proxy",
      "permission": [
        "adtran-device-proxy:device-read",
        "adtran-device-proxy:device-write",
        "adtran-device-proxy:device-execute",
        "adtran-device-proxy:server-write"
      ]
    },
    {
      "name": "adtran-cloud-platform-device-backup",
      "permission": [
        "adtran-cloud-platform-device-backup:read-adtn-cld-pfrm-dev-bkup",
        "adtran-cloud-platform-device-backup:modify-adtn-cld-pfrm-dev-bkup"
      ]
    },
    {
      "name": "adtran-ffui-applications",
      "permission": [
        "adtran-ffui-applications:read-apps-info",
        "adtran-ffui-applications:write-apps-info"
      ]
    },
    {
      "name": "adtran-device-proxy-rest",
      "permission": []
    },
    {
      "name": "adtran-captive-portal-service-transition",
      "permission": [
        "adtran-captive-portal-service-transition:read-service-transitions"
      ]
    },
    {
      "name": "adtran-cloud-platform-enablement-adapter",
      "permission": [
        "adtran-cloud-platform-enablement-adapter:run-ebmt-adpt-trap-receiver"
      ]
    },
    {
      "name": "adtran-rest-extensions",
      "permission": []
    },
    {
      "name": "adtran-cloud-platform-search-performance-monitoring-data",
      "permission": []
    },
    {
      "name": "adtran-cp-profiles-gfast-noise-margin-profile-body",
      "permission": []
    },
    {
      "name": "adtran-cloud-platform-dhcp-profiles",
      "permission": [
        "adtran-cloud-platform-dhcp-profiles:modify-dhcp-profile",
        "adtran-cloud-platform-dhcp-profiles:read-dhcp-profile"
      ]
    },
    {
      "name": "adtran-cloud-platform-plugin-adtn-1u-olt-segment-data",
      "permission": []
    },
    {
      "name": "adtran-nbi-inventory",
      "permission": []
    },
    {
      "name": "adtran-dhcp-ont-activations",
      "permission": [
        "adtran-dhcp-ont-activations:read-adtn-dhcp-ont-act"
      ]
    },
    {
      "name": "adtran-cloud-platform-service-test-y1731",
      "permission": [
        "adtran-cloud-platform-service-test-y1731:read-y1731-tests",
        "adtran-cloud-platform-service-test-y1731:run-test-y1731",
        "adtran-cloud-platform-service-test-y1731:run-graph-y1731"
      ]
    },
    {
      "name": "adtran-cloud-platform-profiles-voice-call-feature",
      "permission": []
    },
    {
      "name": "adtran-cloud-platform-services-cfm",
      "permission": []
    },
    {
      "name": "adtran-cloud-platform-profiles-multicast-vpn",
      "permission": []
    },
    {
      "name": "adtran-cxui-device",
      "permission": []
    },
    {
      "name": "adtran-cloud-platform-device-types",
      "permission": []
    },
    {
      "name": "adtran-cloud-platform-profiles-external-sensor-configuration",
      "permission": []
    },
    {
      "name": "adtran-cxui-types",
      "permission": [
        "adtran-cxui-types:read-adtn-cxui-dev",
        "adtran-cxui-types:read-adtn-cxui-dev-stats",
        "adtran-cxui-types:modify-adtn-cxui-dev",
        "adtran-cxui-types:read-adtn-cxui-vqm",
        "adtran-cxui-types:read-adtn-cxui-sip-stats"
      ]
    },
    {
      "name": "adtran-launchpad-login",
      "permission": [
        "adtran-launchpad-login:modify-login-page",
        "adtran-launchpad-login:modify-browser-page"
      ]
    },
    {
      "name": "adtran-captive-portal-business-activations",
      "permission": []
    },
    {
      "name": "adtran-cloud-platform-profiles-grouping",
      "permission": []
    },
    {
      "name": "adtran-cloud-platform-restconf-service",
      "permission": [
        "adtran-cloud-platform-restconf-service:read-permission",
        "adtran-cloud-platform-restconf-service:open-session",
        "adtran-cloud-platform-restconf-service:close-session",
        "adtran-cloud-platform-restconf-service:read-session",
        "adtran-cloud-platform-restconf-service:read-config",
        "adtran-cloud-platform-restconf-service:write-config",
        "adtran-cloud-platform-restconf-service:delete-config",
        "adtran-cloud-platform-restconf-service:subscribe-notifications",
        "adtran-cloud-platform-restconf-service:unsubscribe-notifications",
        "adtran-cloud-platform-restconf-service:read-schema",
        "adtran-cloud-platform-restconf-service:reestablish-session",
        "adtran-cloud-platform-restconf-service:get-all-device-sessions",
        "adtran-cloud-platform-restconf-service:get-all-device-notifications",
        "adtran-cloud-platform-restconf-service:reboot-device",
        "adtran-cloud-platform-restconf-service:execute-rpc"
      ]
    },
    {
      "name": "adtran-cloud-platform-devices-activate",
      "permission": []
    },
    {
      "name": "adtran-cloud-platform-dfn-peer-configuration",
      "permission": [
        "adtran-cloud-platform-dfn-peer-configuration:modify-dfn-pr-configuration",
        "adtran-cloud-platform-dfn-peer-configuration:read-dfn-pr-configuration"
      ]
    },
    {
      "name": "adtran-cloud-platform-uiworkflow-part-numbers",
      "permission": [
        "adtran-cloud-platform-uiworkflow-part-numbers:read-uiworkflow-part-number"
      ]
    },
    {
      "name": "adtran-cloud-platform-settings-deferred-intent",
      "permission": []
    },
    {
      "name": "adtran-cloud-platform-overrides",
      "permission": []
    },
    {
      "name": "adtran-cloud-platform-uiworkflow-data-centers",
      "permission": [
        "adtran-cloud-platform-uiworkflow-data-centers:read-uiworkflow-data-centers"
      ]
    },
    {
      "name": "adtran-cloud-platform-profiles-authentication",
      "permission": []
    },
    {
      "name": "adtran-feature-flags",
      "permission": [
        "adtran-feature-flags:config-flag"
      ]
    },
    {
      "name": "adtran-cloud-platform-profiles-conditional",
      "permission": []
    },
    {
      "name": "adtran-cloud-platform-profiles-service-shaper",
      "permission": []
    },
    {
      "name": "adtran-cloud-platform-subscriber-session-status",
      "permission": [
        "adtran-cloud-platform-subscriber-session-status:read-subscriber-session"
      ]
    },
    {
      "name": "adtran-auth-group",
      "permission": [
        "adtran-auth-group:modify-groups"
      ]
    },
    {
      "name": "adtran-cloud-platform-dfn-configuration",
      "permission": [
        "adtran-cloud-platform-dfn-configuration:modify-dfn-configuration",
        "adtran-cloud-platform-dfn-configuration:read-dfn-configuration"
      ]
    },
    {
      "name": "adtran-ffui-types",
      "permission": []
    },
    {
      "name": "adtran-vssm-radius-config",
      "permission": []
    },
    {
      "name": "adtran-file-transfer",
      "permission": [
        "adtran-file-transfer:read-adtn-file-xfer-sftp-cfg",
        "adtran-file-transfer:modify-adtn-file-xfer-sftp-cfg"
      ]
    },
    {
      "name": "adtran-cloud-platform-event-enrichment-helper",
      "permission": [
        "adtran-cloud-platform-event-enrichment-helper:event-enrichment-helper"
      ]
    },
    {
      "name": "adtran-cloud-platform-profiles-scoped-shaping",
      "permission": []
    },
    {
      "name": "adtran-cloud-platform-uiworkflow-bundles",
      "permission": [
        "adtran-cloud-platform-uiworkflow-bundles:read-uiworkflow-bundle-type",
        "adtran-cloud-platform-uiworkflow-bundles:read-uiworkflow-bundles",
        "adtran-cloud-platform-uiworkflow-bundles:filter-uiworkflow-bundle-resources"
      ]
    },
    {
      "name": "adtran-cloud-platform-profiles-event-config",
      "permission": []
    },
    {
      "name": "adtran-pma-adapter",
      "permission": []
    },
    {
      "name": "adtran-cloud-platform-credentials",
      "permission": [
        "adtran-cloud-platform-credentials:read-adtn-cld-pfrm-crdls",
        "adtran-cloud-platform-credentials:modify-adtn-cld-pfrm-crdls"
      ]
    },
    {
      "name": "adtran-cloud-platform-plugin-adtn-602x-onu-segment-data",
      "permission": []
    },
    {
      "name": "adtran-cloud-platform-profiles-tcont",
      "permission": []
    },
    {
      "name": "adtran-cloud-platform-plugin-device-netconf-lock-state",
      "permission": []
    },
    {
      "name": "adtran-cloud-platform-job-config",
      "permission": []
    },
    {
      "name": "adtran-cloud-platform-deferred-intent-service",
      "permission": [
        "adtran-cloud-platform-deferred-intent-service:execute-intent-operation"
      ]
    },
    {
      "name": "adtran-cloud-platform-types",
      "permission": []
    },
    {
      "name": "adtran-cloud-platform-usage-report",
      "permission": []
    },
    {
      "name": "adtran-vssm-gx-config",
      "permission": [
        "adtran-vssm-gx-config:read-gx-apn-config"
      ]
    },
    {
      "name": "adtran-cloud-platform-sse-client",
      "permission": []
    },
    {
      "name": "adtran-cloud-platform-settings",
      "permission": [
        "adtran-cloud-platform-settings:read-adtn-cld-pfrm-set",
        "adtran-cloud-platform-settings:modify-adtn-cld-pfrm-set"
      ]
    },
    {
      "name": "adtran-cloud-platform-uiworkflow-device-credentials",
      "permission": [
        "adtran-cloud-platform-uiworkflow-device-credentials:read-adtn-cld-pfrm-uiw-dev-crdls"
      ]
    },
    {
      "name": "adtran-cloud-platform-bulk-alarm-count",
      "permission": []
    },
    {
      "name": "adtran-cloud-platform-uiworkflow-services-cfm",
      "permission": []
    },
    {
      "name": "adtran-cloud-platform-profiles-subscriber-access-control",
      "permission": []
    },
    {
      "name": "adtran-cloud-platform-uiworkflow-devices-activate",
      "permission": []
    },
    {
      "name": "adtran-cloud-platform-profiles-configuration-storage",
      "permission": []
    },
    {
      "name": "adtran-cloud-platform-subscriber-session-manager",
      "permission": [
        "adtran-cloud-platform-subscriber-session-manager:config-sessions",
        "adtran-cloud-platform-subscriber-session-manager:read-subscribers"
      ]
    },
    {
      "name": "adtran-device-connectivity",
      "permission": []
    },
    {
      "name": "adtran-ffui-workboards",
      "permission": [
        "adtran-ffui-workboards:modify-workboards",
        "adtran-ffui-workboards:read-workboards"
      ]
    },
    {
      "name": "adtran-cxui-vqm-interface",
      "permission": []
    },
    {
      "name": "adtran-cloud-platform-vssm-gx-statistics",
      "permission": [
        "adtran-cloud-platform-vssm-gx-statistics:gx-stats-perm"
      ]
    },
    {
      "name": "adtran-cloud-platform-profiles-pon-multicast",
      "permission": []
    },
    {
      "name": "adtran-nbi-sysmon",
      "permission": [
        "adtran-nbi-sysmon:sysmon-config",
        "adtran-nbi-sysmon:sysmon-read"
      ]
    },
    {
      "name": "adtran-cloud-platform-marshal-plugins",
      "permission": []
    },
    {
      "name": "adtran-billing-system-management",
      "permission": []
    },
    {
      "name": "adtran-cloud-platform-inventory",
      "permission": []
    },
    {
      "name": "adtran-cxui-device-stats",
      "permission": []
    },
    {
      "name": "adtran-nbi-ipaa",
      "permission": [
        "adtran-nbi-ipaa:ipaa-config"
      ]
    },
    {
      "name": "adtran-cloud-platform-uiworkflow-profiles",
      "permission": [
        "adtran-cloud-platform-uiworkflow-profiles:read-profile"
      ]
    },
    {
      "name": "adtran-cloud-platform-network-walk-job",
      "permission": []
    },
    {
      "name": "adtran-cloud-platform-profiles-pon-port",
      "permission": []
    },
    {
      "name": "adtran-cloud-platform-management-domain-coordination",
      "permission": [
        "adtran-cloud-platform-management-domain-coordination:config-mgmt-domains",
        "adtran-cloud-platform-management-domain-coordination:deploy-mgmt-domains",
        "adtran-cloud-platform-management-domain-coordination:activate-mgmt-domains",
        "adtran-cloud-platform-management-domain-coordination:delete-mgmt-domains",
        "adtran-cloud-platform-management-domain-coordination:undeploy-mgmt-domains",
        "adtran-cloud-platform-management-domain-coordination:deactivate-mgmt-domains"
      ]
    },
    {
      "name": "adtran-cloud-platform-search-labels-by-object",
      "permission": []
    },
    {
      "name": "adtran-cloud-platform-maintenance-services",
      "permission": [
        "adtran-cloud-platform-maintenance-services:execute-action",
        "adtran-cloud-platform-maintenance-services:read-action-status"
      ]
    },
    {
      "name": "adtran-captive-portal-services",
      "permission": [
        "adtran-captive-portal-services:read-service",
        "adtran-captive-portal-services:modify-service",
        "adtran-captive-portal-services:read-service-status",
        "adtran-captive-portal-services:configure-service",
        "adtran-captive-portal-services:deploy-service",
        "adtran-captive-portal-services:activate-service",
        "adtran-captive-portal-services:deactivate-service",
        "adtran-captive-portal-services:undeploy-service",
        "adtran-captive-portal-services:delete-service",
        "adtran-captive-portal-services:find-service"
      ]
    },
    {
      "name": "adtran-cloud-platform-profiles-device-software",
      "permission": []
    },
    {
      "name": "adtran-device-proxy-by-name",
      "permission": []
    },
    {
      "name": "adtran-cp-profiles-gfast-line-threshold-profile-body",
      "permission": []
    },
    {
      "name": "adtran-cloud-platform-netconf-client-service",
      "permission": [
        "adtran-cloud-platform-netconf-client-service:open-session",
        "adtran-cloud-platform-netconf-client-service:close-session",
        "adtran-cloud-platform-netconf-client-service:read-session",
        "adtran-cloud-platform-netconf-client-service:read-config",
        "adtran-cloud-platform-netconf-client-service:write-config",
        "adtran-cloud-platform-netconf-client-service:delete-config",
        "adtran-cloud-platform-netconf-client-service:subscribe-notifications",
        "adtran-cloud-platform-netconf-client-service:unsubscribe-notifications",
        "adtran-cloud-platform-netconf-client-service:read-schema",
        "adtran-cloud-platform-netconf-client-service:reestablish-session",
        "adtran-cloud-platform-netconf-client-service:get-all-device-sessions",
        "adtran-cloud-platform-netconf-client-service:reboot-device",
        "adtran-cloud-platform-netconf-client-service:execute-rpc"
      ]
    },
    {
      "name": "adtran-captive-portal-types",
      "permission": [
        "adtran-captive-portal-types:read-server-credentials",
        "adtran-captive-portal-types:modify-server-credentials",
        "adtran-captive-portal-types:read-activation-logs",
        "adtran-captive-portal-types:read-user-logs",
        "adtran-captive-portal-types:activate-service"
      ]
    },
    {
      "name": "adtran-dhcp-leases",
      "permission": [
        "adtran-dhcp-leases:read-adtn-dhcp-lease"
      ]
    },
    {
      "name": "adtran-cloud-platform-search-global",
      "permission": []
    },
    {
      "name": "adtran-cloud-platform-event-config",
      "permission": []
    },
    {
      "name": "adtran-cloud-platform-diameter-config",
      "permission": [
        "adtran-cloud-platform-diameter-config:diameter-config"
      ]
    }
  ]
}