{
  "actions": [
    {
      "name": "configureBundle",
      "protocol": "REST",
      "method": "POST",
      "entitypath": "{base_path}/{version}/operations/adtran-cloud-platform-uiworkflow:configure?{query}",
      "requestSchema": "schema.json",
      "responseSchema": "schema.json",
      "timeout": 0,
      "sendEmpty": false,
      "requestDatatype": "JSON",
      "responseDatatype": "JSON",
      "headers": {},
      "responseObjects": [
        {
          "type": "default",
          "key": "",
          "mockFile": ""
        }
      ]
    },
    {
      "name": "getBundle",
      "protocol": "REST",
      "method": "GET",
      "entitypath": "{base_path}/{version}/data/adtran-cloud-platform-uiworkflow-bundles:bundles/{pathv1}?{query}",
      "requestSchema": "schema.json",
      "responseSchema": "schema.json",
      "timeout": 0,
      "sendEmpty": false,
      "sendGetBody": false,
      "requestDatatype": "JSON",
      "responseDatatype": "JSON",
      "headers": {},
      "responseObjects": [
        {
          "type": "default",
          "key": "",
          "mockFile": ""
        }
      ]
    },
    {
      "name": "getAllBundles",
      "protocol": "REST",
      "method": "GET",
      "entitypath": "{base_path}/{version}/data/adtran-cloud-platform-uiworkflow-bundles:bundles/bundle?{query}",
      "requestSchema": "schema.json",
      "responseSchema": "schema.json",
      "timeout": 0,
      "sendEmpty": false,
      "sendGetBody": false,
      "requestDatatype": "JSON",
      "responseDatatype": "JSON",
      "headers": {},
      "responseObjects": [
        {
          "type": "default",
          "key": "",
          "mockFile": "mockdatafiles/getAllBundles-default.json"
        }
      ]
    },
    {
      "name": "deactivateBundle",
      "protocol": "REST",
      "method": "POST",
      "entitypath": "{base_path}/{version}/operations/adtran-cloud-platform-uiworkflow:deactivate?{query}",
      "requestSchema": "schema.json",
      "responseSchema": "schema.json",
      "timeout": 0,
      "sendEmpty": false,
      "requestDatatype": "JSON",
      "responseDatatype": "JSON",
      "headers": {},
      "responseObjects": [
        {
          "type": "default",
          "key": "",
          "mockFile": ""
        }
      ]
    },
    {
      "name": "undeployBundle",
      "protocol": "REST",
      "method": "POST",
      "entitypath": "{base_path}/{version}/operations/adtran-cloud-platform-uiworkflow:undeploy?{query}",
      "requestSchema": "schema.json",
      "responseSchema": "schema.json",
      "timeout": 0,
      "sendEmpty": false,
      "requestDatatype": "JSON",
      "responseDatatype": "JSON",
      "headers": {},
      "responseObjects": [
        {
          "type": "default",
          "key": "",
          "mockFile": ""
        }
      ]
    },
    {
      "name": "deleteBundle",
      "protocol": "REST",
      "method": "POST",
      "entitypath": "{base_path}/{version}/operations/adtran-cloud-platform-uiworkflow:delete?{query}",
      "requestSchema": "schema.json",
      "responseSchema": "schema.json",
      "timeout": 0,
      "sendEmpty": false,
      "requestDatatype": "JSON",
      "responseDatatype": "JSON",
      "headers": {},
      "responseObjects": [
        {
          "type": "default",
          "key": "",
          "mockFile": ""
        }
      ]
    }
  ]
}