[
  {
    "device-name": "device_test1",
    "state": "configured",
    "management-domain": "static-ipv4-device_test1",
    "base-configuration": "",
    "part-number": "11971320F1",
    "profile-vector-name": "OLT Config Vector",
    "model-name": "SDX 6310 16-port 10G OLT",
    "credentials-name": "pmaa-default"
  },
  {
    "device-name": "device_test1",
    "state": "configured",
    "management-domain": "static-ipv4-device_test1",
    "base-configuration": "",
    "part-number": "11971320F1",
    "profile-vector-name": "OLT Config Vector",
    "model-name": "SDX 6310 16-port 10G OLT",
    "credentials-name": "pmaa-default"
  },
  {
    "device-name": "device_test1",
    "state": "configured",
    "management-domain": "static-ipv4-device_test1",
    "base-configuration": "",
    "part-number": "11971320F1",
    "profile-vector-name": "OLT Config Vector",
    "model-name": "SDX 6310 16-port 10G OLT",
    "credentials-name": "pmaa-default"
  }
]