{
  "actions": [
    {
      "name": "queryInterface",
      "protocol": "REST",
      "method": "GET",
      "entitypath": "{base_path}/{version}/data/adtran-cloud-platform-interfaces:interfaces/{pathv1}?{query}",
      "requestSchema": "schema.json",
      "responseSchema": "schema.json",
      "timeout": 0,
      "sendEmpty": false,
      "sendGetBody": false,
      "requestDatatype": "JSON",
      "responseDatatype": "JSON",
      "headers": {},
      "responseObjects": [
        {
          "type": "default",
          "key": "",
          "mockFile": ""
        }
      ]
    },
    {
      "name": "queryInterfaceInspect",
      "protocol": "REST",
      "method": "GET",
      "entitypath": "{base_path}/{version}/data/adtran-cloud-platform-interfaces:interfaces/{pathv1}/inspect?{query}",
      "requestSchema": "schema.json",
      "responseSchema": "schema.json",
      "timeout": 0,
      "sendEmpty": false,
      "sendGetBody": false,
      "requestDatatype": "JSON",
      "responseDatatype": "JSON",
      "headers": {},
      "responseObjects": [
        {
          "type": "default",
          "key": "",
          "mockFile": ""
        }
      ]
    },
    {
      "name": "queryInterfaceInspectattachedGadgets",
      "protocol": "REST",
      "method": "GET",
      "entitypath": "{base_path}/{version}/data/adtran-cloud-platform-interfaces:interfaces/{pathv1}/inspect/attached-gadgets?{query}",
      "requestSchema": "schema.json",
      "responseSchema": "schema.json",
      "timeout": 0,
      "sendEmpty": false,
      "sendGetBody": false,
      "requestDatatype": "JSON",
      "responseDatatype": "JSON",
      "headers": {},
      "responseObjects": [
        {
          "type": "default",
          "key": "",
          "mockFile": ""
        }
      ]
    }
  ]
}