{
  "output": {
    "object-list": [
      {
        "name": "OLT-1",
        "type": "device",
        "is-expandable": false,
        "slot-number": ""
      },
      {
        "name": "TestDevice",
        "type": "device",
        "is-expandable": false,
        "slot-number": ""
      },
      {
        "name": "TestDevice-2",
        "type": "device",
        "is-expandable": false,
        "slot-number": ""
      },
      {
        "name": "TestDevice-3",
        "type": "device",
        "is-expandable": false,
        "slot-number": ""
      }
    ],
    "total-count": 4
  }
}