[
  {
    "subtended-device-names": [
      "ONU-0"
    ],
    "device-name": "OLT-1",
    "interface-type": "gpon",
    "state": "activated",
    "interface-name": "XPON2-OLT-1",
    "bundle-name": "CP-4391-1",
    "interface-id": "gpon 0/2",
    "lower-layer-interfaces": [
      "channel 15"
    ],
    "metadata": {
      "device-scoped-interface-name": [
        "channel-pair 4391.1.15",
        "channel-termination 0/2"
      ]
    },
    "profile-vector-name": "XPON Profile Vector",
    "number-of-lower-layer-interfaces": 1
  },
  {
    "subtended-device-names": [
      "ONU-0"
    ],
    "device-name": "OLT-1",
    "interface-type": "gpon",
    "state": "activated",
    "interface-name": "XPON2-OLT-1",
    "bundle-name": "CP-4391-1",
    "interface-id": "gpon 0/2",
    "lower-layer-interfaces": [
      "channel 15"
    ],
    "metadata": {
      "device-scoped-interface-name": [
        "channel-pair 4391.1.15",
        "channel-termination 0/2"
      ]
    },
    "profile-vector-name": "XPON Profile Vector",
    "number-of-lower-layer-interfaces": 1
  }
]