{
  "output": {
    "trans-id": "62621e75-df7e-475a-8cba-0e618730753c",
    "completion-status": "failure",
    "final-result": [
      {
        "input": {
          "device-name": "device-1",
          "action": "Activate Device Software",
          "prev-blocking": true
        },
        "output": {
          "error_description": "Software activation is not performed as the candidate revision:11971320F1-ML-6713 is not same as target revision:NA"
        }
      }
    ]
  }
}