[
  {
    "user-type": "internal",
    "last-login-time": "2020-05-05T09:27:31.035Z",
    "username": "ADMIN",
    "account-status": "active",
    "password-expiration-date": "2020-07-31T10:20:49.115Z",
    "failed-login-attempts": 0,
    "password-expiry-days": 90,
    "account-expiration-date": "",
    "max-failed-logins": 5,
    "logged-in": true,
    "password-notice-days": 5,
    "account-lock-period": 5,
    "authorization-mode": [
      "internal"
    ],
    "authentication-mode": [
      "internal"
    ],
    "group": [
      "super-user"
    ]
  },
  {
    "user-type": "internal",
    "last-login-time": "2020-05-05T09:25:19.807Z",
    "username": "Test-Account",
    "account-status": "active",
    "password-expiration-date": "2020-08-03T09:25:19.850Z",
    "failed-login-attempts": 0,
    "password-expiry-days": 90,
    "account-expiration-date": "",
    "max-failed-logins": 5,
    "logged-in": false,
    "password-notice-days": 5,
    "account-lock-period": 5,
    "authorization-mode": [
      "internal"
    ],
    "authentication-mode": [
      "internal"
    ],
    "group": []
  },
  {
    "user-type": "internal",
    "last-login-time": "",
    "username": "Test-User-Account",
    "account-status": "active",
    "password-expiration-date": "2020-05-04T09:21:16.018Z",
    "failed-login-attempts": 0,
    "password-expiry-days": 90,
    "account-expiration-date": "",
    "max-failed-logins": 5,
    "logged-in": false,
    "password-notice-days": 5,
    "account-lock-period": 5,
    "authorization-mode": [
      "internal"
    ],
    "authentication-mode": [
      "internal"
    ],
    "group": []
  }
]