[
  {
    "id": 10,
    "virtualIp": "string",
    "privateServiceEdge": false,
    "datacenter": "string"
  },
  {
    "id": 3,
    "virtualIp": "string",
    "privateServiceEdge": false,
    "datacenter": "string"
  },
  {
    "id": 9,
    "virtualIp": "string",
    "privateServiceEdge": true,
    "datacenter": "string"
  }
]