{
  "id": 5,
  "type": "IP",
  "fqdn": "string",
  "preSharedKey": "string",
  "comments": "string",
  "location": [
    {
      "id": 8,
      "name": "string",
      "extensions": {}
    },
    {
      "id": 6,
      "name": "string",
      "extensions": {}
    },
    {
      "id": 8,
      "name": "string",
      "extensions": {}
    },
    {
      "id": 1,
      "name": "string",
      "extensions": {}
    }
  ],
  "managedBy": [
    {
      "id": 1,
      "name": "string",
      "extensions": {}
    },
    {
      "id": 10,
      "name": "string",
      "extensions": {}
    },
    {
      "id": 5,
      "name": "string",
      "extensions": {}
    },
    {
      "id": 10,
      "name": "string",
      "extensions": {}
    },
    {
      "id": 9,
      "name": "string",
      "extensions": {}
    }
  ]
}