[
  {
    "id": 1,
    "name": "string",
    "order": 5,
    "protocols": [
      "FTP_RULE",
      "HTTPS_RULE"
    ],
    "locations": [
      {
        "id": 1,
        "name": "string",
        "externalId": "string",
        "extensions": {}
      },
      {
        "id": 9,
        "name": "string",
        "externalId": "string",
        "extensions": {}
      },
      {
        "id": 10,
        "name": "string",
        "externalId": "string",
        "extensions": {}
      },
      {
        "id": 5,
        "name": "string",
        "externalId": "string",
        "extensions": {}
      },
      {
        "id": 3,
        "name": "string",
        "externalId": "string",
        "extensions": {}
      },
      {
        "id": 2,
        "name": "string",
        "externalId": "string",
        "extensions": {}
      },
      {
        "id": 9,
        "name": "string",
        "externalId": "string",
        "extensions": {}
      },
      {
        "id": 1,
        "name": "string",
        "externalId": "string",
        "extensions": {}
      }
    ],
    "groups": [
      {
        "id": 3,
        "name": "string",
        "externalId": "string",
        "extensions": {}
      },
      {
        "id": 5,
        "name": "string",
        "externalId": "string",
        "extensions": {}
      },
      {
        "id": 5,
        "name": "string",
        "externalId": "string",
        "extensions": {}
      },
      {
        "id": 5,
        "name": "string",
        "externalId": "string",
        "extensions": {}
      },
      {
        "id": 8,
        "name": "string",
        "externalId": "string",
        "extensions": {}
      },
      {
        "id": 2,
        "name": "string",
        "externalId": "string",
        "extensions": {}
      },
      {
        "id": 4,
        "name": "string",
        "externalId": "string",
        "extensions": {}
      },
      {
        "id": 5,
        "name": "string",
        "externalId": "string",
        "extensions": {}
      },
      {
        "id": 1,
        "name": "string",
        "externalId": "string",
        "extensions": {}
      }
    ],
    "departments": [
      {
        "id": 5,
        "name": "string",
        "externalId": "string",
        "extensions": {}
      },
      {
        "id": 10,
        "name": "string",
        "externalId": "string",
        "extensions": {}
      },
      {
        "id": 4,
        "name": "string",
        "externalId": "string",
        "extensions": {}
      },
      {
        "id": 7,
        "name": "string",
        "externalId": "string",
        "extensions": {}
      },
      {
        "id": 4,
        "name": "string",
        "externalId": "string",
        "extensions": {}
      }
    ],
    "users": [
      {
        "id": 9,
        "name": "string",
        "externalId": "string",
        "extensions": {}
      },
      {
        "id": 9,
        "name": "string",
        "externalId": "string",
        "extensions": {}
      },
      {
        "id": 10,
        "name": "string",
        "externalId": "string",
        "extensions": {}
      },
      {
        "id": 10,
        "name": "string",
        "externalId": "string",
        "extensions": {}
      },
      {
        "id": 8,
        "name": "string",
        "externalId": "string",
        "extensions": {}
      },
      {
        "id": 1,
        "name": "string",
        "externalId": "string",
        "extensions": {}
      },
      {
        "id": 1,
        "name": "string",
        "externalId": "string",
        "extensions": {}
      },
      {
        "id": 10,
        "name": "string",
        "externalId": "string",
        "extensions": {}
      },
      {
        "id": 1,
        "name": "string",
        "externalId": "string",
        "extensions": {}
      },
      {
        "id": 7,
        "name": "string",
        "externalId": "string",
        "extensions": {}
      }
    ],
    "urlCategories": [
      "string"
    ],
    "state": null,
    "timeWindows": [
      {
        "id": 9,
        "name": "string",
        "externalId": "string",
        "extensions": {}
      },
      {
        "id": 3,
        "name": "string",
        "externalId": "string",
        "extensions": {}
      },
      {
        "id": 4,
        "name": "string",
        "externalId": "string",
        "extensions": {}
      },
      {
        "id": 4,
        "name": "string",
        "externalId": "string",
        "extensions": {}
      },
      {
        "id": 5,
        "name": "string",
        "externalId": "string",
        "extensions": {}
      },
      {
        "id": 5,
        "name": "string",
        "externalId": "string",
        "extensions": {}
      },
      {
        "id": 3,
        "name": "string",
        "externalId": "string",
        "extensions": {}
      }
    ],
    "workloadGroups": [
      {
        "id": 10,
        "name": "string",
        "description": "string",
        "expressionJson": {
          "expressionContainers": [
            {
              "tagType": null,
              "operator": null,
              "tagContainer": {
                "tags": [
                  {
                    "key": "string",
                    "value": "string"
                  },
                  {
                    "key": "string",
                    "value": "string"
                  }
                ],
                "operator": null
              }
            },
            {
              "tagType": null,
              "operator": null,
              "tagContainer": {
                "tags": [
                  {
                    "key": "string",
                    "value": "string"
                  },
                  {
                    "key": "string",
                    "value": "string"
                  },
                  {
                    "key": "string",
                    "value": "string"
                  }
                ],
                "operator": null
              }
            },
            {
              "tagType": null,
              "operator": null,
              "tagContainer": {
                "tags": [
                  {
                    "key": "string",
                    "value": "string"
                  },
                  {
                    "key": "string",
                    "value": "string"
                  },
                  {
                    "key": "string",
                    "value": "string"
                  },
                  {
                    "key": "string",
                    "value": "string"
                  },
                  {
                    "key": "string",
                    "value": "string"
                  },
                  {
                    "key": "string",
                    "value": "string"
                  },
                  {
                    "key": "string",
                    "value": "string"
                  },
                  {
                    "key": "string",
                    "value": "string"
                  },
                  {
                    "key": "string",
                    "value": "string"
                  }
                ],
                "operator": null
              }
            },
            {
              "tagType": null,
              "operator": null,
              "tagContainer": {
                "tags": [
                  {
                    "key": "string",
                    "value": "string"
                  },
                  {
                    "key": "string",
                    "value": "string"
                  },
                  {
                    "key": "string",
                    "value": "string"
                  },
                  {
                    "key": "string",
                    "value": "string"
                  }
                ],
                "operator": null
              }
            },
            {
              "tagType": null,
              "operator": null,
              "tagContainer": {
                "tags": [
                  {
                    "key": "string",
                    "value": "string"
                  },
                  {
                    "key": "string",
                    "value": "string"
                  },
                  {
                    "key": "string",
                    "value": "string"
                  },
                  {
                    "key": "string",
                    "value": "string"
                  },
                  {
                    "key": "string",
                    "value": "string"
                  },
                  {
                    "key": "string",
                    "value": "string"
                  }
                ],
                "operator": null
              }
            }
          ]
        },
        "expression": "string",
        "lastModifiedTime": 2,
        "lastModifiedBy": {
          "id": 1,
          "name": "string",
          "externalId": "string",
          "extensions": {}
        }
      },
      {
        "id": 7,
        "name": "string",
        "description": "string",
        "expressionJson": {
          "expressionContainers": [
            {
              "tagType": null,
              "operator": null,
              "tagContainer": {
                "tags": [
                  {
                    "key": "string",
                    "value": "string"
                  },
                  {
                    "key": "string",
                    "value": "string"
                  },
                  {
                    "key": "string",
                    "value": "string"
                  },
                  {
                    "key": "string",
                    "value": "string"
                  },
                  {
                    "key": "string",
                    "value": "string"
                  },
                  {
                    "key": "string",
                    "value": "string"
                  },
                  {
                    "key": "string",
                    "value": "string"
                  }
                ],
                "operator": null
              }
            },
            {
              "tagType": null,
              "operator": null,
              "tagContainer": {
                "tags": [
                  {
                    "key": "string",
                    "value": "string"
                  },
                  {
                    "key": "string",
                    "value": "string"
                  },
                  {
                    "key": "string",
                    "value": "string"
                  },
                  {
                    "key": "string",
                    "value": "string"
                  },
                  {
                    "key": "string",
                    "value": "string"
                  },
                  {
                    "key": "string",
                    "value": "string"
                  }
                ],
                "operator": null
              }
            },
            {
              "tagType": null,
              "operator": null,
              "tagContainer": {
                "tags": [
                  {
                    "key": "string",
                    "value": "string"
                  },
                  {
                    "key": "string",
                    "value": "string"
                  },
                  {
                    "key": "string",
                    "value": "string"
                  },
                  {
                    "key": "string",
                    "value": "string"
                  },
                  {
                    "key": "string",
                    "value": "string"
                  },
                  {
                    "key": "string",
                    "value": "string"
                  },
                  {
                    "key": "string",
                    "value": "string"
                  },
                  {
                    "key": "string",
                    "value": "string"
                  },
                  {
                    "key": "string",
                    "value": "string"
                  },
                  {
                    "key": "string",
                    "value": "string"
                  }
                ],
                "operator": null
              }
            },
            {
              "tagType": null,
              "operator": null,
              "tagContainer": {
                "tags": [
                  {
                    "key": "string",
                    "value": "string"
                  },
                  {
                    "key": "string",
                    "value": "string"
                  }
                ],
                "operator": null
              }
            }
          ]
        },
        "expression": "string",
        "lastModifiedTime": 6,
        "lastModifiedBy": {
          "id": 4,
          "name": "string",
          "externalId": "string",
          "extensions": {}
        }
      },
      {
        "id": 2,
        "name": "string",
        "description": "string",
        "expressionJson": {
          "expressionContainers": [
            {
              "tagType": null,
              "operator": null,
              "tagContainer": {
                "tags": [
                  {
                    "key": "string",
                    "value": "string"
                  },
                  {
                    "key": "string",
                    "value": "string"
                  },
                  {
                    "key": "string",
                    "value": "string"
                  },
                  {
                    "key": "string",
                    "value": "string"
                  },
                  {
                    "key": "string",
                    "value": "string"
                  }
                ],
                "operator": null
              }
            },
            {
              "tagType": null,
              "operator": null,
              "tagContainer": {
                "tags": [
                  {
                    "key": "string",
                    "value": "string"
                  },
                  {
                    "key": "string",
                    "value": "string"
                  },
                  {
                    "key": "string",
                    "value": "string"
                  },
                  {
                    "key": "string",
                    "value": "string"
                  }
                ],
                "operator": null
              }
            },
            {
              "tagType": null,
              "operator": null,
              "tagContainer": {
                "tags": [
                  {
                    "key": "string",
                    "value": "string"
                  },
                  {
                    "key": "string",
                    "value": "string"
                  },
                  {
                    "key": "string",
                    "value": "string"
                  }
                ],
                "operator": null
              }
            },
            {
              "tagType": null,
              "operator": null,
              "tagContainer": {
                "tags": [
                  {
                    "key": "string",
                    "value": "string"
                  },
                  {
                    "key": "string",
                    "value": "string"
                  },
                  {
                    "key": "string",
                    "value": "string"
                  }
                ],
                "operator": null
              }
            },
            {
              "tagType": null,
              "operator": null,
              "tagContainer": {
                "tags": [
                  {
                    "key": "string",
                    "value": "string"
                  },
                  {
                    "key": "string",
                    "value": "string"
                  },
                  {
                    "key": "string",
                    "value": "string"
                  },
                  {
                    "key": "string",
                    "value": "string"
                  },
                  {
                    "key": "string",
                    "value": "string"
                  },
                  {
                    "key": "string",
                    "value": "string"
                  },
                  {
                    "key": "string",
                    "value": "string"
                  },
                  {
                    "key": "string",
                    "value": "string"
                  }
                ],
                "operator": null
              }
            },
            {
              "tagType": null,
              "operator": null,
              "tagContainer": {
                "tags": [
                  {
                    "key": "string",
                    "value": "string"
                  },
                  {
                    "key": "string",
                    "value": "string"
                  },
                  {
                    "key": "string",
                    "value": "string"
                  },
                  {
                    "key": "string",
                    "value": "string"
                  },
                  {
                    "key": "string",
                    "value": "string"
                  },
                  {
                    "key": "string",
                    "value": "string"
                  },
                  {
                    "key": "string",
                    "value": "string"
                  },
                  {
                    "key": "string",
                    "value": "string"
                  },
                  {
                    "key": "string",
                    "value": "string"
                  }
                ],
                "operator": null
              }
            },
            {
              "tagType": null,
              "operator": null,
              "tagContainer": {
                "tags": [
                  {
                    "key": "string",
                    "value": "string"
                  },
                  {
                    "key": "string",
                    "value": "string"
                  },
                  {
                    "key": "string",
                    "value": "string"
                  },
                  {
                    "key": "string",
                    "value": "string"
                  },
                  {
                    "key": "string",
                    "value": "string"
                  },
                  {
                    "key": "string",
                    "value": "string"
                  }
                ],
                "operator": null
              }
            },
            {
              "tagType": null,
              "operator": null,
              "tagContainer": {
                "tags": [
                  {
                    "key": "string",
                    "value": "string"
                  },
                  {
                    "key": "string",
                    "value": "string"
                  },
                  {
                    "key": "string",
                    "value": "string"
                  },
                  {
                    "key": "string",
                    "value": "string"
                  },
                  {
                    "key": "string",
                    "value": "string"
                  }
                ],
                "operator": null
              }
            },
            {
              "tagType": null,
              "operator": null,
              "tagContainer": {
                "tags": [
                  {
                    "key": "string",
                    "value": "string"
                  },
                  {
                    "key": "string",
                    "value": "string"
                  }
                ],
                "operator": null
              }
            }
          ]
        },
        "expression": "string",
        "lastModifiedTime": 6,
        "lastModifiedBy": {
          "id": 8,
          "name": "string",
          "externalId": "string",
          "extensions": {}
        }
      }
    ],
    "rank": 7,
    "requestMethods": [
      "PUT",
      "HEAD",
      "CONNECT",
      "PUT",
      "DELETE",
      "CONNECT",
      "POST",
      "PUT"
    ],
    "endUserNotificationUrl": "string",
    "overrideUsers": [
      {
        "id": 7,
        "name": "string",
        "externalId": "string",
        "extensions": {}
      },
      {
        "id": 8,
        "name": "string",
        "externalId": "string",
        "extensions": {}
      },
      {
        "id": 8,
        "name": "string",
        "externalId": "string",
        "extensions": {}
      },
      {
        "id": 8,
        "name": "string",
        "externalId": "string",
        "extensions": {}
      },
      {
        "id": 9,
        "name": "string",
        "externalId": "string",
        "extensions": {}
      },
      {
        "id": 7,
        "name": "string",
        "externalId": "string",
        "extensions": {}
      },
      {
        "id": 3,
        "name": "string",
        "externalId": "string",
        "extensions": {}
      },
      {
        "id": 9,
        "name": "string",
        "externalId": "string",
        "extensions": {}
      }
    ],
    "overrideGroups": [
      {
        "id": 3,
        "name": "string",
        "externalId": "string",
        "extensions": {}
      },
      {
        "id": 1,
        "name": "string",
        "externalId": "string",
        "extensions": {}
      },
      {
        "id": 10,
        "name": "string",
        "externalId": "string",
        "extensions": {}
      }
    ],
    "blockOverride": false,
    "timeQuota": 6,
    "sizeQuota": 7,
    "description": "string",
    "locationGroups": [
      {
        "id": 7,
        "name": "string",
        "externalId": "string",
        "extensions": {}
      },
      {
        "id": 9,
        "name": "string",
        "externalId": "string",
        "extensions": {}
      },
      {
        "id": 5,
        "name": "string",
        "externalId": "string",
        "extensions": {}
      }
    ],
    "labels": [
      {
        "id": 6,
        "name": "string",
        "externalId": "string",
        "extensions": {}
      },
      {
        "id": 5,
        "name": "string",
        "externalId": "string",
        "extensions": {}
      },
      {
        "id": 5,
        "name": "string",
        "externalId": "string",
        "extensions": {}
      }
    ],
    "validityStartTime": 4,
    "validityEndTime": 6,
    "validityTimeZoneId": "string",
    "lastModifiedTime": 4,
    "lastModifiedBy": {
      "id": 5,
      "name": "string",
      "externalId": "string",
      "extensions": {}
    },
    "enforceTimeValidity": true,
    "devices": [
      {
        "id": 3,
        "name": "string",
        "externalId": "string",
        "extensions": {}
      },
      {
        "id": 2,
        "name": "string",
        "externalId": "string",
        "extensions": {}
      }
    ],
    "deviceGroups": [
      {
        "id": 4,
        "name": "string",
        "externalId": "string",
        "extensions": {}
      },
      {
        "id": 3,
        "name": "string",
        "externalId": "string",
        "extensions": {}
      }
    ],
    "deviceTrustLevels": [
      "ANY",
      "HIGH_TRUST",
      "HIGH_TRUST",
      "MEDIUM_TRUST",
      "MEDIUM_TRUST"
    ],
    "action": null,
    "cbiProfile": {
      "id": "string",
      "name": "string",
      "url": "string",
      "defaultProfile": true
    },
    "ciparule": false
  },
  {
    "id": 6,
    "name": "string",
    "order": 6,
    "protocols": [
      "TCP_RULE",
      "TCP_RULE",
      "TUNNEL_RULE",
      "UDP_RULE",
      "SMRULEF_ZPA_BROKERS_RULE"
    ],
    "locations": [
      {
        "id": 4,
        "name": "string",
        "externalId": "string",
        "extensions": {}
      },
      {
        "id": 5,
        "name": "string",
        "externalId": "string",
        "extensions": {}
      },
      {
        "id": 3,
        "name": "string",
        "externalId": "string",
        "extensions": {}
      },
      {
        "id": 6,
        "name": "string",
        "externalId": "string",
        "extensions": {}
      },
      {
        "id": 6,
        "name": "string",
        "externalId": "string",
        "extensions": {}
      }
    ],
    "groups": [
      {
        "id": 3,
        "name": "string",
        "externalId": "string",
        "extensions": {}
      },
      {
        "id": 1,
        "name": "string",
        "externalId": "string",
        "extensions": {}
      },
      {
        "id": 2,
        "name": "string",
        "externalId": "string",
        "extensions": {}
      },
      {
        "id": 2,
        "name": "string",
        "externalId": "string",
        "extensions": {}
      },
      {
        "id": 10,
        "name": "string",
        "externalId": "string",
        "extensions": {}
      },
      {
        "id": 4,
        "name": "string",
        "externalId": "string",
        "extensions": {}
      },
      {
        "id": 6,
        "name": "string",
        "externalId": "string",
        "extensions": {}
      },
      {
        "id": 6,
        "name": "string",
        "externalId": "string",
        "extensions": {}
      }
    ],
    "departments": [
      {
        "id": 2,
        "name": "string",
        "externalId": "string",
        "extensions": {}
      },
      {
        "id": 1,
        "name": "string",
        "externalId": "string",
        "extensions": {}
      },
      {
        "id": 2,
        "name": "string",
        "externalId": "string",
        "extensions": {}
      },
      {
        "id": 6,
        "name": "string",
        "externalId": "string",
        "extensions": {}
      },
      {
        "id": 9,
        "name": "string",
        "externalId": "string",
        "extensions": {}
      },
      {
        "id": 8,
        "name": "string",
        "externalId": "string",
        "extensions": {}
      },
      {
        "id": 4,
        "name": "string",
        "externalId": "string",
        "extensions": {}
      },
      {
        "id": 1,
        "name": "string",
        "externalId": "string",
        "extensions": {}
      },
      {
        "id": 9,
        "name": "string",
        "externalId": "string",
        "extensions": {}
      }
    ],
    "users": [
      {
        "id": 7,
        "name": "string",
        "externalId": "string",
        "extensions": {}
      },
      {
        "id": 7,
        "name": "string",
        "externalId": "string",
        "extensions": {}
      }
    ],
    "urlCategories": [
      "string",
      "string",
      "string",
      "string",
      "string",
      "string",
      "string",
      "string"
    ],
    "state": null,
    "timeWindows": [
      {
        "id": 7,
        "name": "string",
        "externalId": "string",
        "extensions": {}
      }
    ],
    "workloadGroups": [
      {
        "id": 9,
        "name": "string",
        "description": "string",
        "expressionJson": {
          "expressionContainers": [
            {
              "tagType": null,
              "operator": null,
              "tagContainer": {
                "tags": [
                  {
                    "key": "string",
                    "value": "string"
                  },
                  {
                    "key": "string",
                    "value": "string"
                  },
                  {
                    "key": "string",
                    "value": "string"
                  },
                  {
                    "key": "string",
                    "value": "string"
                  }
                ],
                "operator": null
              }
            },
            {
              "tagType": null,
              "operator": null,
              "tagContainer": {
                "tags": [
                  {
                    "key": "string",
                    "value": "string"
                  },
                  {
                    "key": "string",
                    "value": "string"
                  },
                  {
                    "key": "string",
                    "value": "string"
                  },
                  {
                    "key": "string",
                    "value": "string"
                  },
                  {
                    "key": "string",
                    "value": "string"
                  },
                  {
                    "key": "string",
                    "value": "string"
                  },
                  {
                    "key": "string",
                    "value": "string"
                  },
                  {
                    "key": "string",
                    "value": "string"
                  },
                  {
                    "key": "string",
                    "value": "string"
                  }
                ],
                "operator": null
              }
            },
            {
              "tagType": null,
              "operator": null,
              "tagContainer": {
                "tags": [
                  {
                    "key": "string",
                    "value": "string"
                  },
                  {
                    "key": "string",
                    "value": "string"
                  },
                  {
                    "key": "string",
                    "value": "string"
                  }
                ],
                "operator": null
              }
            },
            {
              "tagType": null,
              "operator": null,
              "tagContainer": {
                "tags": [
                  {
                    "key": "string",
                    "value": "string"
                  },
                  {
                    "key": "string",
                    "value": "string"
                  },
                  {
                    "key": "string",
                    "value": "string"
                  },
                  {
                    "key": "string",
                    "value": "string"
                  }
                ],
                "operator": null
              }
            },
            {
              "tagType": null,
              "operator": null,
              "tagContainer": {
                "tags": [
                  {
                    "key": "string",
                    "value": "string"
                  },
                  {
                    "key": "string",
                    "value": "string"
                  },
                  {
                    "key": "string",
                    "value": "string"
                  },
                  {
                    "key": "string",
                    "value": "string"
                  },
                  {
                    "key": "string",
                    "value": "string"
                  }
                ],
                "operator": null
              }
            },
            {
              "tagType": null,
              "operator": null,
              "tagContainer": {
                "tags": [
                  {
                    "key": "string",
                    "value": "string"
                  },
                  {
                    "key": "string",
                    "value": "string"
                  },
                  {
                    "key": "string",
                    "value": "string"
                  },
                  {
                    "key": "string",
                    "value": "string"
                  },
                  {
                    "key": "string",
                    "value": "string"
                  },
                  {
                    "key": "string",
                    "value": "string"
                  }
                ],
                "operator": null
              }
            },
            {
              "tagType": null,
              "operator": null,
              "tagContainer": {
                "tags": [
                  {
                    "key": "string",
                    "value": "string"
                  },
                  {
                    "key": "string",
                    "value": "string"
                  }
                ],
                "operator": null
              }
            }
          ]
        },
        "expression": "string",
        "lastModifiedTime": 10,
        "lastModifiedBy": {
          "id": 3,
          "name": "string",
          "externalId": "string",
          "extensions": {}
        }
      },
      {
        "id": 8,
        "name": "string",
        "description": "string",
        "expressionJson": {
          "expressionContainers": [
            {
              "tagType": null,
              "operator": null,
              "tagContainer": {
                "tags": [
                  {
                    "key": "string",
                    "value": "string"
                  },
                  {
                    "key": "string",
                    "value": "string"
                  },
                  {
                    "key": "string",
                    "value": "string"
                  },
                  {
                    "key": "string",
                    "value": "string"
                  }
                ],
                "operator": null
              }
            },
            {
              "tagType": null,
              "operator": null,
              "tagContainer": {
                "tags": [
                  {
                    "key": "string",
                    "value": "string"
                  },
                  {
                    "key": "string",
                    "value": "string"
                  },
                  {
                    "key": "string",
                    "value": "string"
                  },
                  {
                    "key": "string",
                    "value": "string"
                  },
                  {
                    "key": "string",
                    "value": "string"
                  },
                  {
                    "key": "string",
                    "value": "string"
                  },
                  {
                    "key": "string",
                    "value": "string"
                  },
                  {
                    "key": "string",
                    "value": "string"
                  },
                  {
                    "key": "string",
                    "value": "string"
                  }
                ],
                "operator": null
              }
            },
            {
              "tagType": null,
              "operator": null,
              "tagContainer": {
                "tags": [
                  {
                    "key": "string",
                    "value": "string"
                  },
                  {
                    "key": "string",
                    "value": "string"
                  }
                ],
                "operator": null
              }
            }
          ]
        },
        "expression": "string",
        "lastModifiedTime": 8,
        "lastModifiedBy": {
          "id": 9,
          "name": "string",
          "externalId": "string",
          "extensions": {}
        }
      },
      {
        "id": 9,
        "name": "string",
        "description": "string",
        "expressionJson": {
          "expressionContainers": [
            {
              "tagType": null,
              "operator": null,
              "tagContainer": {
                "tags": [
                  {
                    "key": "string",
                    "value": "string"
                  },
                  {
                    "key": "string",
                    "value": "string"
                  },
                  {
                    "key": "string",
                    "value": "string"
                  }
                ],
                "operator": null
              }
            },
            {
              "tagType": null,
              "operator": null,
              "tagContainer": {
                "tags": [
                  {
                    "key": "string",
                    "value": "string"
                  },
                  {
                    "key": "string",
                    "value": "string"
                  },
                  {
                    "key": "string",
                    "value": "string"
                  },
                  {
                    "key": "string",
                    "value": "string"
                  },
                  {
                    "key": "string",
                    "value": "string"
                  },
                  {
                    "key": "string",
                    "value": "string"
                  },
                  {
                    "key": "string",
                    "value": "string"
                  }
                ],
                "operator": null
              }
            },
            {
              "tagType": null,
              "operator": null,
              "tagContainer": {
                "tags": [
                  {
                    "key": "string",
                    "value": "string"
                  },
                  {
                    "key": "string",
                    "value": "string"
                  },
                  {
                    "key": "string",
                    "value": "string"
                  },
                  {
                    "key": "string",
                    "value": "string"
                  },
                  {
                    "key": "string",
                    "value": "string"
                  }
                ],
                "operator": null
              }
            },
            {
              "tagType": null,
              "operator": null,
              "tagContainer": {
                "tags": [
                  {
                    "key": "string",
                    "value": "string"
                  },
                  {
                    "key": "string",
                    "value": "string"
                  },
                  {
                    "key": "string",
                    "value": "string"
                  },
                  {
                    "key": "string",
                    "value": "string"
                  },
                  {
                    "key": "string",
                    "value": "string"
                  }
                ],
                "operator": null
              }
            },
            {
              "tagType": null,
              "operator": null,
              "tagContainer": {
                "tags": [
                  {
                    "key": "string",
                    "value": "string"
                  }
                ],
                "operator": null
              }
            },
            {
              "tagType": null,
              "operator": null,
              "tagContainer": {
                "tags": [
                  {
                    "key": "string",
                    "value": "string"
                  },
                  {
                    "key": "string",
                    "value": "string"
                  },
                  {
                    "key": "string",
                    "value": "string"
                  },
                  {
                    "key": "string",
                    "value": "string"
                  },
                  {
                    "key": "string",
                    "value": "string"
                  }
                ],
                "operator": null
              }
            },
            {
              "tagType": null,
              "operator": null,
              "tagContainer": {
                "tags": [
                  {
                    "key": "string",
                    "value": "string"
                  },
                  {
                    "key": "string",
                    "value": "string"
                  },
                  {
                    "key": "string",
                    "value": "string"
                  },
                  {
                    "key": "string",
                    "value": "string"
                  },
                  {
                    "key": "string",
                    "value": "string"
                  }
                ],
                "operator": null
              }
            }
          ]
        },
        "expression": "string",
        "lastModifiedTime": 1,
        "lastModifiedBy": {
          "id": 2,
          "name": "string",
          "externalId": "string",
          "extensions": {}
        }
      },
      {
        "id": 4,
        "name": "string",
        "description": "string",
        "expressionJson": {
          "expressionContainers": [
            {
              "tagType": null,
              "operator": null,
              "tagContainer": {
                "tags": [
                  {
                    "key": "string",
                    "value": "string"
                  },
                  {
                    "key": "string",
                    "value": "string"
                  },
                  {
                    "key": "string",
                    "value": "string"
                  },
                  {
                    "key": "string",
                    "value": "string"
                  },
                  {
                    "key": "string",
                    "value": "string"
                  },
                  {
                    "key": "string",
                    "value": "string"
                  },
                  {
                    "key": "string",
                    "value": "string"
                  }
                ],
                "operator": null
              }
            },
            {
              "tagType": null,
              "operator": null,
              "tagContainer": {
                "tags": [
                  {
                    "key": "string",
                    "value": "string"
                  },
                  {
                    "key": "string",
                    "value": "string"
                  },
                  {
                    "key": "string",
                    "value": "string"
                  },
                  {
                    "key": "string",
                    "value": "string"
                  },
                  {
                    "key": "string",
                    "value": "string"
                  },
                  {
                    "key": "string",
                    "value": "string"
                  },
                  {
                    "key": "string",
                    "value": "string"
                  }
                ],
                "operator": null
              }
            },
            {
              "tagType": null,
              "operator": null,
              "tagContainer": {
                "tags": [
                  {
                    "key": "string",
                    "value": "string"
                  },
                  {
                    "key": "string",
                    "value": "string"
                  },
                  {
                    "key": "string",
                    "value": "string"
                  },
                  {
                    "key": "string",
                    "value": "string"
                  },
                  {
                    "key": "string",
                    "value": "string"
                  },
                  {
                    "key": "string",
                    "value": "string"
                  },
                  {
                    "key": "string",
                    "value": "string"
                  },
                  {
                    "key": "string",
                    "value": "string"
                  },
                  {
                    "key": "string",
                    "value": "string"
                  },
                  {
                    "key": "string",
                    "value": "string"
                  }
                ],
                "operator": null
              }
            },
            {
              "tagType": null,
              "operator": null,
              "tagContainer": {
                "tags": [
                  {
                    "key": "string",
                    "value": "string"
                  },
                  {
                    "key": "string",
                    "value": "string"
                  },
                  {
                    "key": "string",
                    "value": "string"
                  },
                  {
                    "key": "string",
                    "value": "string"
                  },
                  {
                    "key": "string",
                    "value": "string"
                  },
                  {
                    "key": "string",
                    "value": "string"
                  },
                  {
                    "key": "string",
                    "value": "string"
                  }
                ],
                "operator": null
              }
            },
            {
              "tagType": null,
              "operator": null,
              "tagContainer": {
                "tags": [
                  {
                    "key": "string",
                    "value": "string"
                  },
                  {
                    "key": "string",
                    "value": "string"
                  },
                  {
                    "key": "string",
                    "value": "string"
                  }
                ],
                "operator": null
              }
            },
            {
              "tagType": null,
              "operator": null,
              "tagContainer": {
                "tags": [
                  {
                    "key": "string",
                    "value": "string"
                  },
                  {
                    "key": "string",
                    "value": "string"
                  }
                ],
                "operator": null
              }
            },
            {
              "tagType": null,
              "operator": null,
              "tagContainer": {
                "tags": [
                  {
                    "key": "string",
                    "value": "string"
                  },
                  {
                    "key": "string",
                    "value": "string"
                  },
                  {
                    "key": "string",
                    "value": "string"
                  },
                  {
                    "key": "string",
                    "value": "string"
                  },
                  {
                    "key": "string",
                    "value": "string"
                  },
                  {
                    "key": "string",
                    "value": "string"
                  },
                  {
                    "key": "string",
                    "value": "string"
                  }
                ],
                "operator": null
              }
            }
          ]
        },
        "expression": "string",
        "lastModifiedTime": 6,
        "lastModifiedBy": {
          "id": 10,
          "name": "string",
          "externalId": "string",
          "extensions": {}
        }
      },
      {
        "id": 6,
        "name": "string",
        "description": "string",
        "expressionJson": {
          "expressionContainers": [
            {
              "tagType": null,
              "operator": null,
              "tagContainer": {
                "tags": [
                  {
                    "key": "string",
                    "value": "string"
                  },
                  {
                    "key": "string",
                    "value": "string"
                  },
                  {
                    "key": "string",
                    "value": "string"
                  },
                  {
                    "key": "string",
                    "value": "string"
                  },
                  {
                    "key": "string",
                    "value": "string"
                  },
                  {
                    "key": "string",
                    "value": "string"
                  },
                  {
                    "key": "string",
                    "value": "string"
                  },
                  {
                    "key": "string",
                    "value": "string"
                  },
                  {
                    "key": "string",
                    "value": "string"
                  }
                ],
                "operator": null
              }
            },
            {
              "tagType": null,
              "operator": null,
              "tagContainer": {
                "tags": [
                  {
                    "key": "string",
                    "value": "string"
                  },
                  {
                    "key": "string",
                    "value": "string"
                  },
                  {
                    "key": "string",
                    "value": "string"
                  }
                ],
                "operator": null
              }
            },
            {
              "tagType": null,
              "operator": null,
              "tagContainer": {
                "tags": [
                  {
                    "key": "string",
                    "value": "string"
                  },
                  {
                    "key": "string",
                    "value": "string"
                  },
                  {
                    "key": "string",
                    "value": "string"
                  },
                  {
                    "key": "string",
                    "value": "string"
                  },
                  {
                    "key": "string",
                    "value": "string"
                  },
                  {
                    "key": "string",
                    "value": "string"
                  },
                  {
                    "key": "string",
                    "value": "string"
                  },
                  {
                    "key": "string",
                    "value": "string"
                  },
                  {
                    "key": "string",
                    "value": "string"
                  },
                  {
                    "key": "string",
                    "value": "string"
                  }
                ],
                "operator": null
              }
            }
          ]
        },
        "expression": "string",
        "lastModifiedTime": 7,
        "lastModifiedBy": {
          "id": 3,
          "name": "string",
          "externalId": "string",
          "extensions": {}
        }
      },
      {
        "id": 2,
        "name": "string",
        "description": "string",
        "expressionJson": {
          "expressionContainers": [
            {
              "tagType": null,
              "operator": null,
              "tagContainer": {
                "tags": [
                  {
                    "key": "string",
                    "value": "string"
                  },
                  {
                    "key": "string",
                    "value": "string"
                  },
                  {
                    "key": "string",
                    "value": "string"
                  },
                  {
                    "key": "string",
                    "value": "string"
                  },
                  {
                    "key": "string",
                    "value": "string"
                  },
                  {
                    "key": "string",
                    "value": "string"
                  },
                  {
                    "key": "string",
                    "value": "string"
                  }
                ],
                "operator": null
              }
            },
            {
              "tagType": null,
              "operator": null,
              "tagContainer": {
                "tags": [
                  {
                    "key": "string",
                    "value": "string"
                  },
                  {
                    "key": "string",
                    "value": "string"
                  },
                  {
                    "key": "string",
                    "value": "string"
                  },
                  {
                    "key": "string",
                    "value": "string"
                  },
                  {
                    "key": "string",
                    "value": "string"
                  }
                ],
                "operator": null
              }
            },
            {
              "tagType": null,
              "operator": null,
              "tagContainer": {
                "tags": [
                  {
                    "key": "string",
                    "value": "string"
                  },
                  {
                    "key": "string",
                    "value": "string"
                  },
                  {
                    "key": "string",
                    "value": "string"
                  },
                  {
                    "key": "string",
                    "value": "string"
                  },
                  {
                    "key": "string",
                    "value": "string"
                  },
                  {
                    "key": "string",
                    "value": "string"
                  },
                  {
                    "key": "string",
                    "value": "string"
                  }
                ],
                "operator": null
              }
            }
          ]
        },
        "expression": "string",
        "lastModifiedTime": 4,
        "lastModifiedBy": {
          "id": 1,
          "name": "string",
          "externalId": "string",
          "extensions": {}
        }
      },
      {
        "id": 1,
        "name": "string",
        "description": "string",
        "expressionJson": {
          "expressionContainers": [
            {
              "tagType": null,
              "operator": null,
              "tagContainer": {
                "tags": [
                  {
                    "key": "string",
                    "value": "string"
                  }
                ],
                "operator": null
              }
            },
            {
              "tagType": null,
              "operator": null,
              "tagContainer": {
                "tags": [
                  {
                    "key": "string",
                    "value": "string"
                  },
                  {
                    "key": "string",
                    "value": "string"
                  },
                  {
                    "key": "string",
                    "value": "string"
                  },
                  {
                    "key": "string",
                    "value": "string"
                  },
                  {
                    "key": "string",
                    "value": "string"
                  }
                ],
                "operator": null
              }
            },
            {
              "tagType": null,
              "operator": null,
              "tagContainer": {
                "tags": [
                  {
                    "key": "string",
                    "value": "string"
                  },
                  {
                    "key": "string",
                    "value": "string"
                  },
                  {
                    "key": "string",
                    "value": "string"
                  },
                  {
                    "key": "string",
                    "value": "string"
                  }
                ],
                "operator": null
              }
            },
            {
              "tagType": null,
              "operator": null,
              "tagContainer": {
                "tags": [
                  {
                    "key": "string",
                    "value": "string"
                  },
                  {
                    "key": "string",
                    "value": "string"
                  },
                  {
                    "key": "string",
                    "value": "string"
                  },
                  {
                    "key": "string",
                    "value": "string"
                  }
                ],
                "operator": null
              }
            }
          ]
        },
        "expression": "string",
        "lastModifiedTime": 3,
        "lastModifiedBy": {
          "id": 5,
          "name": "string",
          "externalId": "string",
          "extensions": {}
        }
      },
      {
        "id": 3,
        "name": "string",
        "description": "string",
        "expressionJson": {
          "expressionContainers": [
            {
              "tagType": null,
              "operator": null,
              "tagContainer": {
                "tags": [
                  {
                    "key": "string",
                    "value": "string"
                  }
                ],
                "operator": null
              }
            },
            {
              "tagType": null,
              "operator": null,
              "tagContainer": {
                "tags": [
                  {
                    "key": "string",
                    "value": "string"
                  },
                  {
                    "key": "string",
                    "value": "string"
                  },
                  {
                    "key": "string",
                    "value": "string"
                  }
                ],
                "operator": null
              }
            },
            {
              "tagType": null,
              "operator": null,
              "tagContainer": {
                "tags": [
                  {
                    "key": "string",
                    "value": "string"
                  },
                  {
                    "key": "string",
                    "value": "string"
                  },
                  {
                    "key": "string",
                    "value": "string"
                  }
                ],
                "operator": null
              }
            },
            {
              "tagType": null,
              "operator": null,
              "tagContainer": {
                "tags": [
                  {
                    "key": "string",
                    "value": "string"
                  },
                  {
                    "key": "string",
                    "value": "string"
                  },
                  {
                    "key": "string",
                    "value": "string"
                  },
                  {
                    "key": "string",
                    "value": "string"
                  },
                  {
                    "key": "string",
                    "value": "string"
                  },
                  {
                    "key": "string",
                    "value": "string"
                  },
                  {
                    "key": "string",
                    "value": "string"
                  },
                  {
                    "key": "string",
                    "value": "string"
                  },
                  {
                    "key": "string",
                    "value": "string"
                  },
                  {
                    "key": "string",
                    "value": "string"
                  }
                ],
                "operator": null
              }
            },
            {
              "tagType": null,
              "operator": null,
              "tagContainer": {
                "tags": [
                  {
                    "key": "string",
                    "value": "string"
                  },
                  {
                    "key": "string",
                    "value": "string"
                  },
                  {
                    "key": "string",
                    "value": "string"
                  },
                  {
                    "key": "string",
                    "value": "string"
                  },
                  {
                    "key": "string",
                    "value": "string"
                  },
                  {
                    "key": "string",
                    "value": "string"
                  },
                  {
                    "key": "string",
                    "value": "string"
                  }
                ],
                "operator": null
              }
            },
            {
              "tagType": null,
              "operator": null,
              "tagContainer": {
                "tags": [
                  {
                    "key": "string",
                    "value": "string"
                  },
                  {
                    "key": "string",
                    "value": "string"
                  },
                  {
                    "key": "string",
                    "value": "string"
                  },
                  {
                    "key": "string",
                    "value": "string"
                  },
                  {
                    "key": "string",
                    "value": "string"
                  },
                  {
                    "key": "string",
                    "value": "string"
                  },
                  {
                    "key": "string",
                    "value": "string"
                  },
                  {
                    "key": "string",
                    "value": "string"
                  },
                  {
                    "key": "string",
                    "value": "string"
                  },
                  {
                    "key": "string",
                    "value": "string"
                  }
                ],
                "operator": null
              }
            },
            {
              "tagType": null,
              "operator": null,
              "tagContainer": {
                "tags": [
                  {
                    "key": "string",
                    "value": "string"
                  }
                ],
                "operator": null
              }
            },
            {
              "tagType": null,
              "operator": null,
              "tagContainer": {
                "tags": [
                  {
                    "key": "string",
                    "value": "string"
                  },
                  {
                    "key": "string",
                    "value": "string"
                  },
                  {
                    "key": "string",
                    "value": "string"
                  },
                  {
                    "key": "string",
                    "value": "string"
                  },
                  {
                    "key": "string",
                    "value": "string"
                  },
                  {
                    "key": "string",
                    "value": "string"
                  },
                  {
                    "key": "string",
                    "value": "string"
                  }
                ],
                "operator": null
              }
            },
            {
              "tagType": null,
              "operator": null,
              "tagContainer": {
                "tags": [
                  {
                    "key": "string",
                    "value": "string"
                  }
                ],
                "operator": null
              }
            }
          ]
        },
        "expression": "string",
        "lastModifiedTime": 5,
        "lastModifiedBy": {
          "id": 6,
          "name": "string",
          "externalId": "string",
          "extensions": {}
        }
      },
      {
        "id": 1,
        "name": "string",
        "description": "string",
        "expressionJson": {
          "expressionContainers": [
            {
              "tagType": null,
              "operator": null,
              "tagContainer": {
                "tags": [
                  {
                    "key": "string",
                    "value": "string"
                  }
                ],
                "operator": null
              }
            },
            {
              "tagType": null,
              "operator": null,
              "tagContainer": {
                "tags": [
                  {
                    "key": "string",
                    "value": "string"
                  },
                  {
                    "key": "string",
                    "value": "string"
                  },
                  {
                    "key": "string",
                    "value": "string"
                  },
                  {
                    "key": "string",
                    "value": "string"
                  },
                  {
                    "key": "string",
                    "value": "string"
                  },
                  {
                    "key": "string",
                    "value": "string"
                  },
                  {
                    "key": "string",
                    "value": "string"
                  },
                  {
                    "key": "string",
                    "value": "string"
                  },
                  {
                    "key": "string",
                    "value": "string"
                  },
                  {
                    "key": "string",
                    "value": "string"
                  }
                ],
                "operator": null
              }
            }
          ]
        },
        "expression": "string",
        "lastModifiedTime": 3,
        "lastModifiedBy": {
          "id": 4,
          "name": "string",
          "externalId": "string",
          "extensions": {}
        }
      }
    ],
    "rank": 6,
    "requestMethods": [
      "POST",
      "OTHER",
      "POST",
      "CONNECT"
    ],
    "endUserNotificationUrl": "string",
    "overrideUsers": [
      {
        "id": 9,
        "name": "string",
        "externalId": "string",
        "extensions": {}
      },
      {
        "id": 9,
        "name": "string",
        "externalId": "string",
        "extensions": {}
      },
      {
        "id": 2,
        "name": "string",
        "externalId": "string",
        "extensions": {}
      },
      {
        "id": 3,
        "name": "string",
        "externalId": "string",
        "extensions": {}
      },
      {
        "id": 4,
        "name": "string",
        "externalId": "string",
        "extensions": {}
      }
    ],
    "overrideGroups": [
      {
        "id": 5,
        "name": "string",
        "externalId": "string",
        "extensions": {}
      }
    ],
    "blockOverride": true,
    "timeQuota": 6,
    "sizeQuota": 10,
    "description": "string",
    "locationGroups": [
      {
        "id": 6,
        "name": "string",
        "externalId": "string",
        "extensions": {}
      },
      {
        "id": 9,
        "name": "string",
        "externalId": "string",
        "extensions": {}
      }
    ],
    "labels": [
      {
        "id": 9,
        "name": "string",
        "externalId": "string",
        "extensions": {}
      },
      {
        "id": 9,
        "name": "string",
        "externalId": "string",
        "extensions": {}
      },
      {
        "id": 5,
        "name": "string",
        "externalId": "string",
        "extensions": {}
      },
      {
        "id": 7,
        "name": "string",
        "externalId": "string",
        "extensions": {}
      },
      {
        "id": 8,
        "name": "string",
        "externalId": "string",
        "extensions": {}
      },
      {
        "id": 5,
        "name": "string",
        "externalId": "string",
        "extensions": {}
      }
    ],
    "validityStartTime": 3,
    "validityEndTime": 1,
    "validityTimeZoneId": "string",
    "lastModifiedTime": 7,
    "lastModifiedBy": {
      "id": 6,
      "name": "string",
      "externalId": "string",
      "extensions": {}
    },
    "enforceTimeValidity": false,
    "devices": [
      {
        "id": 5,
        "name": "string",
        "externalId": "string",
        "extensions": {}
      },
      {
        "id": 5,
        "name": "string",
        "externalId": "string",
        "extensions": {}
      },
      {
        "id": 8,
        "name": "string",
        "externalId": "string",
        "extensions": {}
      },
      {
        "id": 6,
        "name": "string",
        "externalId": "string",
        "extensions": {}
      },
      {
        "id": 10,
        "name": "string",
        "externalId": "string",
        "extensions": {}
      }
    ],
    "deviceGroups": [
      {
        "id": 10,
        "name": "string",
        "externalId": "string",
        "extensions": {}
      },
      {
        "id": 3,
        "name": "string",
        "externalId": "string",
        "extensions": {}
      },
      {
        "id": 5,
        "name": "string",
        "externalId": "string",
        "extensions": {}
      },
      {
        "id": 1,
        "name": "string",
        "externalId": "string",
        "extensions": {}
      },
      {
        "id": 5,
        "name": "string",
        "externalId": "string",
        "extensions": {}
      },
      {
        "id": 7,
        "name": "string",
        "externalId": "string",
        "extensions": {}
      },
      {
        "id": 1,
        "name": "string",
        "externalId": "string",
        "extensions": {}
      },
      {
        "id": 5,
        "name": "string",
        "externalId": "string",
        "extensions": {}
      },
      {
        "id": 1,
        "name": "string",
        "externalId": "string",
        "extensions": {}
      },
      {
        "id": 4,
        "name": "string",
        "externalId": "string",
        "extensions": {}
      }
    ],
    "deviceTrustLevels": [
      "LOW_TRUST",
      "UNKNOWN_DEVICETRUSTLEVEL"
    ],
    "action": null,
    "cbiProfile": {
      "id": "string",
      "name": "string",
      "url": "string",
      "defaultProfile": true
    },
    "ciparule": true
  }
]