[
  {
    "name": "string",
    "id": 9,
    "country": "IRAQ",
    "managedBy": {
      "id": 5,
      "name": "string",
      "extensions": {}
    },
    "vpnCredentials": [
      {
        "id": 6,
        "type": "XAUTH",
        "fqdn": "string",
        "preSharedKey": "string",
        "comments": "string",
        "location": [
          {
            "id": 9,
            "name": "string",
            "extensions": {}
          },
          {
            "id": 3,
            "name": "string",
            "extensions": {}
          },
          {
            "id": 10,
            "name": "string",
            "extensions": {}
          },
          {
            "id": 6,
            "name": "string",
            "extensions": {}
          },
          {
            "id": 6,
            "name": "string",
            "extensions": {}
          },
          {
            "id": 7,
            "name": "string",
            "extensions": {}
          },
          {
            "id": 9,
            "name": "string",
            "extensions": {}
          }
        ],
        "managedBy": [
          {
            "id": 8,
            "name": "string",
            "extensions": {}
          },
          {
            "id": 6,
            "name": "string",
            "extensions": {}
          },
          {
            "id": 9,
            "name": "string",
            "extensions": {}
          },
          {
            "id": 7,
            "name": "string",
            "extensions": {}
          },
          {
            "id": 1,
            "name": "string",
            "extensions": {}
          },
          {
            "id": 6,
            "name": "string",
            "extensions": {}
          },
          {
            "id": 2,
            "name": "string",
            "extensions": {}
          },
          {
            "id": 6,
            "name": "string",
            "extensions": {}
          },
          {
            "id": 2,
            "name": "string",
            "extensions": {}
          },
          {
            "id": 8,
            "name": "string",
            "extensions": {}
          }
        ]
      },
      {
        "id": 2,
        "type": "UFQDN",
        "fqdn": "string",
        "preSharedKey": "string",
        "comments": "string",
        "location": [
          {
            "id": 7,
            "name": "string",
            "extensions": {}
          },
          {
            "id": 4,
            "name": "string",
            "extensions": {}
          },
          {
            "id": 2,
            "name": "string",
            "extensions": {}
          },
          {
            "id": 8,
            "name": "string",
            "extensions": {}
          },
          {
            "id": 10,
            "name": "string",
            "extensions": {}
          },
          {
            "id": 5,
            "name": "string",
            "extensions": {}
          },
          {
            "id": 1,
            "name": "string",
            "extensions": {}
          }
        ],
        "managedBy": [
          {
            "id": 3,
            "name": "string",
            "extensions": {}
          },
          {
            "id": 8,
            "name": "string",
            "extensions": {}
          },
          {
            "id": 10,
            "name": "string",
            "extensions": {}
          },
          {
            "id": 5,
            "name": "string",
            "extensions": {}
          },
          {
            "id": 8,
            "name": "string",
            "extensions": {}
          }
        ]
      },
      {
        "id": 9,
        "type": "UFQDN",
        "fqdn": "string",
        "preSharedKey": "string",
        "comments": "string",
        "location": [
          {
            "id": 1,
            "name": "string",
            "extensions": {}
          },
          {
            "id": 6,
            "name": "string",
            "extensions": {}
          },
          {
            "id": 7,
            "name": "string",
            "extensions": {}
          }
        ],
        "managedBy": [
          {
            "id": 2,
            "name": "string",
            "extensions": {}
          },
          {
            "id": 6,
            "name": "string",
            "extensions": {}
          }
        ]
      },
      {
        "id": 9,
        "type": "IP",
        "fqdn": "string",
        "preSharedKey": "string",
        "comments": "string",
        "location": [
          {
            "id": 5,
            "name": "string",
            "extensions": {}
          },
          {
            "id": 9,
            "name": "string",
            "extensions": {}
          }
        ],
        "managedBy": [
          {
            "id": 9,
            "name": "string",
            "extensions": {}
          },
          {
            "id": 2,
            "name": "string",
            "extensions": {}
          },
          {
            "id": 8,
            "name": "string",
            "extensions": {}
          },
          {
            "id": 7,
            "name": "string",
            "extensions": {}
          }
        ]
      },
      {
        "id": 8,
        "type": "CN",
        "fqdn": "string",
        "preSharedKey": "string",
        "comments": "string",
        "location": [
          {
            "id": 2,
            "name": "string",
            "extensions": {}
          },
          {
            "id": 8,
            "name": "string",
            "extensions": {}
          },
          {
            "id": 7,
            "name": "string",
            "extensions": {}
          },
          {
            "id": 6,
            "name": "string",
            "extensions": {}
          },
          {
            "id": 1,
            "name": "string",
            "extensions": {}
          },
          {
            "id": 5,
            "name": "string",
            "extensions": {}
          },
          {
            "id": 3,
            "name": "string",
            "extensions": {}
          },
          {
            "id": 6,
            "name": "string",
            "extensions": {}
          },
          {
            "id": 1,
            "name": "string",
            "extensions": {}
          },
          {
            "id": 9,
            "name": "string",
            "extensions": {}
          }
        ],
        "managedBy": [
          {
            "id": 1,
            "name": "string",
            "extensions": {}
          },
          {
            "id": 9,
            "name": "string",
            "extensions": {}
          },
          {
            "id": 7,
            "name": "string",
            "extensions": {}
          },
          {
            "id": 10,
            "name": "string",
            "extensions": {}
          },
          {
            "id": 9,
            "name": "string",
            "extensions": {}
          },
          {
            "id": 8,
            "name": "string",
            "extensions": {}
          },
          {
            "id": 6,
            "name": "string",
            "extensions": {}
          },
          {
            "id": 9,
            "name": "string",
            "extensions": {}
          },
          {
            "id": 8,
            "name": "string",
            "extensions": {}
          }
        ]
      },
      {
        "id": 7,
        "type": "XAUTH",
        "fqdn": "string",
        "preSharedKey": "string",
        "comments": "string",
        "location": [
          {
            "id": 5,
            "name": "string",
            "extensions": {}
          },
          {
            "id": 2,
            "name": "string",
            "extensions": {}
          },
          {
            "id": 1,
            "name": "string",
            "extensions": {}
          },
          {
            "id": 5,
            "name": "string",
            "extensions": {}
          },
          {
            "id": 9,
            "name": "string",
            "extensions": {}
          }
        ],
        "managedBy": [
          {
            "id": 3,
            "name": "string",
            "extensions": {}
          },
          {
            "id": 1,
            "name": "string",
            "extensions": {}
          },
          {
            "id": 5,
            "name": "string",
            "extensions": {}
          },
          {
            "id": 2,
            "name": "string",
            "extensions": {}
          },
          {
            "id": 6,
            "name": "string",
            "extensions": {}
          },
          {
            "id": 10,
            "name": "string",
            "extensions": {}
          },
          {
            "id": 4,
            "name": "string",
            "extensions": {}
          },
          {
            "id": 3,
            "name": "string",
            "extensions": {}
          },
          {
            "id": 6,
            "name": "string",
            "extensions": {}
          }
        ]
      }
    ],
    "xffForwardEnabled": true,
    "tz": "string",
    "authRequired": false,
    "upBandwidth": 3,
    "sslScanEnabled": true,
    "dnBandwidth": 10,
    "ofwEnabled": true
  },
  {
    "name": "string",
    "id": 3,
    "country": "JAMAICA",
    "managedBy": {
      "id": 3,
      "name": "string",
      "extensions": {}
    },
    "vpnCredentials": [
      {
        "id": 6,
        "type": "CN",
        "fqdn": "string",
        "preSharedKey": "string",
        "comments": "string",
        "location": [
          {
            "id": 4,
            "name": "string",
            "extensions": {}
          },
          {
            "id": 5,
            "name": "string",
            "extensions": {}
          },
          {
            "id": 3,
            "name": "string",
            "extensions": {}
          },
          {
            "id": 10,
            "name": "string",
            "extensions": {}
          }
        ],
        "managedBy": [
          {
            "id": 7,
            "name": "string",
            "extensions": {}
          },
          {
            "id": 1,
            "name": "string",
            "extensions": {}
          },
          {
            "id": 8,
            "name": "string",
            "extensions": {}
          }
        ]
      },
      {
        "id": 9,
        "type": "UFQDN",
        "fqdn": "string",
        "preSharedKey": "string",
        "comments": "string",
        "location": [
          {
            "id": 7,
            "name": "string",
            "extensions": {}
          },
          {
            "id": 7,
            "name": "string",
            "extensions": {}
          },
          {
            "id": 10,
            "name": "string",
            "extensions": {}
          },
          {
            "id": 3,
            "name": "string",
            "extensions": {}
          },
          {
            "id": 7,
            "name": "string",
            "extensions": {}
          },
          {
            "id": 10,
            "name": "string",
            "extensions": {}
          },
          {
            "id": 1,
            "name": "string",
            "extensions": {}
          },
          {
            "id": 5,
            "name": "string",
            "extensions": {}
          }
        ],
        "managedBy": [
          {
            "id": 1,
            "name": "string",
            "extensions": {}
          },
          {
            "id": 3,
            "name": "string",
            "extensions": {}
          }
        ]
      },
      {
        "id": 6,
        "type": "IP",
        "fqdn": "string",
        "preSharedKey": "string",
        "comments": "string",
        "location": [
          {
            "id": 9,
            "name": "string",
            "extensions": {}
          },
          {
            "id": 8,
            "name": "string",
            "extensions": {}
          },
          {
            "id": 10,
            "name": "string",
            "extensions": {}
          },
          {
            "id": 10,
            "name": "string",
            "extensions": {}
          },
          {
            "id": 3,
            "name": "string",
            "extensions": {}
          },
          {
            "id": 3,
            "name": "string",
            "extensions": {}
          },
          {
            "id": 6,
            "name": "string",
            "extensions": {}
          },
          {
            "id": 6,
            "name": "string",
            "extensions": {}
          }
        ],
        "managedBy": [
          {
            "id": 6,
            "name": "string",
            "extensions": {}
          },
          {
            "id": 9,
            "name": "string",
            "extensions": {}
          },
          {
            "id": 1,
            "name": "string",
            "extensions": {}
          },
          {
            "id": 6,
            "name": "string",
            "extensions": {}
          },
          {
            "id": 6,
            "name": "string",
            "extensions": {}
          },
          {
            "id": 2,
            "name": "string",
            "extensions": {}
          },
          {
            "id": 9,
            "name": "string",
            "extensions": {}
          },
          {
            "id": 2,
            "name": "string",
            "extensions": {}
          },
          {
            "id": 3,
            "name": "string",
            "extensions": {}
          }
        ]
      },
      {
        "id": 8,
        "type": "IP",
        "fqdn": "string",
        "preSharedKey": "string",
        "comments": "string",
        "location": [
          {
            "id": 4,
            "name": "string",
            "extensions": {}
          },
          {
            "id": 10,
            "name": "string",
            "extensions": {}
          },
          {
            "id": 10,
            "name": "string",
            "extensions": {}
          },
          {
            "id": 4,
            "name": "string",
            "extensions": {}
          },
          {
            "id": 1,
            "name": "string",
            "extensions": {}
          },
          {
            "id": 6,
            "name": "string",
            "extensions": {}
          },
          {
            "id": 7,
            "name": "string",
            "extensions": {}
          }
        ],
        "managedBy": [
          {
            "id": 9,
            "name": "string",
            "extensions": {}
          },
          {
            "id": 10,
            "name": "string",
            "extensions": {}
          },
          {
            "id": 8,
            "name": "string",
            "extensions": {}
          },
          {
            "id": 2,
            "name": "string",
            "extensions": {}
          },
          {
            "id": 9,
            "name": "string",
            "extensions": {}
          }
        ]
      },
      {
        "id": 1,
        "type": "UFQDN",
        "fqdn": "string",
        "preSharedKey": "string",
        "comments": "string",
        "location": [
          {
            "id": 4,
            "name": "string",
            "extensions": {}
          },
          {
            "id": 5,
            "name": "string",
            "extensions": {}
          }
        ],
        "managedBy": [
          {
            "id": 6,
            "name": "string",
            "extensions": {}
          },
          {
            "id": 7,
            "name": "string",
            "extensions": {}
          },
          {
            "id": 10,
            "name": "string",
            "extensions": {}
          }
        ]
      },
      {
        "id": 8,
        "type": "CN",
        "fqdn": "string",
        "preSharedKey": "string",
        "comments": "string",
        "location": [
          {
            "id": 6,
            "name": "string",
            "extensions": {}
          },
          {
            "id": 9,
            "name": "string",
            "extensions": {}
          },
          {
            "id": 10,
            "name": "string",
            "extensions": {}
          },
          {
            "id": 5,
            "name": "string",
            "extensions": {}
          },
          {
            "id": 3,
            "name": "string",
            "extensions": {}
          }
        ],
        "managedBy": [
          {
            "id": 4,
            "name": "string",
            "extensions": {}
          },
          {
            "id": 5,
            "name": "string",
            "extensions": {}
          },
          {
            "id": 6,
            "name": "string",
            "extensions": {}
          },
          {
            "id": 9,
            "name": "string",
            "extensions": {}
          }
        ]
      },
      {
        "id": 6,
        "type": "IP",
        "fqdn": "string",
        "preSharedKey": "string",
        "comments": "string",
        "location": [
          {
            "id": 3,
            "name": "string",
            "extensions": {}
          },
          {
            "id": 1,
            "name": "string",
            "extensions": {}
          },
          {
            "id": 2,
            "name": "string",
            "extensions": {}
          },
          {
            "id": 2,
            "name": "string",
            "extensions": {}
          },
          {
            "id": 9,
            "name": "string",
            "extensions": {}
          },
          {
            "id": 2,
            "name": "string",
            "extensions": {}
          }
        ],
        "managedBy": [
          {
            "id": 9,
            "name": "string",
            "extensions": {}
          },
          {
            "id": 10,
            "name": "string",
            "extensions": {}
          },
          {
            "id": 7,
            "name": "string",
            "extensions": {}
          },
          {
            "id": 7,
            "name": "string",
            "extensions": {}
          }
        ]
      },
      {
        "id": 4,
        "type": "XAUTH",
        "fqdn": "string",
        "preSharedKey": "string",
        "comments": "string",
        "location": [
          {
            "id": 4,
            "name": "string",
            "extensions": {}
          },
          {
            "id": 3,
            "name": "string",
            "extensions": {}
          },
          {
            "id": 6,
            "name": "string",
            "extensions": {}
          },
          {
            "id": 8,
            "name": "string",
            "extensions": {}
          }
        ],
        "managedBy": [
          {
            "id": 4,
            "name": "string",
            "extensions": {}
          },
          {
            "id": 8,
            "name": "string",
            "extensions": {}
          },
          {
            "id": 1,
            "name": "string",
            "extensions": {}
          },
          {
            "id": 1,
            "name": "string",
            "extensions": {}
          },
          {
            "id": 7,
            "name": "string",
            "extensions": {}
          },
          {
            "id": 5,
            "name": "string",
            "extensions": {}
          },
          {
            "id": 9,
            "name": "string",
            "extensions": {}
          },
          {
            "id": 6,
            "name": "string",
            "extensions": {}
          },
          {
            "id": 8,
            "name": "string",
            "extensions": {}
          }
        ]
      },
      {
        "id": 10,
        "type": "CN",
        "fqdn": "string",
        "preSharedKey": "string",
        "comments": "string",
        "location": [
          {
            "id": 7,
            "name": "string",
            "extensions": {}
          },
          {
            "id": 6,
            "name": "string",
            "extensions": {}
          },
          {
            "id": 9,
            "name": "string",
            "extensions": {}
          },
          {
            "id": 5,
            "name": "string",
            "extensions": {}
          }
        ],
        "managedBy": [
          {
            "id": 8,
            "name": "string",
            "extensions": {}
          },
          {
            "id": 1,
            "name": "string",
            "extensions": {}
          },
          {
            "id": 1,
            "name": "string",
            "extensions": {}
          },
          {
            "id": 10,
            "name": "string",
            "extensions": {}
          },
          {
            "id": 6,
            "name": "string",
            "extensions": {}
          },
          {
            "id": 4,
            "name": "string",
            "extensions": {}
          },
          {
            "id": 8,
            "name": "string",
            "extensions": {}
          },
          {
            "id": 8,
            "name": "string",
            "extensions": {}
          }
        ]
      },
      {
        "id": 10,
        "type": "UFQDN",
        "fqdn": "string",
        "preSharedKey": "string",
        "comments": "string",
        "location": [
          {
            "id": 2,
            "name": "string",
            "extensions": {}
          },
          {
            "id": 8,
            "name": "string",
            "extensions": {}
          },
          {
            "id": 9,
            "name": "string",
            "extensions": {}
          },
          {
            "id": 2,
            "name": "string",
            "extensions": {}
          },
          {
            "id": 10,
            "name": "string",
            "extensions": {}
          },
          {
            "id": 7,
            "name": "string",
            "extensions": {}
          }
        ],
        "managedBy": [
          {
            "id": 6,
            "name": "string",
            "extensions": {}
          },
          {
            "id": 3,
            "name": "string",
            "extensions": {}
          },
          {
            "id": 7,
            "name": "string",
            "extensions": {}
          },
          {
            "id": 9,
            "name": "string",
            "extensions": {}
          },
          {
            "id": 1,
            "name": "string",
            "extensions": {}
          },
          {
            "id": 10,
            "name": "string",
            "extensions": {}
          },
          {
            "id": 1,
            "name": "string",
            "extensions": {}
          }
        ]
      }
    ],
    "xffForwardEnabled": false,
    "tz": "string",
    "authRequired": false,
    "upBandwidth": 9,
    "sslScanEnabled": false,
    "dnBandwidth": 5,
    "ofwEnabled": false
  },
  {
    "name": "string",
    "id": 5,
    "country": "BAHRAIN",
    "managedBy": {
      "id": 10,
      "name": "string",
      "extensions": {}
    },
    "vpnCredentials": [
      {
        "id": 4,
        "type": "CN",
        "fqdn": "string",
        "preSharedKey": "string",
        "comments": "string",
        "location": [
          {
            "id": 9,
            "name": "string",
            "extensions": {}
          }
        ],
        "managedBy": [
          {
            "id": 5,
            "name": "string",
            "extensions": {}
          },
          {
            "id": 8,
            "name": "string",
            "extensions": {}
          },
          {
            "id": 4,
            "name": "string",
            "extensions": {}
          },
          {
            "id": 8,
            "name": "string",
            "extensions": {}
          }
        ]
      },
      {
        "id": 9,
        "type": "XAUTH",
        "fqdn": "string",
        "preSharedKey": "string",
        "comments": "string",
        "location": [
          {
            "id": 9,
            "name": "string",
            "extensions": {}
          },
          {
            "id": 5,
            "name": "string",
            "extensions": {}
          },
          {
            "id": 5,
            "name": "string",
            "extensions": {}
          },
          {
            "id": 10,
            "name": "string",
            "extensions": {}
          },
          {
            "id": 2,
            "name": "string",
            "extensions": {}
          },
          {
            "id": 7,
            "name": "string",
            "extensions": {}
          },
          {
            "id": 8,
            "name": "string",
            "extensions": {}
          },
          {
            "id": 4,
            "name": "string",
            "extensions": {}
          },
          {
            "id": 8,
            "name": "string",
            "extensions": {}
          },
          {
            "id": 1,
            "name": "string",
            "extensions": {}
          }
        ],
        "managedBy": [
          {
            "id": 9,
            "name": "string",
            "extensions": {}
          },
          {
            "id": 9,
            "name": "string",
            "extensions": {}
          },
          {
            "id": 3,
            "name": "string",
            "extensions": {}
          },
          {
            "id": 5,
            "name": "string",
            "extensions": {}
          },
          {
            "id": 8,
            "name": "string",
            "extensions": {}
          },
          {
            "id": 5,
            "name": "string",
            "extensions": {}
          },
          {
            "id": 8,
            "name": "string",
            "extensions": {}
          }
        ]
      },
      {
        "id": 9,
        "type": "XAUTH",
        "fqdn": "string",
        "preSharedKey": "string",
        "comments": "string",
        "location": [
          {
            "id": 2,
            "name": "string",
            "extensions": {}
          },
          {
            "id": 9,
            "name": "string",
            "extensions": {}
          },
          {
            "id": 8,
            "name": "string",
            "extensions": {}
          },
          {
            "id": 3,
            "name": "string",
            "extensions": {}
          },
          {
            "id": 8,
            "name": "string",
            "extensions": {}
          },
          {
            "id": 5,
            "name": "string",
            "extensions": {}
          }
        ],
        "managedBy": [
          {
            "id": 4,
            "name": "string",
            "extensions": {}
          },
          {
            "id": 2,
            "name": "string",
            "extensions": {}
          },
          {
            "id": 5,
            "name": "string",
            "extensions": {}
          },
          {
            "id": 1,
            "name": "string",
            "extensions": {}
          },
          {
            "id": 4,
            "name": "string",
            "extensions": {}
          },
          {
            "id": 2,
            "name": "string",
            "extensions": {}
          },
          {
            "id": 7,
            "name": "string",
            "extensions": {}
          },
          {
            "id": 8,
            "name": "string",
            "extensions": {}
          }
        ]
      },
      {
        "id": 1,
        "type": "UFQDN",
        "fqdn": "string",
        "preSharedKey": "string",
        "comments": "string",
        "location": [
          {
            "id": 10,
            "name": "string",
            "extensions": {}
          },
          {
            "id": 5,
            "name": "string",
            "extensions": {}
          },
          {
            "id": 5,
            "name": "string",
            "extensions": {}
          },
          {
            "id": 6,
            "name": "string",
            "extensions": {}
          }
        ],
        "managedBy": [
          {
            "id": 7,
            "name": "string",
            "extensions": {}
          },
          {
            "id": 2,
            "name": "string",
            "extensions": {}
          },
          {
            "id": 7,
            "name": "string",
            "extensions": {}
          },
          {
            "id": 2,
            "name": "string",
            "extensions": {}
          },
          {
            "id": 5,
            "name": "string",
            "extensions": {}
          },
          {
            "id": 8,
            "name": "string",
            "extensions": {}
          },
          {
            "id": 1,
            "name": "string",
            "extensions": {}
          },
          {
            "id": 10,
            "name": "string",
            "extensions": {}
          }
        ]
      },
      {
        "id": 10,
        "type": "IP",
        "fqdn": "string",
        "preSharedKey": "string",
        "comments": "string",
        "location": [
          {
            "id": 4,
            "name": "string",
            "extensions": {}
          },
          {
            "id": 3,
            "name": "string",
            "extensions": {}
          },
          {
            "id": 8,
            "name": "string",
            "extensions": {}
          },
          {
            "id": 1,
            "name": "string",
            "extensions": {}
          },
          {
            "id": 4,
            "name": "string",
            "extensions": {}
          },
          {
            "id": 4,
            "name": "string",
            "extensions": {}
          },
          {
            "id": 10,
            "name": "string",
            "extensions": {}
          },
          {
            "id": 3,
            "name": "string",
            "extensions": {}
          },
          {
            "id": 5,
            "name": "string",
            "extensions": {}
          }
        ],
        "managedBy": [
          {
            "id": 4,
            "name": "string",
            "extensions": {}
          },
          {
            "id": 10,
            "name": "string",
            "extensions": {}
          },
          {
            "id": 3,
            "name": "string",
            "extensions": {}
          },
          {
            "id": 9,
            "name": "string",
            "extensions": {}
          },
          {
            "id": 2,
            "name": "string",
            "extensions": {}
          },
          {
            "id": 6,
            "name": "string",
            "extensions": {}
          },
          {
            "id": 9,
            "name": "string",
            "extensions": {}
          },
          {
            "id": 3,
            "name": "string",
            "extensions": {}
          },
          {
            "id": 2,
            "name": "string",
            "extensions": {}
          }
        ]
      },
      {
        "id": 7,
        "type": "IP",
        "fqdn": "string",
        "preSharedKey": "string",
        "comments": "string",
        "location": [
          {
            "id": 7,
            "name": "string",
            "extensions": {}
          },
          {
            "id": 10,
            "name": "string",
            "extensions": {}
          },
          {
            "id": 9,
            "name": "string",
            "extensions": {}
          },
          {
            "id": 9,
            "name": "string",
            "extensions": {}
          },
          {
            "id": 4,
            "name": "string",
            "extensions": {}
          }
        ],
        "managedBy": [
          {
            "id": 5,
            "name": "string",
            "extensions": {}
          }
        ]
      },
      {
        "id": 2,
        "type": "CN",
        "fqdn": "string",
        "preSharedKey": "string",
        "comments": "string",
        "location": [
          {
            "id": 3,
            "name": "string",
            "extensions": {}
          }
        ],
        "managedBy": [
          {
            "id": 8,
            "name": "string",
            "extensions": {}
          },
          {
            "id": 1,
            "name": "string",
            "extensions": {}
          },
          {
            "id": 3,
            "name": "string",
            "extensions": {}
          },
          {
            "id": 8,
            "name": "string",
            "extensions": {}
          },
          {
            "id": 10,
            "name": "string",
            "extensions": {}
          },
          {
            "id": 1,
            "name": "string",
            "extensions": {}
          },
          {
            "id": 9,
            "name": "string",
            "extensions": {}
          }
        ]
      }
    ],
    "xffForwardEnabled": false,
    "tz": "string",
    "authRequired": true,
    "upBandwidth": 3,
    "sslScanEnabled": true,
    "dnBandwidth": 10,
    "ofwEnabled": true
  },
  {
    "name": "string",
    "id": 8,
    "country": "SENEGAL",
    "managedBy": {
      "id": 4,
      "name": "string",
      "extensions": {}
    },
    "vpnCredentials": [
      {
        "id": 2,
        "type": "IP",
        "fqdn": "string",
        "preSharedKey": "string",
        "comments": "string",
        "location": [
          {
            "id": 10,
            "name": "string",
            "extensions": {}
          },
          {
            "id": 6,
            "name": "string",
            "extensions": {}
          },
          {
            "id": 3,
            "name": "string",
            "extensions": {}
          },
          {
            "id": 7,
            "name": "string",
            "extensions": {}
          },
          {
            "id": 2,
            "name": "string",
            "extensions": {}
          },
          {
            "id": 7,
            "name": "string",
            "extensions": {}
          },
          {
            "id": 8,
            "name": "string",
            "extensions": {}
          },
          {
            "id": 6,
            "name": "string",
            "extensions": {}
          },
          {
            "id": 1,
            "name": "string",
            "extensions": {}
          },
          {
            "id": 4,
            "name": "string",
            "extensions": {}
          }
        ],
        "managedBy": [
          {
            "id": 5,
            "name": "string",
            "extensions": {}
          },
          {
            "id": 3,
            "name": "string",
            "extensions": {}
          },
          {
            "id": 1,
            "name": "string",
            "extensions": {}
          },
          {
            "id": 10,
            "name": "string",
            "extensions": {}
          },
          {
            "id": 5,
            "name": "string",
            "extensions": {}
          },
          {
            "id": 9,
            "name": "string",
            "extensions": {}
          },
          {
            "id": 4,
            "name": "string",
            "extensions": {}
          },
          {
            "id": 10,
            "name": "string",
            "extensions": {}
          },
          {
            "id": 7,
            "name": "string",
            "extensions": {}
          }
        ]
      },
      {
        "id": 8,
        "type": "CN",
        "fqdn": "string",
        "preSharedKey": "string",
        "comments": "string",
        "location": [
          {
            "id": 6,
            "name": "string",
            "extensions": {}
          }
        ],
        "managedBy": [
          {
            "id": 9,
            "name": "string",
            "extensions": {}
          },
          {
            "id": 3,
            "name": "string",
            "extensions": {}
          },
          {
            "id": 6,
            "name": "string",
            "extensions": {}
          }
        ]
      },
      {
        "id": 2,
        "type": "CN",
        "fqdn": "string",
        "preSharedKey": "string",
        "comments": "string",
        "location": [
          {
            "id": 4,
            "name": "string",
            "extensions": {}
          },
          {
            "id": 7,
            "name": "string",
            "extensions": {}
          },
          {
            "id": 5,
            "name": "string",
            "extensions": {}
          },
          {
            "id": 9,
            "name": "string",
            "extensions": {}
          },
          {
            "id": 3,
            "name": "string",
            "extensions": {}
          },
          {
            "id": 7,
            "name": "string",
            "extensions": {}
          },
          {
            "id": 4,
            "name": "string",
            "extensions": {}
          },
          {
            "id": 9,
            "name": "string",
            "extensions": {}
          },
          {
            "id": 6,
            "name": "string",
            "extensions": {}
          },
          {
            "id": 4,
            "name": "string",
            "extensions": {}
          }
        ],
        "managedBy": [
          {
            "id": 1,
            "name": "string",
            "extensions": {}
          },
          {
            "id": 3,
            "name": "string",
            "extensions": {}
          },
          {
            "id": 2,
            "name": "string",
            "extensions": {}
          },
          {
            "id": 8,
            "name": "string",
            "extensions": {}
          },
          {
            "id": 9,
            "name": "string",
            "extensions": {}
          }
        ]
      },
      {
        "id": 2,
        "type": "XAUTH",
        "fqdn": "string",
        "preSharedKey": "string",
        "comments": "string",
        "location": [
          {
            "id": 10,
            "name": "string",
            "extensions": {}
          },
          {
            "id": 2,
            "name": "string",
            "extensions": {}
          },
          {
            "id": 2,
            "name": "string",
            "extensions": {}
          },
          {
            "id": 4,
            "name": "string",
            "extensions": {}
          },
          {
            "id": 10,
            "name": "string",
            "extensions": {}
          },
          {
            "id": 3,
            "name": "string",
            "extensions": {}
          },
          {
            "id": 9,
            "name": "string",
            "extensions": {}
          },
          {
            "id": 3,
            "name": "string",
            "extensions": {}
          },
          {
            "id": 6,
            "name": "string",
            "extensions": {}
          }
        ],
        "managedBy": [
          {
            "id": 6,
            "name": "string",
            "extensions": {}
          }
        ]
      },
      {
        "id": 1,
        "type": "CN",
        "fqdn": "string",
        "preSharedKey": "string",
        "comments": "string",
        "location": [
          {
            "id": 7,
            "name": "string",
            "extensions": {}
          },
          {
            "id": 8,
            "name": "string",
            "extensions": {}
          },
          {
            "id": 8,
            "name": "string",
            "extensions": {}
          },
          {
            "id": 7,
            "name": "string",
            "extensions": {}
          },
          {
            "id": 9,
            "name": "string",
            "extensions": {}
          },
          {
            "id": 8,
            "name": "string",
            "extensions": {}
          },
          {
            "id": 4,
            "name": "string",
            "extensions": {}
          },
          {
            "id": 8,
            "name": "string",
            "extensions": {}
          },
          {
            "id": 2,
            "name": "string",
            "extensions": {}
          },
          {
            "id": 3,
            "name": "string",
            "extensions": {}
          }
        ],
        "managedBy": [
          {
            "id": 10,
            "name": "string",
            "extensions": {}
          },
          {
            "id": 5,
            "name": "string",
            "extensions": {}
          },
          {
            "id": 5,
            "name": "string",
            "extensions": {}
          },
          {
            "id": 3,
            "name": "string",
            "extensions": {}
          },
          {
            "id": 2,
            "name": "string",
            "extensions": {}
          },
          {
            "id": 7,
            "name": "string",
            "extensions": {}
          },
          {
            "id": 10,
            "name": "string",
            "extensions": {}
          },
          {
            "id": 2,
            "name": "string",
            "extensions": {}
          },
          {
            "id": 3,
            "name": "string",
            "extensions": {}
          },
          {
            "id": 6,
            "name": "string",
            "extensions": {}
          }
        ]
      },
      {
        "id": 8,
        "type": "XAUTH",
        "fqdn": "string",
        "preSharedKey": "string",
        "comments": "string",
        "location": [
          {
            "id": 10,
            "name": "string",
            "extensions": {}
          },
          {
            "id": 5,
            "name": "string",
            "extensions": {}
          },
          {
            "id": 5,
            "name": "string",
            "extensions": {}
          }
        ],
        "managedBy": [
          {
            "id": 1,
            "name": "string",
            "extensions": {}
          },
          {
            "id": 2,
            "name": "string",
            "extensions": {}
          },
          {
            "id": 9,
            "name": "string",
            "extensions": {}
          },
          {
            "id": 2,
            "name": "string",
            "extensions": {}
          },
          {
            "id": 4,
            "name": "string",
            "extensions": {}
          },
          {
            "id": 1,
            "name": "string",
            "extensions": {}
          },
          {
            "id": 10,
            "name": "string",
            "extensions": {}
          },
          {
            "id": 8,
            "name": "string",
            "extensions": {}
          },
          {
            "id": 10,
            "name": "string",
            "extensions": {}
          },
          {
            "id": 9,
            "name": "string",
            "extensions": {}
          }
        ]
      }
    ],
    "xffForwardEnabled": true,
    "tz": "string",
    "authRequired": true,
    "upBandwidth": 5,
    "sslScanEnabled": true,
    "dnBandwidth": 5,
    "ofwEnabled": false
  }
]