{
  "id": "DINING_AND_RESTAURANT",
  "configuredName": "string",
  "urls": [
    "string",
    "string",
    "string",
    "string"
  ],
  "dbCategorizedUrls": [
    "string",
    "string",
    "string",
    "string",
    "string",
    "string",
    "string",
    "string",
    "string"
  ],
  "customCategory": true,
  "scopes": [
    {
      "scopeGroupMemberEntities": [
        {
          "id": 5,
          "name": "string",
          "extensions": {}
        },
        {
          "id": 2,
          "name": "string",
          "extensions": {}
        },
        {
          "id": 9,
          "name": "string",
          "extensions": {}
        },
        {
          "id": 8,
          "name": "string",
          "extensions": {}
        },
        {
          "id": 7,
          "name": "string",
          "extensions": {}
        },
        {
          "id": 9,
          "name": "string",
          "extensions": {}
        },
        {
          "id": 5,
          "name": "string",
          "extensions": {}
        },
        {
          "id": 6,
          "name": "string",
          "extensions": {}
        }
      ],
      "Type": "LOCATION",
      "ScopeEntities": [
        {
          "id": 1,
          "name": "string",
          "extensions": {}
        }
      ]
    }
  ],
  "editable": true,
  "description": "string",
  "val": 8
}