[
  {
    "id": 10,
    "name": "string",
    "url": "string",
    "status": null,
    "flags": 4
  },
  {
    "id": 7,
    "name": "string",
    "url": "string",
    "status": null,
    "flags": 4
  },
  {
    "id": 1,
    "name": "string",
    "url": "string",
    "status": null,
    "flags": 10
  },
  {
    "id": 2,
    "name": "string",
    "url": "string",
    "status": null,
    "flags": 5
  }
]