[
  {
    "id": 9,
    "name": "string",
    "ipAddresses": [
      "string",
      "string"
    ],
    "description": "string",
    "isNonEditable": false
  },
  {
    "id": 8,
    "name": "string",
    "ipAddresses": [
      "string",
      "string",
      "string",
      "string"
    ],
    "description": "string",
    "isNonEditable": true
  },
  {
    "id": 10,
    "name": "string",
    "ipAddresses": [
      "string",
      "string",
      "string",
      "string",
      "string"
    ],
    "description": "string",
    "isNonEditable": true
  },
  {
    "id": 1,
    "name": "string",
    "ipAddresses": [
      "string",
      "string",
      "string",
      "string",
      "string",
      "string",
      "string",
      "string",
      "string"
    ],
    "description": "string",
    "isNonEditable": false
  }
]