[
  {
    "uuid": "string",
    "name": "string",
    "parent_uuid": "string"
  },
  {
    "uuid": "string",
    "name": "string",
    "parent_uuid": "string"
  },
  {
    "uuid": "string",
    "name": "string",
    "parent_uuid": "string"
  },
  {
    "uuid": "string",
    "name": "string",
    "parent_uuid": "string"
  }
]