{
  "actions": [
    {
      "name": "bulkUpdateCloudApplication",
      "protocol": "REST",
      "method": "PUT",
      "entitypath": "{base_path}/{version}/cloudApplications/bulkUpdate?{query}",
      "requestSchema": "schema.json",
      "responseSchema": "schema.json",
      "timeout": 0,
      "sendEmpty": false,
      "requestDatatype": "JSON",
      "responseDatatype": "JSON",
      "headers": {},
      "responseObjects": [
        {
          "type": "default",
          "key": "",
          "mockFile": ""
        }
      ]
    },
    {
      "name": "getCloudApplicationsLite",
      "protocol": "REST",
      "method": "GET",
      "entitypath": "{base_path}/{version}/cloudApplications/lite?{query}",
      "requestSchema": "schema.json",
      "responseSchema": "schema.json",
      "timeout": 0,
      "sendEmpty": false,
      "sendGetBody": false,
      "requestDatatype": "JSON",
      "responseDatatype": "JSON",
      "headers": {},
      "responseObjects": [
        {
          "type": "default",
          "key": "",
          "mockFile": "mockdatafiles/getCloudApplicationsLite-default.json"
        }
      ]
    },
    {
      "name": "getAllCustomTags",
      "protocol": "REST",
      "method": "GET",
      "entitypath": "{base_path}/{version}/customTags?{query}",
      "requestSchema": "schema.json",
      "responseSchema": "schema.json",
      "timeout": 0,
      "sendEmpty": false,
      "sendGetBody": false,
      "requestDatatype": "JSON",
      "responseDatatype": "JSON",
      "headers": {},
      "responseObjects": [
        {
          "type": "default",
          "key": "",
          "mockFile": "mockdatafiles/getAllCustomTags-default.json"
        }
      ]
    },
    {
      "name": "getReportDataApplicationsExport",
      "protocol": "REST",
      "method": "POST",
      "entitypath": "{base_path}/{version}/shadowIT/applications/export?{query}",
      "requestSchema": "schema.json",
      "responseSchema": "schema.json",
      "timeout": 0,
      "sendEmpty": false,
      "requestDatatype": "JSON",
      "responseDatatype": "JSON",
      "headers": {},
      "responseObjects": [
        {
          "type": "default",
          "key": "",
          "mockFile": ""
        }
      ]
    },
    {
      "name": "getReportTransactionsExport",
      "protocol": "REST",
      "method": "POST",
      "entitypath": "{base_path}/{version}/shadowIT/applications/{pathv1}/exportCsv?{query}",
      "requestSchema": "schema.json",
      "responseSchema": "schema.json",
      "timeout": 0,
      "sendEmpty": false,
      "requestDatatype": "JSON",
      "responseDatatype": "JSON",
      "headers": {},
      "responseObjects": [
        {
          "type": "default",
          "key": "",
          "mockFile": ""
        }
      ]
    }
  ]
}