[
  {
    "id": 4,
    "name": "string",
    "services": [
      {
        "id": 5,
        "name": "string",
        "tag": "string",
        "srcTcpPorts": [
          {
            "start": 2,
            "end": 10
          },
          {
            "start": 9,
            "end": 1
          },
          {
            "start": 2,
            "end": 9
          },
          {
            "start": 2,
            "end": 2
          }
        ],
        "destTcpPorts": [
          {
            "start": 2,
            "end": 8
          },
          {
            "start": 6,
            "end": 5
          },
          {
            "start": 1,
            "end": 10
          },
          {
            "start": 7,
            "end": 5
          }
        ],
        "srcUdpPorts": [
          {
            "start": 2,
            "end": 5
          },
          {
            "start": 10,
            "end": 6
          },
          {
            "start": 8,
            "end": 5
          },
          {
            "start": 10,
            "end": 9
          }
        ],
        "destUdpPorts": [
          {
            "start": 8,
            "end": 6
          },
          {
            "start": 5,
            "end": 9
          },
          {
            "start": 8,
            "end": 5
          },
          {
            "start": 2,
            "end": 8
          },
          {
            "start": 10,
            "end": 10
          },
          {
            "start": 5,
            "end": 5
          },
          {
            "start": 6,
            "end": 7
          },
          {
            "start": 10,
            "end": 10
          }
        ],
        "type": "PREDEFINED",
        "description": "string",
        "isNameL10nTag": false
      },
      {
        "id": 4,
        "name": "string",
        "tag": "string",
        "srcTcpPorts": [
          {
            "start": 4,
            "end": 10
          },
          {
            "start": 9,
            "end": 1
          },
          {
            "start": 10,
            "end": 9
          },
          {
            "start": 4,
            "end": 5
          },
          {
            "start": 10,
            "end": 8
          },
          {
            "start": 10,
            "end": 3
          },
          {
            "start": 9,
            "end": 8
          },
          {
            "start": 9,
            "end": 4
          },
          {
            "start": 10,
            "end": 9
          }
        ],
        "destTcpPorts": [
          {
            "start": 1,
            "end": 5
          },
          {
            "start": 9,
            "end": 10
          },
          {
            "start": 4,
            "end": 6
          },
          {
            "start": 6,
            "end": 1
          }
        ],
        "srcUdpPorts": [
          {
            "start": 8,
            "end": 6
          },
          {
            "start": 2,
            "end": 6
          },
          {
            "start": 2,
            "end": 10
          },
          {
            "start": 7,
            "end": 6
          },
          {
            "start": 10,
            "end": 5
          },
          {
            "start": 1,
            "end": 2
          },
          {
            "start": 6,
            "end": 3
          },
          {
            "start": 10,
            "end": 3
          }
        ],
        "destUdpPorts": [
          {
            "start": 9,
            "end": 2
          },
          {
            "start": 3,
            "end": 6
          },
          {
            "start": 7,
            "end": 8
          },
          {
            "start": 1,
            "end": 4
          },
          {
            "start": 2,
            "end": 6
          },
          {
            "start": 8,
            "end": 8
          },
          {
            "start": 9,
            "end": 4
          },
          {
            "start": 8,
            "end": 6
          },
          {
            "start": 4,
            "end": 2
          },
          {
            "start": 8,
            "end": 10
          }
        ],
        "type": "PREDEFINED",
        "description": "string",
        "isNameL10nTag": true
      },
      {
        "id": 4,
        "name": "string",
        "tag": "string",
        "srcTcpPorts": [
          {
            "start": 5,
            "end": 6
          }
        ],
        "destTcpPorts": [
          {
            "start": 6,
            "end": 10
          },
          {
            "start": 4,
            "end": 2
          },
          {
            "start": 10,
            "end": 9
          },
          {
            "start": 3,
            "end": 1
          },
          {
            "start": 1,
            "end": 1
          },
          {
            "start": 10,
            "end": 7
          },
          {
            "start": 5,
            "end": 9
          },
          {
            "start": 1,
            "end": 7
          }
        ],
        "srcUdpPorts": [
          {
            "start": 10,
            "end": 10
          }
        ],
        "destUdpPorts": [
          {
            "start": 6,
            "end": 3
          },
          {
            "start": 1,
            "end": 2
          },
          {
            "start": 7,
            "end": 4
          },
          {
            "start": 9,
            "end": 6
          },
          {
            "start": 7,
            "end": 8
          },
          {
            "start": 9,
            "end": 7
          },
          {
            "start": 8,
            "end": 1
          },
          {
            "start": 6,
            "end": 9
          },
          {
            "start": 7,
            "end": 6
          },
          {
            "start": 2,
            "end": 10
          }
        ],
        "type": "PREDEFINED",
        "description": "string",
        "isNameL10nTag": false
      },
      {
        "id": 5,
        "name": "string",
        "tag": "string",
        "srcTcpPorts": [
          {
            "start": 3,
            "end": 1
          },
          {
            "start": 4,
            "end": 10
          },
          {
            "start": 5,
            "end": 4
          },
          {
            "start": 1,
            "end": 1
          },
          {
            "start": 4,
            "end": 8
          },
          {
            "start": 4,
            "end": 7
          },
          {
            "start": 8,
            "end": 10
          }
        ],
        "destTcpPorts": [
          {
            "start": 1,
            "end": 8
          },
          {
            "start": 7,
            "end": 1
          },
          {
            "start": 3,
            "end": 7
          },
          {
            "start": 7,
            "end": 3
          },
          {
            "start": 10,
            "end": 4
          },
          {
            "start": 9,
            "end": 8
          },
          {
            "start": 7,
            "end": 3
          },
          {
            "start": 3,
            "end": 10
          }
        ],
        "srcUdpPorts": [
          {
            "start": 10,
            "end": 8
          },
          {
            "start": 3,
            "end": 9
          },
          {
            "start": 9,
            "end": 6
          },
          {
            "start": 5,
            "end": 8
          },
          {
            "start": 3,
            "end": 4
          },
          {
            "start": 8,
            "end": 6
          },
          {
            "start": 3,
            "end": 5
          },
          {
            "start": 2,
            "end": 2
          }
        ],
        "destUdpPorts": [
          {
            "start": 1,
            "end": 2
          },
          {
            "start": 8,
            "end": 2
          },
          {
            "start": 10,
            "end": 2
          },
          {
            "start": 5,
            "end": 8
          },
          {
            "start": 8,
            "end": 9
          },
          {
            "start": 1,
            "end": 8
          },
          {
            "start": 3,
            "end": 2
          },
          {
            "start": 5,
            "end": 4
          },
          {
            "start": 8,
            "end": 2
          },
          {
            "start": 7,
            "end": 2
          }
        ],
        "type": "PREDEFINED",
        "description": "string",
        "isNameL10nTag": false
      },
      {
        "id": 4,
        "name": "string",
        "tag": "string",
        "srcTcpPorts": [
          {
            "start": 1,
            "end": 3
          },
          {
            "start": 9,
            "end": 6
          },
          {
            "start": 1,
            "end": 1
          },
          {
            "start": 5,
            "end": 3
          },
          {
            "start": 3,
            "end": 10
          }
        ],
        "destTcpPorts": [
          {
            "start": 5,
            "end": 7
          }
        ],
        "srcUdpPorts": [
          {
            "start": 3,
            "end": 6
          },
          {
            "start": 6,
            "end": 4
          }
        ],
        "destUdpPorts": [
          {
            "start": 7,
            "end": 9
          },
          {
            "start": 6,
            "end": 8
          },
          {
            "start": 6,
            "end": 6
          },
          {
            "start": 7,
            "end": 3
          },
          {
            "start": 3,
            "end": 1
          },
          {
            "start": 9,
            "end": 4
          },
          {
            "start": 6,
            "end": 7
          },
          {
            "start": 7,
            "end": 7
          }
        ],
        "type": "PREDEFINED",
        "description": "string",
        "isNameL10nTag": true
      },
      {
        "id": 6,
        "name": "string",
        "tag": "string",
        "srcTcpPorts": [
          {
            "start": 6,
            "end": 1
          },
          {
            "start": 2,
            "end": 6
          }
        ],
        "destTcpPorts": [
          {
            "start": 8,
            "end": 6
          },
          {
            "start": 8,
            "end": 3
          },
          {
            "start": 7,
            "end": 6
          },
          {
            "start": 4,
            "end": 6
          }
        ],
        "srcUdpPorts": [
          {
            "start": 8,
            "end": 10
          },
          {
            "start": 10,
            "end": 5
          },
          {
            "start": 9,
            "end": 1
          },
          {
            "start": 3,
            "end": 4
          }
        ],
        "destUdpPorts": [
          {
            "start": 4,
            "end": 8
          },
          {
            "start": 5,
            "end": 9
          },
          {
            "start": 9,
            "end": 7
          },
          {
            "start": 8,
            "end": 7
          },
          {
            "start": 5,
            "end": 6
          },
          {
            "start": 9,
            "end": 9
          },
          {
            "start": 1,
            "end": 4
          },
          {
            "start": 5,
            "end": 10
          }
        ],
        "type": "CUSTOM",
        "description": "string",
        "isNameL10nTag": false
      }
    ],
    "description": "string"
  }
]