[
  {
    "id": "MATURE_HUMOR",
    "configuredName": "string",
    "urls": [
      "string",
      "string",
      "string",
      "string",
      "string",
      "string",
      "string",
      "string",
      "string",
      "string"
    ],
    "dbCategorizedUrls": [
      "string",
      "string",
      "string"
    ],
    "customCategory": true,
    "scopes": [
      {
        "scopeGroupMemberEntities": [
          {
            "id": 10,
            "name": "string",
            "extensions": {}
          },
          {
            "id": 6,
            "name": "string",
            "extensions": {}
          },
          {
            "id": 4,
            "name": "string",
            "extensions": {}
          },
          {
            "id": 9,
            "name": "string",
            "extensions": {}
          },
          {
            "id": 8,
            "name": "string",
            "extensions": {}
          },
          {
            "id": 4,
            "name": "string",
            "extensions": {}
          },
          {
            "id": 5,
            "name": "string",
            "extensions": {}
          }
        ],
        "Type": "LOCATION",
        "ScopeEntities": [
          {
            "id": 2,
            "name": "string",
            "extensions": {}
          },
          {
            "id": 8,
            "name": "string",
            "extensions": {}
          },
          {
            "id": 10,
            "name": "string",
            "extensions": {}
          },
          {
            "id": 5,
            "name": "string",
            "extensions": {}
          }
        ]
      },
      {
        "scopeGroupMemberEntities": [
          {
            "id": 1,
            "name": "string",
            "extensions": {}
          },
          {
            "id": 8,
            "name": "string",
            "extensions": {}
          },
          {
            "id": 9,
            "name": "string",
            "extensions": {}
          },
          {
            "id": 2,
            "name": "string",
            "extensions": {}
          },
          {
            "id": 1,
            "name": "string",
            "extensions": {}
          },
          {
            "id": 4,
            "name": "string",
            "extensions": {}
          }
        ],
        "Type": "DEPARTMENT",
        "ScopeEntities": [
          {
            "id": 2,
            "name": "string",
            "extensions": {}
          },
          {
            "id": 5,
            "name": "string",
            "extensions": {}
          },
          {
            "id": 4,
            "name": "string",
            "extensions": {}
          }
        ]
      },
      {
        "scopeGroupMemberEntities": [
          {
            "id": 3,
            "name": "string",
            "extensions": {}
          },
          {
            "id": 7,
            "name": "string",
            "extensions": {}
          },
          {
            "id": 3,
            "name": "string",
            "extensions": {}
          },
          {
            "id": 8,
            "name": "string",
            "extensions": {}
          },
          {
            "id": 10,
            "name": "string",
            "extensions": {}
          },
          {
            "id": 5,
            "name": "string",
            "extensions": {}
          },
          {
            "id": 6,
            "name": "string",
            "extensions": {}
          },
          {
            "id": 7,
            "name": "string",
            "extensions": {}
          }
        ],
        "Type": "DEPARTMENT",
        "ScopeEntities": [
          {
            "id": 1,
            "name": "string",
            "extensions": {}
          },
          {
            "id": 7,
            "name": "string",
            "extensions": {}
          }
        ]
      },
      {
        "scopeGroupMemberEntities": [
          {
            "id": 8,
            "name": "string",
            "extensions": {}
          },
          {
            "id": 2,
            "name": "string",
            "extensions": {}
          }
        ],
        "Type": "LOCATION",
        "ScopeEntities": [
          {
            "id": 7,
            "name": "string",
            "extensions": {}
          },
          {
            "id": 3,
            "name": "string",
            "extensions": {}
          },
          {
            "id": 3,
            "name": "string",
            "extensions": {}
          },
          {
            "id": 8,
            "name": "string",
            "extensions": {}
          },
          {
            "id": 10,
            "name": "string",
            "extensions": {}
          },
          {
            "id": 7,
            "name": "string",
            "extensions": {}
          },
          {
            "id": 4,
            "name": "string",
            "extensions": {}
          }
        ]
      },
      {
        "scopeGroupMemberEntities": [
          {
            "id": 10,
            "name": "string",
            "extensions": {}
          },
          {
            "id": 1,
            "name": "string",
            "extensions": {}
          },
          {
            "id": 6,
            "name": "string",
            "extensions": {}
          },
          {
            "id": 10,
            "name": "string",
            "extensions": {}
          },
          {
            "id": 6,
            "name": "string",
            "extensions": {}
          },
          {
            "id": 3,
            "name": "string",
            "extensions": {}
          },
          {
            "id": 6,
            "name": "string",
            "extensions": {}
          },
          {
            "id": 9,
            "name": "string",
            "extensions": {}
          },
          {
            "id": 2,
            "name": "string",
            "extensions": {}
          }
        ],
        "Type": "DEPARTMENT",
        "ScopeEntities": [
          {
            "id": 1,
            "name": "string",
            "extensions": {}
          },
          {
            "id": 10,
            "name": "string",
            "extensions": {}
          }
        ]
      },
      {
        "scopeGroupMemberEntities": [
          {
            "id": 7,
            "name": "string",
            "extensions": {}
          },
          {
            "id": 8,
            "name": "string",
            "extensions": {}
          }
        ],
        "Type": "LOCATION_GROUP",
        "ScopeEntities": [
          {
            "id": 4,
            "name": "string",
            "extensions": {}
          },
          {
            "id": 3,
            "name": "string",
            "extensions": {}
          },
          {
            "id": 9,
            "name": "string",
            "extensions": {}
          },
          {
            "id": 3,
            "name": "string",
            "extensions": {}
          }
        ]
      },
      {
        "scopeGroupMemberEntities": [
          {
            "id": 9,
            "name": "string",
            "extensions": {}
          },
          {
            "id": 4,
            "name": "string",
            "extensions": {}
          },
          {
            "id": 4,
            "name": "string",
            "extensions": {}
          },
          {
            "id": 8,
            "name": "string",
            "extensions": {}
          },
          {
            "id": 6,
            "name": "string",
            "extensions": {}
          },
          {
            "id": 4,
            "name": "string",
            "extensions": {}
          }
        ],
        "Type": "LOCATION_GROUP",
        "ScopeEntities": [
          {
            "id": 3,
            "name": "string",
            "extensions": {}
          },
          {
            "id": 3,
            "name": "string",
            "extensions": {}
          }
        ]
      }
    ],
    "editable": true,
    "description": "string",
    "val": 7
  },
  {
    "id": "CUSTOM_00",
    "configuredName": "string",
    "urls": [
      "string",
      "string",
      "string",
      "string",
      "string",
      "string",
      "string",
      "string",
      "string"
    ],
    "dbCategorizedUrls": [
      "string",
      "string",
      "string",
      "string",
      "string",
      "string"
    ],
    "customCategory": true,
    "scopes": [
      {
        "scopeGroupMemberEntities": [
          {
            "id": 5,
            "name": "string",
            "extensions": {}
          }
        ],
        "Type": "LOCATION_GROUP",
        "ScopeEntities": [
          {
            "id": 6,
            "name": "string",
            "extensions": {}
          },
          {
            "id": 1,
            "name": "string",
            "extensions": {}
          },
          {
            "id": 4,
            "name": "string",
            "extensions": {}
          },
          {
            "id": 1,
            "name": "string",
            "extensions": {}
          },
          {
            "id": 2,
            "name": "string",
            "extensions": {}
          },
          {
            "id": 6,
            "name": "string",
            "extensions": {}
          },
          {
            "id": 7,
            "name": "string",
            "extensions": {}
          },
          {
            "id": 5,
            "name": "string",
            "extensions": {}
          },
          {
            "id": 1,
            "name": "string",
            "extensions": {}
          },
          {
            "id": 9,
            "name": "string",
            "extensions": {}
          }
        ]
      },
      {
        "scopeGroupMemberEntities": [
          {
            "id": 7,
            "name": "string",
            "extensions": {}
          },
          {
            "id": 4,
            "name": "string",
            "extensions": {}
          },
          {
            "id": 2,
            "name": "string",
            "extensions": {}
          },
          {
            "id": 10,
            "name": "string",
            "extensions": {}
          },
          {
            "id": 4,
            "name": "string",
            "extensions": {}
          }
        ],
        "Type": "ORGANIZATION",
        "ScopeEntities": [
          {
            "id": 7,
            "name": "string",
            "extensions": {}
          },
          {
            "id": 4,
            "name": "string",
            "extensions": {}
          },
          {
            "id": 7,
            "name": "string",
            "extensions": {}
          },
          {
            "id": 7,
            "name": "string",
            "extensions": {}
          },
          {
            "id": 1,
            "name": "string",
            "extensions": {}
          },
          {
            "id": 1,
            "name": "string",
            "extensions": {}
          },
          {
            "id": 7,
            "name": "string",
            "extensions": {}
          },
          {
            "id": 6,
            "name": "string",
            "extensions": {}
          },
          {
            "id": 1,
            "name": "string",
            "extensions": {}
          }
        ]
      },
      {
        "scopeGroupMemberEntities": [
          {
            "id": 1,
            "name": "string",
            "extensions": {}
          },
          {
            "id": 5,
            "name": "string",
            "extensions": {}
          },
          {
            "id": 6,
            "name": "string",
            "extensions": {}
          },
          {
            "id": 6,
            "name": "string",
            "extensions": {}
          },
          {
            "id": 5,
            "name": "string",
            "extensions": {}
          }
        ],
        "Type": "DEPARTMENT",
        "ScopeEntities": [
          {
            "id": 10,
            "name": "string",
            "extensions": {}
          },
          {
            "id": 8,
            "name": "string",
            "extensions": {}
          }
        ]
      },
      {
        "scopeGroupMemberEntities": [
          {
            "id": 10,
            "name": "string",
            "extensions": {}
          },
          {
            "id": 1,
            "name": "string",
            "extensions": {}
          },
          {
            "id": 7,
            "name": "string",
            "extensions": {}
          },
          {
            "id": 2,
            "name": "string",
            "extensions": {}
          },
          {
            "id": 2,
            "name": "string",
            "extensions": {}
          },
          {
            "id": 2,
            "name": "string",
            "extensions": {}
          }
        ],
        "Type": "LOCATION_GROUP",
        "ScopeEntities": [
          {
            "id": 5,
            "name": "string",
            "extensions": {}
          },
          {
            "id": 1,
            "name": "string",
            "extensions": {}
          },
          {
            "id": 6,
            "name": "string",
            "extensions": {}
          },
          {
            "id": 4,
            "name": "string",
            "extensions": {}
          },
          {
            "id": 8,
            "name": "string",
            "extensions": {}
          },
          {
            "id": 10,
            "name": "string",
            "extensions": {}
          }
        ]
      },
      {
        "scopeGroupMemberEntities": [
          {
            "id": 5,
            "name": "string",
            "extensions": {}
          },
          {
            "id": 3,
            "name": "string",
            "extensions": {}
          },
          {
            "id": 10,
            "name": "string",
            "extensions": {}
          },
          {
            "id": 7,
            "name": "string",
            "extensions": {}
          }
        ],
        "Type": "LOCATION",
        "ScopeEntities": [
          {
            "id": 9,
            "name": "string",
            "extensions": {}
          }
        ]
      },
      {
        "scopeGroupMemberEntities": [
          {
            "id": 2,
            "name": "string",
            "extensions": {}
          },
          {
            "id": 9,
            "name": "string",
            "extensions": {}
          }
        ],
        "Type": "LOCATION",
        "ScopeEntities": [
          {
            "id": 8,
            "name": "string",
            "extensions": {}
          },
          {
            "id": 6,
            "name": "string",
            "extensions": {}
          },
          {
            "id": 8,
            "name": "string",
            "extensions": {}
          },
          {
            "id": 10,
            "name": "string",
            "extensions": {}
          },
          {
            "id": 7,
            "name": "string",
            "extensions": {}
          },
          {
            "id": 1,
            "name": "string",
            "extensions": {}
          }
        ]
      },
      {
        "scopeGroupMemberEntities": [
          {
            "id": 4,
            "name": "string",
            "extensions": {}
          },
          {
            "id": 3,
            "name": "string",
            "extensions": {}
          }
        ],
        "Type": "LOCATION_GROUP",
        "ScopeEntities": [
          {
            "id": 8,
            "name": "string",
            "extensions": {}
          },
          {
            "id": 2,
            "name": "string",
            "extensions": {}
          },
          {
            "id": 8,
            "name": "string",
            "extensions": {}
          },
          {
            "id": 7,
            "name": "string",
            "extensions": {}
          }
        ]
      },
      {
        "scopeGroupMemberEntities": [
          {
            "id": 1,
            "name": "string",
            "extensions": {}
          },
          {
            "id": 8,
            "name": "string",
            "extensions": {}
          }
        ],
        "Type": "DEPARTMENT",
        "ScopeEntities": [
          {
            "id": 10,
            "name": "string",
            "extensions": {}
          },
          {
            "id": 5,
            "name": "string",
            "extensions": {}
          },
          {
            "id": 9,
            "name": "string",
            "extensions": {}
          }
        ]
      },
      {
        "scopeGroupMemberEntities": [
          {
            "id": 7,
            "name": "string",
            "extensions": {}
          },
          {
            "id": 3,
            "name": "string",
            "extensions": {}
          },
          {
            "id": 9,
            "name": "string",
            "extensions": {}
          },
          {
            "id": 2,
            "name": "string",
            "extensions": {}
          },
          {
            "id": 4,
            "name": "string",
            "extensions": {}
          },
          {
            "id": 5,
            "name": "string",
            "extensions": {}
          },
          {
            "id": 6,
            "name": "string",
            "extensions": {}
          },
          {
            "id": 7,
            "name": "string",
            "extensions": {}
          }
        ],
        "Type": "ORGANIZATION",
        "ScopeEntities": [
          {
            "id": 5,
            "name": "string",
            "extensions": {}
          },
          {
            "id": 5,
            "name": "string",
            "extensions": {}
          },
          {
            "id": 7,
            "name": "string",
            "extensions": {}
          },
          {
            "id": 7,
            "name": "string",
            "extensions": {}
          },
          {
            "id": 1,
            "name": "string",
            "extensions": {}
          },
          {
            "id": 6,
            "name": "string",
            "extensions": {}
          },
          {
            "id": 6,
            "name": "string",
            "extensions": {}
          },
          {
            "id": 1,
            "name": "string",
            "extensions": {}
          },
          {
            "id": 4,
            "name": "string",
            "extensions": {}
          },
          {
            "id": 2,
            "name": "string",
            "extensions": {}
          }
        ]
      }
    ],
    "editable": false,
    "description": "string",
    "val": 2
  }
]