[
  {
    "id": "bse_12345_ARBHLJ70Y78rGOIGBS",
    "object": "blockedsite_exception",
    "version": 1,
    "account": "WGC-1-123abc456",
    "created": 1579907960,
    "device": 12345,
    "author": "testuser",
    "description": "Block example.com",
    "address": {
      "type": "fqdn",
      "value": "example.com"
    },
    "action": "block"
  },
  {
    "id": "bse_12345_ARBHLJ70Y78rGOIGBS",
    "object": "blockedsite_exception",
    "version": 1,
    "account": "WGC-1-123abc456",
    "created": 1579907960,
    "device": 12345,
    "author": "testuser",
    "description": "Block example.com",
    "address": {
      "type": "fqdn",
      "value": "example.com"
    },
    "action": "block"
  }
]