{
  "id": "string",
  "object": "string",
  "version": 1,
  "account": "WGC-1-123abc456",
  "created": 1579907960,
  "device": 12345,
  "author": "string",
  "description": "Block example.com",
  "address": {},
  "action": "block",
  "inactive": true
}