[
  {
    "account": "WGC-1-123abc456",
    "operator": "null",
    "children": [],
    "device": [
      12345
    ],
    "id": "deployment_12345_1583348088_es9qbbewaPWAMPrv34wTlVCE",
    "status": "complete",
    "start_date": "\"2020-03-04T18:54:48Z\"",
    "data": "{\\\"version\\\": 1, \\\"deployment_type\\\": \\\"whitelist\\\", \\\"description\\\": \\\"Deploy exceptions to Seattle office\\\", \\\"configs\\\": [{\\\"object\\\": \\\"botnet_exception\\\", \\\"version\\\": 1, \\\"created\\\": 1582751451, \\\"id\\\": \\\"bote_12124_8LBasn0hDNXnli4V0\\\", \\\"description\\\": \\\"Allow 192.0.2.1.com\\\", \\\"author\\\": \\\"\\\", \\\"account\\\": \\\"WGC-1-91b06fbe0a1246dab718\\\", \\\"address\\\": {\\\"value\\\": \\\"192.0.2.1\\\", \\\"type\\\": \\\"ipv4_host\\\"}, \\\"device\\\": 12124}], \\\"global_except_enabled\\\": true, \\\"deployment_format\\\": \\\"json\\\", \\\"fccm_enabled\\\": false}",
    "type": "deployment",
    "parent": "null",
    "start_date_epoch": 1583348088,
    "created": "\"2020-03-04T18:54:48Z\""
  }
]