{
  "id": "string",
  "object": "string",
  "version": 1,
  "account": "WGC-1-123abc456",
  "created": 1579907960,
  "device": 12345,
  "author": "string",
  "action": "allow",
  "alarm": true,
  "description": "Drop signature 1055124",
  "signature_id": "1055124",
  "inactive": true
}