{
  "actions": [
    {
      "name": "networkDeleteNetworkGatewayPool",
      "protocol": "REST",
      "method": "POST",
      "entitypath": "{base_path}/{version}/network/deleteNetworkGatewayPool?{query}",
      "requestSchema": "schema.json",
      "responseSchema": "schema.json",
      "timeout": 0,
      "sendEmpty": false,
      "requestDatatype": "JSON",
      "responseDatatype": "JSON",
      "headers": {},
      "responseObjects": [
        {
          "type": "default",
          "key": "",
          "mockFile": "mockdatafiles/networkDeleteNetworkGatewayPool-default.json"
        }
      ]
    },
    {
      "name": "networkGetNetworkGateways",
      "protocol": "REST",
      "method": "POST",
      "entitypath": "{base_path}/{version}/network/getNetworkGateways?{query}",
      "requestSchema": "schema.json",
      "responseSchema": "schema.json",
      "timeout": 0,
      "sendEmpty": false,
      "requestDatatype": "JSON",
      "responseDatatype": "JSON",
      "headers": {},
      "responseObjects": [
        {
          "type": "default",
          "key": "",
          "mockFile": "mockdatafiles/networkGetNetworkGateways-default.json"
        }
      ]
    },
    {
      "name": "networkInsertNetworkGatewayPool",
      "protocol": "REST",
      "method": "POST",
      "entitypath": "{base_path}/{version}/network/insertNetworkGatewayPool?{query}",
      "requestSchema": "schema.json",
      "responseSchema": "schema.json",
      "timeout": 0,
      "sendEmpty": false,
      "requestDatatype": "JSON",
      "responseDatatype": "JSON",
      "headers": {},
      "responseObjects": [
        {
          "type": "default",
          "key": "",
          "mockFile": "mockdatafiles/networkInsertNetworkGatewayPool-default.json"
        }
      ]
    },
    {
      "name": "networkUpdateNetworkGatewayPoolAttributes",
      "protocol": "REST",
      "method": "POST",
      "entitypath": "{base_path}/{version}/network/updateNetworkGatwayPoolAttributes?{query}",
      "requestSchema": "schema.json",
      "responseSchema": "schema.json",
      "timeout": 0,
      "sendEmpty": false,
      "requestDatatype": "JSON",
      "responseDatatype": "JSON",
      "headers": {},
      "responseObjects": [
        {
          "type": "default",
          "key": "",
          "mockFile": "mockdatafiles/networkUpdateNetworkGatewayPoolAttributes-default.json"
        }
      ]
    }
  ]
}