[
  {
    "id": 5,
    "created": "string",
    "operatorId": 10,
    "networkId": 1,
    "enterpriseId": 1,
    "edgeId": 3,
    "gatewayId": 6,
    "parentGroupId": 6,
    "description": "string",
    "object": "string",
    "name": "string",
    "type": "string",
    "logicalId": "string",
    "alertsEnabled": 0,
    "operatorAlertsEnabled": 0,
    "status": "string",
    "statusModified": "string",
    "previousData": {},
    "previousCreated": "string",
    "draftData": "string",
    "draftCreated": "string",
    "draftComment": "string",
    "data": {
      "segmentId": 6,
      "serviceVlan": 10,
      "delegateToEnterprise": true,
      "delegateToEnterpriseProxy": true
    },
    "lastContact": "string",
    "version": "string",
    "modified": "string",
    "profileCount": 10,
    "handoffUsage": [
      {},
      {},
      {},
      {},
      {},
      {}
    ],
    "isAllMPGCDE": true,
    "isAllCtrlCDE": false,
    "edgeCount": 10,
    "edgeUsage": [
      {
        "configurationId": 2,
        "edgeSpecificId": 1,
        "name": "string",
        "logicalId": "string",
        "profileId": 8
      },
      {
        "configurationId": 4,
        "edgeSpecificId": 9,
        "name": "string",
        "logicalId": "string",
        "profileId": 9
      },
      {
        "configurationId": 6,
        "edgeSpecificId": 5,
        "name": "string",
        "logicalId": "string",
        "profileId": 1
      },
      {
        "configurationId": 6,
        "edgeSpecificId": 8,
        "name": "string",
        "logicalId": "string",
        "profileId": 1
      },
      {
        "configurationId": 7,
        "edgeSpecificId": 9,
        "name": "string",
        "logicalId": "string",
        "profileId": 8
      },
      {
        "configurationId": 5,
        "edgeSpecificId": 2,
        "name": "string",
        "logicalId": "string",
        "profileId": 6
      },
      {
        "configurationId": 3,
        "edgeSpecificId": 3,
        "name": "string",
        "logicalId": "string",
        "profileId": 9
      },
      {
        "configurationId": 10,
        "edgeSpecificId": 4,
        "name": "string",
        "logicalId": "string",
        "profileId": 10
      },
      {
        "configurationId": 2,
        "edgeSpecificId": 10,
        "name": "string",
        "logicalId": "string",
        "profileId": 6
      }
    ],
    "configuration": [
      {
        "id": 7,
        "created": "string",
        "name": "string",
        "logicalId": "string",
        "version": "string",
        "description": "string",
        "configurationType": "SEGMENT_BASED",
        "schemaVersion": "string",
        "effective": "string",
        "modified": "string",
        "moduleId": 2,
        "segmentObjectId": 8
      },
      {
        "id": 8,
        "created": "string",
        "name": "string",
        "logicalId": "string",
        "version": "string",
        "description": "string",
        "configurationType": "SEGMENT_BASED",
        "schemaVersion": "string",
        "effective": "string",
        "modified": "string",
        "moduleId": 4,
        "segmentObjectId": 10
      },
      {
        "id": 3,
        "created": "string",
        "name": "string",
        "logicalId": "string",
        "version": "string",
        "description": "string",
        "configurationType": "NETWORK_BASED",
        "schemaVersion": "string",
        "effective": "string",
        "modified": "string",
        "moduleId": 6,
        "segmentObjectId": 6
      },
      {
        "id": 8,
        "created": "string",
        "name": "string",
        "logicalId": "string",
        "version": "string",
        "description": "string",
        "configurationType": "SEGMENT_BASED",
        "schemaVersion": "string",
        "effective": "string",
        "modified": "string",
        "moduleId": 6,
        "segmentObjectId": 4
      },
      {
        "id": 5,
        "created": "string",
        "name": "string",
        "logicalId": "string",
        "version": "string",
        "description": "string",
        "configurationType": "SEGMENT_BASED",
        "schemaVersion": "string",
        "effective": "string",
        "modified": "string",
        "moduleId": 1,
        "segmentObjectId": 2
      },
      {
        "id": 8,
        "created": "string",
        "name": "string",
        "logicalId": "string",
        "version": "string",
        "description": "string",
        "configurationType": "SEGMENT_BASED",
        "schemaVersion": "string",
        "effective": "string",
        "modified": "string",
        "moduleId": 4,
        "segmentObjectId": 5
      },
      {
        "id": 9,
        "created": "string",
        "name": "string",
        "logicalId": "string",
        "version": "string",
        "description": "string",
        "configurationType": "NETWORK_BASED",
        "schemaVersion": "string",
        "effective": "string",
        "modified": "string",
        "moduleId": 8,
        "segmentObjectId": 2
      }
    ]
  },
  {
    "id": 6,
    "created": "string",
    "operatorId": 9,
    "networkId": 5,
    "enterpriseId": 10,
    "edgeId": 2,
    "gatewayId": 3,
    "parentGroupId": 10,
    "description": "string",
    "object": "string",
    "name": "string",
    "type": "string",
    "logicalId": "string",
    "alertsEnabled": 0,
    "operatorAlertsEnabled": 0,
    "status": "string",
    "statusModified": "string",
    "previousData": {},
    "previousCreated": "string",
    "draftData": "string",
    "draftCreated": "string",
    "draftComment": "string",
    "data": {
      "segmentId": 1,
      "serviceVlan": 5,
      "delegateToEnterprise": true,
      "delegateToEnterpriseProxy": false
    },
    "lastContact": "string",
    "version": "string",
    "modified": "string",
    "profileCount": 5,
    "handoffUsage": [
      {},
      {},
      {},
      {},
      {}
    ],
    "isAllMPGCDE": true,
    "isAllCtrlCDE": false,
    "edgeCount": 9,
    "edgeUsage": [
      {
        "configurationId": 7,
        "edgeSpecificId": 2,
        "name": "string",
        "logicalId": "string",
        "profileId": 9
      },
      {
        "configurationId": 4,
        "edgeSpecificId": 6,
        "name": "string",
        "logicalId": "string",
        "profileId": 4
      },
      {
        "configurationId": 9,
        "edgeSpecificId": 1,
        "name": "string",
        "logicalId": "string",
        "profileId": 10
      }
    ],
    "configuration": [
      {
        "id": 2,
        "created": "string",
        "name": "string",
        "logicalId": "string",
        "version": "string",
        "description": "string",
        "configurationType": "NETWORK_BASED",
        "schemaVersion": "string",
        "effective": "string",
        "modified": "string",
        "moduleId": 8,
        "segmentObjectId": 3
      },
      {
        "id": 8,
        "created": "string",
        "name": "string",
        "logicalId": "string",
        "version": "string",
        "description": "string",
        "configurationType": "NETWORK_BASED",
        "schemaVersion": "string",
        "effective": "string",
        "modified": "string",
        "moduleId": 3,
        "segmentObjectId": 10
      },
      {
        "id": 2,
        "created": "string",
        "name": "string",
        "logicalId": "string",
        "version": "string",
        "description": "string",
        "configurationType": "NETWORK_BASED",
        "schemaVersion": "string",
        "effective": "string",
        "modified": "string",
        "moduleId": 10,
        "segmentObjectId": 1
      },
      {
        "id": 7,
        "created": "string",
        "name": "string",
        "logicalId": "string",
        "version": "string",
        "description": "string",
        "configurationType": "SEGMENT_BASED",
        "schemaVersion": "string",
        "effective": "string",
        "modified": "string",
        "moduleId": 2,
        "segmentObjectId": 9
      },
      {
        "id": 3,
        "created": "string",
        "name": "string",
        "logicalId": "string",
        "version": "string",
        "description": "string",
        "configurationType": "SEGMENT_BASED",
        "schemaVersion": "string",
        "effective": "string",
        "modified": "string",
        "moduleId": 8,
        "segmentObjectId": 3
      },
      {
        "id": 5,
        "created": "string",
        "name": "string",
        "logicalId": "string",
        "version": "string",
        "description": "string",
        "configurationType": "SEGMENT_BASED",
        "schemaVersion": "string",
        "effective": "string",
        "modified": "string",
        "moduleId": 3,
        "segmentObjectId": 4
      }
    ]
  },
  {
    "id": 7,
    "created": "string",
    "operatorId": 1,
    "networkId": 2,
    "enterpriseId": 6,
    "edgeId": 8,
    "gatewayId": 6,
    "parentGroupId": 5,
    "description": "string",
    "object": "string",
    "name": "string",
    "type": "string",
    "logicalId": "string",
    "alertsEnabled": 0,
    "operatorAlertsEnabled": 0,
    "status": "string",
    "statusModified": "string",
    "previousData": {},
    "previousCreated": "string",
    "draftData": "string",
    "draftCreated": "string",
    "draftComment": "string",
    "data": {
      "segmentId": 2,
      "serviceVlan": 2,
      "delegateToEnterprise": true,
      "delegateToEnterpriseProxy": false
    },
    "lastContact": "string",
    "version": "string",
    "modified": "string",
    "profileCount": 9,
    "handoffUsage": [
      {},
      {},
      {},
      {},
      {},
      {}
    ],
    "isAllMPGCDE": false,
    "isAllCtrlCDE": false,
    "edgeCount": 8,
    "edgeUsage": [
      {
        "configurationId": 10,
        "edgeSpecificId": 10,
        "name": "string",
        "logicalId": "string",
        "profileId": 4
      },
      {
        "configurationId": 6,
        "edgeSpecificId": 1,
        "name": "string",
        "logicalId": "string",
        "profileId": 9
      },
      {
        "configurationId": 6,
        "edgeSpecificId": 8,
        "name": "string",
        "logicalId": "string",
        "profileId": 5
      },
      {
        "configurationId": 6,
        "edgeSpecificId": 8,
        "name": "string",
        "logicalId": "string",
        "profileId": 7
      },
      {
        "configurationId": 1,
        "edgeSpecificId": 5,
        "name": "string",
        "logicalId": "string",
        "profileId": 9
      },
      {
        "configurationId": 7,
        "edgeSpecificId": 4,
        "name": "string",
        "logicalId": "string",
        "profileId": 9
      }
    ],
    "configuration": [
      {
        "id": 9,
        "created": "string",
        "name": "string",
        "logicalId": "string",
        "version": "string",
        "description": "string",
        "configurationType": "SEGMENT_BASED",
        "schemaVersion": "string",
        "effective": "string",
        "modified": "string",
        "moduleId": 1,
        "segmentObjectId": 5
      },
      {
        "id": 4,
        "created": "string",
        "name": "string",
        "logicalId": "string",
        "version": "string",
        "description": "string",
        "configurationType": "NETWORK_BASED",
        "schemaVersion": "string",
        "effective": "string",
        "modified": "string",
        "moduleId": 3,
        "segmentObjectId": 8
      },
      {
        "id": 6,
        "created": "string",
        "name": "string",
        "logicalId": "string",
        "version": "string",
        "description": "string",
        "configurationType": "SEGMENT_BASED",
        "schemaVersion": "string",
        "effective": "string",
        "modified": "string",
        "moduleId": 7,
        "segmentObjectId": 7
      },
      {
        "id": 7,
        "created": "string",
        "name": "string",
        "logicalId": "string",
        "version": "string",
        "description": "string",
        "configurationType": "SEGMENT_BASED",
        "schemaVersion": "string",
        "effective": "string",
        "modified": "string",
        "moduleId": 8,
        "segmentObjectId": 2
      },
      {
        "id": 10,
        "created": "string",
        "name": "string",
        "logicalId": "string",
        "version": "string",
        "description": "string",
        "configurationType": "SEGMENT_BASED",
        "schemaVersion": "string",
        "effective": "string",
        "modified": "string",
        "moduleId": 9,
        "segmentObjectId": 10
      },
      {
        "id": 6,
        "created": "string",
        "name": "string",
        "logicalId": "string",
        "version": "string",
        "description": "string",
        "configurationType": "SEGMENT_BASED",
        "schemaVersion": "string",
        "effective": "string",
        "modified": "string",
        "moduleId": 3,
        "segmentObjectId": 3
      },
      {
        "id": 5,
        "created": "string",
        "name": "string",
        "logicalId": "string",
        "version": "string",
        "description": "string",
        "configurationType": "NETWORK_BASED",
        "schemaVersion": "string",
        "effective": "string",
        "modified": "string",
        "moduleId": 4,
        "segmentObjectId": 8
      }
    ]
  }
]