{
  "configurationType": "SEGMENT_BASED",
  "created": "string",
  "description": "string",
  "edgeCount": 4,
  "effective": "string",
  "id": 3,
  "logicalId": "string",
  "modified": "string",
  "modules": [
    {
      "created": "string",
      "effective": "string",
      "id": 4,
      "isSmallData": 1,
      "modified": "string",
      "name": "controlPlane",
      "type": "OPERATOR",
      "description": "string",
      "configurationId": 8,
      "data": {},
      "refs": {},
      "schemaVersion": "string"
    },
    {
      "created": "string",
      "effective": "string",
      "id": 5,
      "isSmallData": 0,
      "modified": "string",
      "name": "managementPlane",
      "type": "GATEWAY",
      "description": "string",
      "configurationId": 1,
      "data": {},
      "refs": {},
      "schemaVersion": "string"
    }
  ],
  "name": "string",
  "schemaVersion": "string",
  "version": "string"
}