[
  {
    "id": 8,
    "networkId": 6,
    "enterpriseProxyId": 8,
    "created": "string",
    "name": "string",
    "description": "string",
    "isDefault": true,
    "handOffType": "ALLOW",
    "modified": "string",
    "gateways": [
      {
        "gatewayPoolAssocId": 2,
        "poolName": "string",
        "id": 2,
        "created": "string",
        "networkId": 7,
        "enterpriseProxyId": 3,
        "siteId": 5,
        "activationKey": "string",
        "activationState": "string",
        "activationTime": "string",
        "softwareVersion": "string",
        "buildNumber": "string",
        "utilization": 7,
        "utilizationDetail": {
          "load": 10,
          "overall": 6,
          "cpu": 10,
          "memory": 5
        },
        "connectedEdges": 6,
        "connectedEdgeList": [
          {
            "vceid": "string"
          },
          {
            "vceid": "string"
          },
          {
            "vceid": "string"
          },
          {
            "vceid": "string"
          }
        ],
        "deviceId": "string",
        "logicalId": "string",
        "name": "string",
        "gatewayState": "string",
        "description": "string",
        "dnsName": "string",
        "isLoadBalanced": 2,
        "privateIpAddress": "string",
        "ipAddress": "string",
        "lastContact": "string",
        "systemUpSince": "string",
        "serviceUpSince": "string",
        "serviceState": "string",
        "endpointPkiMode": "string",
        "handOffDetail": {
          "type": "string",
          "subnets": [
            {
              "name": "string",
              "routeCost": 1,
              "cidrIp": "string",
              "cidrPrefix": 1,
              "encrypt": false,
              "handOffType": "NAT"
            },
            {
              "name": "string",
              "routeCost": 8,
              "cidrIp": "string",
              "cidrPrefix": 5,
              "encrypt": false,
              "handOffType": "VLAN"
            },
            {
              "name": "string",
              "routeCost": 1,
              "cidrIp": "string",
              "cidrPrefix": 9,
              "encrypt": false,
              "handOffType": "VLAN"
            },
            {
              "name": "string",
              "routeCost": 8,
              "cidrIp": "string",
              "cidrPrefix": 8,
              "encrypt": false,
              "handOffType": "VLAN"
            },
            {
              "name": "string",
              "routeCost": 8,
              "cidrIp": "string",
              "cidrPrefix": 4,
              "encrypt": false,
              "handOffType": "NAT"
            },
            {
              "name": "string",
              "routeCost": 9,
              "cidrIp": "string",
              "cidrPrefix": 9,
              "encrypt": false,
              "handOffType": "VLAN"
            },
            {
              "name": "string",
              "routeCost": 9,
              "cidrIp": "string",
              "cidrPrefix": 2,
              "encrypt": false,
              "handOffType": "VLAN"
            }
          ],
          "icmpProbe": {
            "enabled": true,
            "probeType": "string",
            "cTag": 2,
            "sTag": 2,
            "destinationIp": "string",
            "frequencySeconds": 2,
            "threshold": 5
          },
          "icmpResponder": {
            "enabled": false,
            "ipAddress": "string",
            "mode": "string"
          }
        },
        "ipsecGatewayDetail": {
          "enabled": false,
          "strictHostCheck": true,
          "strictHostCheckDN": "string"
        },
        "modified": "string"
      }
    ],
    "enterprises": [
      {
        "id": 6,
        "created": "string",
        "networkId": 8,
        "gatewayPoolId": 3,
        "alertsEnabled": 0,
        "operatorAlertsEnabled": 1,
        "endpointPkiMode": "CERTIFICATE_REQUIRED",
        "name": "string",
        "domain": "string",
        "prefix": "string",
        "logicalId": "string",
        "accountNumber": "string",
        "description": "string",
        "contactName": "string",
        "contactPhone": "string",
        "contactMobile": "string",
        "contactEmail": "string",
        "streetAddress": "string",
        "streetAddress2": "string",
        "city": "string",
        "state": "string",
        "postalCode": "string",
        "country": "string",
        "lat": 4,
        "lon": 3,
        "timezone": "string",
        "locale": "string",
        "modified": "string",
        "enterpriseProxyId": 3,
        "enterpriseProxyName": "string"
      },
      {
        "id": 5,
        "created": "string",
        "networkId": 9,
        "gatewayPoolId": 1,
        "alertsEnabled": 1,
        "operatorAlertsEnabled": 0,
        "endpointPkiMode": "CERTIFICATE_OPTIONAL",
        "name": "string",
        "domain": "string",
        "prefix": "string",
        "logicalId": "string",
        "accountNumber": "string",
        "description": "string",
        "contactName": "string",
        "contactPhone": "string",
        "contactMobile": "string",
        "contactEmail": "string",
        "streetAddress": "string",
        "streetAddress2": "string",
        "city": "string",
        "state": "string",
        "postalCode": "string",
        "country": "string",
        "lat": 5,
        "lon": 1,
        "timezone": "string",
        "locale": "string",
        "modified": "string",
        "enterpriseProxyId": 3,
        "enterpriseProxyName": "string"
      },
      {
        "id": 9,
        "created": "string",
        "networkId": 9,
        "gatewayPoolId": 2,
        "alertsEnabled": 1,
        "operatorAlertsEnabled": 1,
        "endpointPkiMode": "CERTIFICATE_DISABLED",
        "name": "string",
        "domain": "string",
        "prefix": "string",
        "logicalId": "string",
        "accountNumber": "string",
        "description": "string",
        "contactName": "string",
        "contactPhone": "string",
        "contactMobile": "string",
        "contactEmail": "string",
        "streetAddress": "string",
        "streetAddress2": "string",
        "city": "string",
        "state": "string",
        "postalCode": "string",
        "country": "string",
        "lat": 5,
        "lon": 3,
        "timezone": "string",
        "locale": "string",
        "modified": "string",
        "enterpriseProxyId": 3,
        "enterpriseProxyName": "string"
      },
      {
        "id": 7,
        "created": "string",
        "networkId": 3,
        "gatewayPoolId": 8,
        "alertsEnabled": 0,
        "operatorAlertsEnabled": 1,
        "endpointPkiMode": "CERTIFICATE_OPTIONAL",
        "name": "string",
        "domain": "string",
        "prefix": "string",
        "logicalId": "string",
        "accountNumber": "string",
        "description": "string",
        "contactName": "string",
        "contactPhone": "string",
        "contactMobile": "string",
        "contactEmail": "string",
        "streetAddress": "string",
        "streetAddress2": "string",
        "city": "string",
        "state": "string",
        "postalCode": "string",
        "country": "string",
        "lat": 5,
        "lon": 2,
        "timezone": "string",
        "locale": "string",
        "modified": "string",
        "enterpriseProxyId": 2,
        "enterpriseProxyName": "string"
      },
      {
        "id": 4,
        "created": "string",
        "networkId": 7,
        "gatewayPoolId": 4,
        "alertsEnabled": 1,
        "operatorAlertsEnabled": 0,
        "endpointPkiMode": "CERTIFICATE_REQUIRED",
        "name": "string",
        "domain": "string",
        "prefix": "string",
        "logicalId": "string",
        "accountNumber": "string",
        "description": "string",
        "contactName": "string",
        "contactPhone": "string",
        "contactMobile": "string",
        "contactEmail": "string",
        "streetAddress": "string",
        "streetAddress2": "string",
        "city": "string",
        "state": "string",
        "postalCode": "string",
        "country": "string",
        "lat": 2,
        "lon": 2,
        "timezone": "string",
        "locale": "string",
        "modified": "string",
        "enterpriseProxyId": 8,
        "enterpriseProxyName": "string"
      },
      {
        "id": 6,
        "created": "string",
        "networkId": 1,
        "gatewayPoolId": 10,
        "alertsEnabled": 0,
        "operatorAlertsEnabled": 0,
        "endpointPkiMode": "CERTIFICATE_OPTIONAL",
        "name": "string",
        "domain": "string",
        "prefix": "string",
        "logicalId": "string",
        "accountNumber": "string",
        "description": "string",
        "contactName": "string",
        "contactPhone": "string",
        "contactMobile": "string",
        "contactEmail": "string",
        "streetAddress": "string",
        "streetAddress2": "string",
        "city": "string",
        "state": "string",
        "postalCode": "string",
        "country": "string",
        "lat": 9,
        "lon": 3,
        "timezone": "string",
        "locale": "string",
        "modified": "string",
        "enterpriseProxyId": 1,
        "enterpriseProxyName": "string"
      }
    ]
  }
]