{
  "emailEnabled": true,
  "emailList": [
    "string",
    "string"
  ],
  "enterpriseUsers": [
    {
      "email": "string",
      "emailEnabled": 3,
      "enabled": 1,
      "enterpriseUserId": 1,
      "mobileEnabled": 5,
      "mobilePhone": "string",
      "smsEnabled": 1,
      "username": "string"
    },
    {
      "email": "string",
      "emailEnabled": 7,
      "enabled": 3,
      "enterpriseUserId": 5,
      "mobileEnabled": 2,
      "mobilePhone": "string",
      "smsEnabled": 10,
      "username": "string"
    },
    {
      "email": "string",
      "emailEnabled": 5,
      "enabled": 3,
      "enterpriseUserId": 10,
      "mobileEnabled": 9,
      "mobilePhone": "string",
      "smsEnabled": 3,
      "username": "string"
    }
  ],
  "mobileEnabled": false,
  "mobileList": [
    "string",
    "string",
    "string",
    "string",
    "string",
    "string",
    "string",
    "string",
    "string",
    "string"
  ],
  "smsEnabled": false,
  "smsList": [
    "string",
    "string",
    "string",
    "string",
    "string"
  ],
  "snmpEnabled": true,
  "snmpList": [
    "string",
    "string",
    "string",
    "string",
    "string",
    "string",
    "string",
    "string",
    "string",
    "string"
  ]
}