[
  {
    "edgeName": "string",
    "edgeId": 3,
    "edgeLogicalId": "string",
    "neighbors": [
      {
        "neighborIp": "string",
        "neighborAS": 4,
        "records": [
          {
            "timestamp": "string",
            "state": "CONNECT",
            "msgRcvd": 3,
            "pfxRcvd": 6,
            "msgSent": 8,
            "upDownTime": 4
          },
          {
            "timestamp": "string",
            "state": "IDLE",
            "msgRcvd": 3,
            "pfxRcvd": 3,
            "msgSent": 3,
            "upDownTime": 7
          },
          {
            "timestamp": "string",
            "state": "IDLEADMIN",
            "msgRcvd": 7,
            "pfxRcvd": 6,
            "msgSent": 6,
            "upDownTime": 10
          },
          {
            "timestamp": "string",
            "state": "CLEARING",
            "msgRcvd": 2,
            "pfxRcvd": 9,
            "msgSent": 9,
            "upDownTime": 1
          },
          {
            "timestamp": "string",
            "state": "IDLEADMIN",
            "msgRcvd": 2,
            "pfxRcvd": 6,
            "msgSent": 1,
            "upDownTime": 10
          },
          {
            "timestamp": "string",
            "state": "ESTABLISHED",
            "msgRcvd": 5,
            "pfxRcvd": 9,
            "msgSent": 6,
            "upDownTime": 6
          },
          {
            "timestamp": "string",
            "state": "IDLEADMIN",
            "msgRcvd": 3,
            "pfxRcvd": 6,
            "msgSent": 2,
            "upDownTime": 7
          },
          {
            "timestamp": "string",
            "state": "OPENCONFIRM",
            "msgRcvd": 7,
            "pfxRcvd": 8,
            "msgSent": 2,
            "upDownTime": 6
          }
        ]
      },
      {
        "neighborIp": "string",
        "neighborAS": 8,
        "records": [
          {
            "timestamp": "string",
            "state": "OPENCONFIRM",
            "msgRcvd": 1,
            "pfxRcvd": 2,
            "msgSent": 3,
            "upDownTime": 8
          },
          {
            "timestamp": "string",
            "state": "IDLEPRFXCT",
            "msgRcvd": 8,
            "pfxRcvd": 8,
            "msgSent": 8,
            "upDownTime": 9
          },
          {
            "timestamp": "string",
            "state": "OPENCONFIRM",
            "msgRcvd": 3,
            "pfxRcvd": 5,
            "msgSent": 4,
            "upDownTime": 9
          },
          {
            "timestamp": "string",
            "state": "ACTIVE",
            "msgRcvd": 9,
            "pfxRcvd": 6,
            "msgSent": 9,
            "upDownTime": 8
          },
          {
            "timestamp": "string",
            "state": "OPENSENT",
            "msgRcvd": 7,
            "pfxRcvd": 4,
            "msgSent": 3,
            "upDownTime": 1
          },
          {
            "timestamp": "string",
            "state": "OPENSENT",
            "msgRcvd": 2,
            "pfxRcvd": 6,
            "msgSent": 4,
            "upDownTime": 9
          },
          {
            "timestamp": "string",
            "state": "CONNECT",
            "msgRcvd": 10,
            "pfxRcvd": 5,
            "msgSent": 5,
            "upDownTime": 2
          },
          {
            "timestamp": "string",
            "state": "CONNECT",
            "msgRcvd": 6,
            "pfxRcvd": 10,
            "msgSent": 6,
            "upDownTime": 8
          },
          {
            "timestamp": "string",
            "state": "IDLE",
            "msgRcvd": 4,
            "pfxRcvd": 9,
            "msgSent": 6,
            "upDownTime": 7
          }
        ]
      }
    ]
  },
  {
    "edgeName": "string",
    "edgeId": 10,
    "edgeLogicalId": "string",
    "neighbors": [
      {
        "neighborIp": "string",
        "neighborAS": 9,
        "records": [
          {
            "timestamp": "string",
            "state": "IDLE",
            "msgRcvd": 1,
            "pfxRcvd": 8,
            "msgSent": 10,
            "upDownTime": 10
          }
        ]
      },
      {
        "neighborIp": "string",
        "neighborAS": 10,
        "records": [
          {
            "timestamp": "string",
            "state": "IDLEADMIN",
            "msgRcvd": 1,
            "pfxRcvd": 9,
            "msgSent": 9,
            "upDownTime": 5
          },
          {
            "timestamp": "string",
            "state": "OPENCONFIRM",
            "msgRcvd": 8,
            "pfxRcvd": 9,
            "msgSent": 5,
            "upDownTime": 7
          },
          {
            "timestamp": "string",
            "state": "ACTIVE",
            "msgRcvd": 7,
            "pfxRcvd": 10,
            "msgSent": 9,
            "upDownTime": 9
          },
          {
            "timestamp": "string",
            "state": "IDLEADMIN",
            "msgRcvd": 3,
            "pfxRcvd": 4,
            "msgSent": 8,
            "upDownTime": 7
          },
          {
            "timestamp": "string",
            "state": "IDLEPRFXCT",
            "msgRcvd": 10,
            "pfxRcvd": 4,
            "msgSent": 4,
            "upDownTime": 5
          },
          {
            "timestamp": "string",
            "state": "IDLEPRFXCT",
            "msgRcvd": 10,
            "pfxRcvd": 6,
            "msgSent": 9,
            "upDownTime": 3
          }
        ]
      },
      {
        "neighborIp": "string",
        "neighborAS": 10,
        "records": [
          {
            "timestamp": "string",
            "state": "IDLEADMIN",
            "msgRcvd": 7,
            "pfxRcvd": 5,
            "msgSent": 2,
            "upDownTime": 4
          },
          {
            "timestamp": "string",
            "state": "ESTABLISHED",
            "msgRcvd": 1,
            "pfxRcvd": 5,
            "msgSent": 10,
            "upDownTime": 3
          },
          {
            "timestamp": "string",
            "state": "IDLEADMIN",
            "msgRcvd": 5,
            "pfxRcvd": 8,
            "msgSent": 7,
            "upDownTime": 10
          }
        ]
      },
      {
        "neighborIp": "string",
        "neighborAS": 7,
        "records": [
          {
            "timestamp": "string",
            "state": "IDLEADMIN",
            "msgRcvd": 2,
            "pfxRcvd": 4,
            "msgSent": 6,
            "upDownTime": 4
          },
          {
            "timestamp": "string",
            "state": "IDLE",
            "msgRcvd": 3,
            "pfxRcvd": 5,
            "msgSent": 2,
            "upDownTime": 9
          },
          {
            "timestamp": "string",
            "state": "ACTIVE",
            "msgRcvd": 7,
            "pfxRcvd": 4,
            "msgSent": 10,
            "upDownTime": 6
          }
        ]
      }
    ]
  },
  {
    "edgeName": "string",
    "edgeId": 2,
    "edgeLogicalId": "string",
    "neighbors": [
      {
        "neighborIp": "string",
        "neighborAS": 10,
        "records": [
          {
            "timestamp": "string",
            "state": "ACTIVE",
            "msgRcvd": 1,
            "pfxRcvd": 7,
            "msgSent": 8,
            "upDownTime": 4
          },
          {
            "timestamp": "string",
            "state": "IDLEPRFXCT",
            "msgRcvd": 10,
            "pfxRcvd": 5,
            "msgSent": 6,
            "upDownTime": 4
          }
        ]
      },
      {
        "neighborIp": "string",
        "neighborAS": 3,
        "records": [
          {
            "timestamp": "string",
            "state": "ESTABLISHED",
            "msgRcvd": 3,
            "pfxRcvd": 9,
            "msgSent": 6,
            "upDownTime": 6
          },
          {
            "timestamp": "string",
            "state": "IDLEADMIN",
            "msgRcvd": 10,
            "pfxRcvd": 6,
            "msgSent": 10,
            "upDownTime": 4
          },
          {
            "timestamp": "string",
            "state": "IDLEADMIN",
            "msgRcvd": 3,
            "pfxRcvd": 6,
            "msgSent": 10,
            "upDownTime": 7
          }
        ]
      },
      {
        "neighborIp": "string",
        "neighborAS": 7,
        "records": [
          {
            "timestamp": "string",
            "state": "CONNECT",
            "msgRcvd": 4,
            "pfxRcvd": 8,
            "msgSent": 4,
            "upDownTime": 4
          },
          {
            "timestamp": "string",
            "state": "IDLEPRFXCT",
            "msgRcvd": 10,
            "pfxRcvd": 2,
            "msgSent": 5,
            "upDownTime": 6
          },
          {
            "timestamp": "string",
            "state": "IDLE",
            "msgRcvd": 7,
            "pfxRcvd": 9,
            "msgSent": 2,
            "upDownTime": 10
          },
          {
            "timestamp": "string",
            "state": "IDLE",
            "msgRcvd": 2,
            "pfxRcvd": 9,
            "msgSent": 3,
            "upDownTime": 2
          },
          {
            "timestamp": "string",
            "state": "IDLEADMIN",
            "msgRcvd": 10,
            "pfxRcvd": 7,
            "msgSent": 1,
            "upDownTime": 4
          },
          {
            "timestamp": "string",
            "state": "OPENCONFIRM",
            "msgRcvd": 7,
            "pfxRcvd": 6,
            "msgSent": 4,
            "upDownTime": 3
          },
          {
            "timestamp": "string",
            "state": "IDLEPRFXCT",
            "msgRcvd": 7,
            "pfxRcvd": 6,
            "msgSent": 9,
            "upDownTime": 8
          }
        ]
      },
      {
        "neighborIp": "string",
        "neighborAS": 6,
        "records": [
          {
            "timestamp": "string",
            "state": "OPENCONFIRM",
            "msgRcvd": 3,
            "pfxRcvd": 4,
            "msgSent": 3,
            "upDownTime": 7
          },
          {
            "timestamp": "string",
            "state": "IDLEPRFXCT",
            "msgRcvd": 3,
            "pfxRcvd": 10,
            "msgSent": 4,
            "upDownTime": 10
          },
          {
            "timestamp": "string",
            "state": "OPENCONFIRM",
            "msgRcvd": 6,
            "pfxRcvd": 8,
            "msgSent": 7,
            "upDownTime": 10
          },
          {
            "timestamp": "string",
            "state": "CLEARING",
            "msgRcvd": 4,
            "pfxRcvd": 1,
            "msgSent": 4,
            "upDownTime": 10
          },
          {
            "timestamp": "string",
            "state": "CLEARING",
            "msgRcvd": 10,
            "pfxRcvd": 8,
            "msgSent": 9,
            "upDownTime": 5
          },
          {
            "timestamp": "string",
            "state": "OPENSENT",
            "msgRcvd": 7,
            "pfxRcvd": 10,
            "msgSent": 8,
            "upDownTime": 9
          },
          {
            "timestamp": "string",
            "state": "ACTIVE",
            "msgRcvd": 6,
            "pfxRcvd": 6,
            "msgSent": 9,
            "upDownTime": 2
          },
          {
            "timestamp": "string",
            "state": "CLEARING",
            "msgRcvd": 2,
            "pfxRcvd": 8,
            "msgSent": 10,
            "upDownTime": 2
          },
          {
            "timestamp": "string",
            "state": "IDLEPRFXCT",
            "msgRcvd": 8,
            "pfxRcvd": 3,
            "msgSent": 2,
            "upDownTime": 10
          },
          {
            "timestamp": "string",
            "state": "IDLE",
            "msgRcvd": 8,
            "pfxRcvd": 10,
            "msgSent": 7,
            "upDownTime": 3
          }
        ]
      },
      {
        "neighborIp": "string",
        "neighborAS": 9,
        "records": [
          {
            "timestamp": "string",
            "state": "OPENCONFIRM",
            "msgRcvd": 2,
            "pfxRcvd": 7,
            "msgSent": 9,
            "upDownTime": 10
          },
          {
            "timestamp": "string",
            "state": "CONNECT",
            "msgRcvd": 8,
            "pfxRcvd": 10,
            "msgSent": 1,
            "upDownTime": 6
          },
          {
            "timestamp": "string",
            "state": "IDLEPRFXCT",
            "msgRcvd": 7,
            "pfxRcvd": 7,
            "msgSent": 7,
            "upDownTime": 10
          },
          {
            "timestamp": "string",
            "state": "IDLEADMIN",
            "msgRcvd": 8,
            "pfxRcvd": 8,
            "msgSent": 10,
            "upDownTime": 7
          },
          {
            "timestamp": "string",
            "state": "ACTIVE",
            "msgRcvd": 5,
            "pfxRcvd": 3,
            "msgSent": 3,
            "upDownTime": 10
          },
          {
            "timestamp": "string",
            "state": "CONNECT",
            "msgRcvd": 7,
            "pfxRcvd": 9,
            "msgSent": 4,
            "upDownTime": 2
          },
          {
            "timestamp": "string",
            "state": "OPENCONFIRM",
            "msgRcvd": 1,
            "pfxRcvd": 10,
            "msgSent": 10,
            "upDownTime": 10
          },
          {
            "timestamp": "string",
            "state": "ESTABLISHED",
            "msgRcvd": 3,
            "pfxRcvd": 3,
            "msgSent": 8,
            "upDownTime": 2
          }
        ]
      },
      {
        "neighborIp": "string",
        "neighborAS": 10,
        "records": [
          {
            "timestamp": "string",
            "state": "OPENSENT",
            "msgRcvd": 9,
            "pfxRcvd": 1,
            "msgSent": 9,
            "upDownTime": 1
          },
          {
            "timestamp": "string",
            "state": "OPENSENT",
            "msgRcvd": 4,
            "pfxRcvd": 2,
            "msgSent": 9,
            "upDownTime": 5
          },
          {
            "timestamp": "string",
            "state": "IDLEPRFXCT",
            "msgRcvd": 5,
            "pfxRcvd": 5,
            "msgSent": 8,
            "upDownTime": 4
          },
          {
            "timestamp": "string",
            "state": "CLEARING",
            "msgRcvd": 2,
            "pfxRcvd": 5,
            "msgSent": 8,
            "upDownTime": 4
          },
          {
            "timestamp": "string",
            "state": "CLEARING",
            "msgRcvd": 1,
            "pfxRcvd": 10,
            "msgSent": 4,
            "upDownTime": 8
          }
        ]
      }
    ]
  }
]