[
  {
    "series": [
      {
        "data": [
          5,
          7,
          3,
          8,
          9,
          9,
          7
        ],
        "max": 10,
        "metric": "totalPackets",
        "min": 1,
        "startTime": "string",
        "tickInterval": 10,
        "total": 8
      },
      {
        "data": [
          3,
          2
        ],
        "max": 4,
        "metric": "bytesTx",
        "min": 4,
        "startTime": "string",
        "tickInterval": 7,
        "total": 4
      },
      {
        "data": [
          5,
          8,
          5,
          4,
          9,
          3
        ],
        "max": 9,
        "metric": "totalBytes",
        "min": 10,
        "startTime": "string",
        "tickInterval": 8,
        "total": 5
      },
      {
        "data": [
          7
        ],
        "max": 7,
        "metric": "packetsTx",
        "min": 4,
        "startTime": "string",
        "tickInterval": 2,
        "total": 1
      },
      {
        "data": [
          7,
          10,
          10,
          7,
          2
        ],
        "max": 5,
        "metric": "bytesTx",
        "min": 3,
        "startTime": "string",
        "tickInterval": 2,
        "total": 1
      },
      {
        "data": [
          3
        ],
        "max": 6,
        "metric": "bytesRx",
        "min": 10,
        "startTime": "string",
        "tickInterval": 8,
        "total": 9
      },
      {
        "data": [
          1,
          3,
          5,
          1
        ],
        "max": 1,
        "metric": "bytesTx",
        "min": 8,
        "startTime": "string",
        "tickInterval": 10,
        "total": 2
      },
      {
        "data": [
          8,
          1,
          5,
          9,
          5,
          3,
          7,
          8,
          1
        ],
        "max": 10,
        "metric": "bytesTx",
        "min": 3,
        "startTime": "string",
        "tickInterval": 8,
        "total": 1
      },
      {
        "data": [
          4,
          2,
          7,
          7,
          1,
          8,
          2,
          6,
          1,
          4
        ],
        "max": 8,
        "metric": "bytesTx",
        "min": 4,
        "startTime": "string",
        "tickInterval": 1,
        "total": 4
      }
    ],
    "name": 7
  },
  {
    "series": [
      {
        "data": [
          9,
          9,
          10,
          6,
          9,
          2,
          8,
          4
        ],
        "max": 4,
        "metric": "bytesTx",
        "min": 9,
        "startTime": "string",
        "tickInterval": 5,
        "total": 4
      },
      {
        "data": [
          4,
          6
        ],
        "max": 3,
        "metric": "totalPackets",
        "min": 9,
        "startTime": "string",
        "tickInterval": 9,
        "total": 8
      },
      {
        "data": [
          5,
          9
        ],
        "max": 1,
        "metric": "totalPackets",
        "min": 5,
        "startTime": "string",
        "tickInterval": 3,
        "total": 8
      },
      {
        "data": [
          9,
          10
        ],
        "max": 3,
        "metric": "totalPackets",
        "min": 1,
        "startTime": "string",
        "tickInterval": 3,
        "total": 7
      },
      {
        "data": [
          5,
          7,
          6,
          5,
          8,
          1,
          5,
          9
        ],
        "max": 6,
        "metric": "packetsTx",
        "min": 7,
        "startTime": "string",
        "tickInterval": 10,
        "total": 8
      },
      {
        "data": [
          8,
          7,
          7,
          5
        ],
        "max": 3,
        "metric": "packetsRx",
        "min": 5,
        "startTime": "string",
        "tickInterval": 2,
        "total": 3
      }
    ],
    "name": 2
  },
  {
    "series": [
      {
        "data": [
          9,
          3,
          1,
          2,
          6,
          2,
          2,
          9
        ],
        "max": 5,
        "metric": "packetsTx",
        "min": 6,
        "startTime": "string",
        "tickInterval": 1,
        "total": 8
      },
      {
        "data": [
          3,
          8,
          3,
          3
        ],
        "max": 3,
        "metric": "totalBytes",
        "min": 4,
        "startTime": "string",
        "tickInterval": 10,
        "total": 5
      }
    ],
    "name": 5
  },
  {
    "series": [
      {
        "data": [
          9,
          2
        ],
        "max": 6,
        "metric": "packetsRx",
        "min": 7,
        "startTime": "string",
        "tickInterval": 1,
        "total": 9
      },
      {
        "data": [
          4,
          4,
          8,
          9,
          3,
          10,
          2,
          2,
          9,
          7
        ],
        "max": 2,
        "metric": "bytesTx",
        "min": 10,
        "startTime": "string",
        "tickInterval": 10,
        "total": 1
      },
      {
        "data": [
          6,
          7
        ],
        "max": 9,
        "metric": "packetsTx",
        "min": 9,
        "startTime": "string",
        "tickInterval": 5,
        "total": 6
      },
      {
        "data": [
          7,
          4,
          5,
          6
        ],
        "max": 6,
        "metric": "totalPackets",
        "min": 5,
        "startTime": "string",
        "tickInterval": 4,
        "total": 10
      },
      {
        "data": [
          6,
          4,
          3
        ],
        "max": 8,
        "metric": "totalPackets",
        "min": 2,
        "startTime": "string",
        "tickInterval": 9,
        "total": 4
      },
      {
        "data": [
          3,
          5,
          9,
          6,
          7,
          1
        ],
        "max": 1,
        "metric": "bytesTx",
        "min": 5,
        "startTime": "string",
        "tickInterval": 6,
        "total": 8
      },
      {
        "data": [
          10,
          6,
          4,
          3
        ],
        "max": 8,
        "metric": "bytesRx",
        "min": 6,
        "startTime": "string",
        "tickInterval": 10,
        "total": 3
      },
      {
        "data": [
          1,
          10,
          10,
          10
        ],
        "max": 5,
        "metric": "packetsTx",
        "min": 7,
        "startTime": "string",
        "tickInterval": 7,
        "total": 8
      }
    ],
    "name": 7
  }
]