{
  "profiles": [
    {
      "configurationType": "SEGMENT_BASED",
      "created": "string",
      "description": "string",
      "edgeCount": 6,
      "effective": "string",
      "id": 8,
      "logicalId": "string",
      "modified": "string",
      "modules": [
        {
          "created": "string",
          "effective": "string",
          "id": 4,
          "isSmallData": 0,
          "modified": "string",
          "name": "WAN",
          "type": "GATEWAY",
          "description": "string",
          "configurationId": 2,
          "data": {},
          "refs": {},
          "schemaVersion": "string"
        }
      ],
      "name": "string",
      "schemaVersion": "string",
      "version": "string"
    },
    {
      "configurationType": "SEGMENT_BASED",
      "created": "string",
      "description": "string",
      "edgeCount": 10,
      "effective": "string",
      "id": 6,
      "logicalId": "string",
      "modified": "string",
      "modules": [
        {
          "created": "string",
          "effective": "string",
          "id": 5,
          "isSmallData": 0,
          "modified": "string",
          "name": "properties",
          "type": "OPERATOR",
          "description": "string",
          "configurationId": 4,
          "data": {},
          "refs": {},
          "schemaVersion": "string"
        },
        {
          "created": "string",
          "effective": "string",
          "id": 4,
          "isSmallData": 1,
          "modified": "string",
          "name": "firewall",
          "type": "OPERATOR",
          "description": "string",
          "configurationId": 9,
          "data": {},
          "refs": {},
          "schemaVersion": "string"
        }
      ],
      "name": "string",
      "schemaVersion": "string",
      "version": "string"
    },
    {
      "configurationType": "SEGMENT_BASED",
      "created": "string",
      "description": "string",
      "edgeCount": 5,
      "effective": "string",
      "id": 8,
      "logicalId": "string",
      "modified": "string",
      "modules": [
        {
          "created": "string",
          "effective": "string",
          "id": 6,
          "isSmallData": 0,
          "modified": "string",
          "name": "WAN",
          "type": "OPERATOR",
          "description": "string",
          "configurationId": 4,
          "data": {},
          "refs": {},
          "schemaVersion": "string"
        },
        {
          "created": "string",
          "effective": "string",
          "id": 2,
          "isSmallData": 0,
          "modified": "string",
          "name": "QOS",
          "type": "ENTERPRISE",
          "description": "string",
          "configurationId": 10,
          "data": {},
          "refs": {},
          "schemaVersion": "string"
        },
        {
          "created": "string",
          "effective": "string",
          "id": 2,
          "isSmallData": 1,
          "modified": "string",
          "name": "QOS",
          "type": "GATEWAY",
          "description": "string",
          "configurationId": 5,
          "data": {},
          "refs": {},
          "schemaVersion": "string"
        },
        {
          "created": "string",
          "effective": "string",
          "id": 2,
          "isSmallData": 0,
          "modified": "string",
          "name": "managementPlane",
          "type": "GATEWAY",
          "description": "string",
          "configurationId": 2,
          "data": {},
          "refs": {},
          "schemaVersion": "string"
        },
        {
          "created": "string",
          "effective": "string",
          "id": 4,
          "isSmallData": 0,
          "modified": "string",
          "name": "QOS",
          "type": "ENTERPRISE",
          "description": "string",
          "configurationId": 4,
          "data": {},
          "refs": {},
          "schemaVersion": "string"
        },
        {
          "created": "string",
          "effective": "string",
          "id": 2,
          "isSmallData": 0,
          "modified": "string",
          "name": "imageUpdate",
          "type": "OPERATOR",
          "description": "string",
          "configurationId": 7,
          "data": {},
          "refs": {},
          "schemaVersion": "string"
        },
        {
          "created": "string",
          "effective": "string",
          "id": 5,
          "isSmallData": 1,
          "modified": "string",
          "name": "WAN",
          "type": "OPERATOR",
          "description": "string",
          "configurationId": 8,
          "data": {},
          "refs": {},
          "schemaVersion": "string"
        },
        {
          "created": "string",
          "effective": "string",
          "id": 8,
          "isSmallData": 0,
          "modified": "string",
          "name": "QOS",
          "type": "GATEWAY",
          "description": "string",
          "configurationId": 1,
          "data": {},
          "refs": {},
          "schemaVersion": "string"
        }
      ],
      "name": "string",
      "schemaVersion": "string",
      "version": "string"
    },
    {
      "configurationType": "NETWORK_BASED",
      "created": "string",
      "description": "string",
      "edgeCount": 3,
      "effective": "string",
      "id": 5,
      "logicalId": "string",
      "modified": "string",
      "modules": [
        {
          "created": "string",
          "effective": "string",
          "id": 3,
          "isSmallData": 1,
          "modified": "string",
          "name": "deviceSettings",
          "type": "GATEWAY",
          "description": "string",
          "configurationId": 10,
          "data": {},
          "refs": {},
          "schemaVersion": "string"
        },
        {
          "created": "string",
          "effective": "string",
          "id": 8,
          "isSmallData": 0,
          "modified": "string",
          "name": "imageUpdate",
          "type": "ENTERPRISE",
          "description": "string",
          "configurationId": 7,
          "data": {},
          "refs": {},
          "schemaVersion": "string"
        },
        {
          "created": "string",
          "effective": "string",
          "id": 7,
          "isSmallData": 1,
          "modified": "string",
          "name": "managementPlane",
          "type": "OPERATOR",
          "description": "string",
          "configurationId": 1,
          "data": {},
          "refs": {},
          "schemaVersion": "string"
        },
        {
          "created": "string",
          "effective": "string",
          "id": 7,
          "isSmallData": 1,
          "modified": "string",
          "name": "metaData",
          "type": "GATEWAY",
          "description": "string",
          "configurationId": 5,
          "data": {},
          "refs": {},
          "schemaVersion": "string"
        },
        {
          "created": "string",
          "effective": "string",
          "id": 9,
          "isSmallData": 1,
          "modified": "string",
          "name": "deviceSettings",
          "type": "ENTERPRISE",
          "description": "string",
          "configurationId": 9,
          "data": {},
          "refs": {},
          "schemaVersion": "string"
        }
      ],
      "name": "string",
      "schemaVersion": "string",
      "version": "string"
    }
  ],
  "subnets": [
    {
      "eligableExits": [
        {
          "type": "string",
          "exitType": "string",
          "edgeId": 4,
          "edgeName": "string",
          "profileId": 6,
          "cidrIp": "string",
          "cost": 5,
          "advertise": false
        }
      ],
      "preferredExits": [
        {
          "type": "string",
          "exitType": "string",
          "edgeId": 2,
          "edgeName": "string",
          "profileId": 7,
          "cidrIp": "string",
          "cost": 6,
          "advertise": true
        },
        {
          "type": "string",
          "exitType": "string",
          "edgeId": 3,
          "edgeName": "string",
          "profileId": 8,
          "cidrIp": "string",
          "cost": 1,
          "advertise": false
        },
        {
          "type": "string",
          "exitType": "string",
          "edgeId": 2,
          "edgeName": "string",
          "profileId": 7,
          "cidrIp": "string",
          "cost": 2,
          "advertise": true
        },
        {
          "type": "string",
          "exitType": "string",
          "edgeId": 9,
          "edgeName": "string",
          "profileId": 5,
          "cidrIp": "string",
          "cost": 5,
          "advertise": true
        }
      ],
      "subnet": "string"
    },
    {
      "eligableExits": [
        {
          "type": "string",
          "exitType": "string",
          "edgeId": 2,
          "edgeName": "string",
          "profileId": 8,
          "cidrIp": "string",
          "cost": 3,
          "advertise": false
        },
        {
          "type": "string",
          "exitType": "string",
          "edgeId": 8,
          "edgeName": "string",
          "profileId": 9,
          "cidrIp": "string",
          "cost": 6,
          "advertise": true
        },
        {
          "type": "string",
          "exitType": "string",
          "edgeId": 9,
          "edgeName": "string",
          "profileId": 2,
          "cidrIp": "string",
          "cost": 7,
          "advertise": false
        },
        {
          "type": "string",
          "exitType": "string",
          "edgeId": 3,
          "edgeName": "string",
          "profileId": 5,
          "cidrIp": "string",
          "cost": 5,
          "advertise": false
        }
      ],
      "preferredExits": [
        {
          "type": "string",
          "exitType": "string",
          "edgeId": 9,
          "edgeName": "string",
          "profileId": 7,
          "cidrIp": "string",
          "cost": 3,
          "advertise": false
        },
        {
          "type": "string",
          "exitType": "string",
          "edgeId": 6,
          "edgeName": "string",
          "profileId": 1,
          "cidrIp": "string",
          "cost": 9,
          "advertise": false
        },
        {
          "type": "string",
          "exitType": "string",
          "edgeId": 5,
          "edgeName": "string",
          "profileId": 4,
          "cidrIp": "string",
          "cost": 2,
          "advertise": true
        },
        {
          "type": "string",
          "exitType": "string",
          "edgeId": 1,
          "edgeName": "string",
          "profileId": 8,
          "cidrIp": "string",
          "cost": 4,
          "advertise": true
        },
        {
          "type": "string",
          "exitType": "string",
          "edgeId": 2,
          "edgeName": "string",
          "profileId": 1,
          "cidrIp": "string",
          "cost": 7,
          "advertise": true
        }
      ],
      "subnet": "string"
    },
    {
      "eligableExits": [
        {
          "type": "string",
          "exitType": "string",
          "edgeId": 1,
          "edgeName": "string",
          "profileId": 6,
          "cidrIp": "string",
          "cost": 9,
          "advertise": false
        },
        {
          "type": "string",
          "exitType": "string",
          "edgeId": 8,
          "edgeName": "string",
          "profileId": 2,
          "cidrIp": "string",
          "cost": 4,
          "advertise": false
        },
        {
          "type": "string",
          "exitType": "string",
          "edgeId": 3,
          "edgeName": "string",
          "profileId": 7,
          "cidrIp": "string",
          "cost": 7,
          "advertise": false
        },
        {
          "type": "string",
          "exitType": "string",
          "edgeId": 2,
          "edgeName": "string",
          "profileId": 7,
          "cidrIp": "string",
          "cost": 2,
          "advertise": false
        },
        {
          "type": "string",
          "exitType": "string",
          "edgeId": 5,
          "edgeName": "string",
          "profileId": 8,
          "cidrIp": "string",
          "cost": 4,
          "advertise": false
        },
        {
          "type": "string",
          "exitType": "string",
          "edgeId": 2,
          "edgeName": "string",
          "profileId": 2,
          "cidrIp": "string",
          "cost": 2,
          "advertise": true
        },
        {
          "type": "string",
          "exitType": "string",
          "edgeId": 6,
          "edgeName": "string",
          "profileId": 4,
          "cidrIp": "string",
          "cost": 3,
          "advertise": false
        },
        {
          "type": "string",
          "exitType": "string",
          "edgeId": 10,
          "edgeName": "string",
          "profileId": 8,
          "cidrIp": "string",
          "cost": 9,
          "advertise": false
        }
      ],
      "preferredExits": [
        {
          "type": "string",
          "exitType": "string",
          "edgeId": 8,
          "edgeName": "string",
          "profileId": 10,
          "cidrIp": "string",
          "cost": 2,
          "advertise": false
        },
        {
          "type": "string",
          "exitType": "string",
          "edgeId": 10,
          "edgeName": "string",
          "profileId": 9,
          "cidrIp": "string",
          "cost": 10,
          "advertise": true
        },
        {
          "type": "string",
          "exitType": "string",
          "edgeId": 9,
          "edgeName": "string",
          "profileId": 8,
          "cidrIp": "string",
          "cost": 9,
          "advertise": false
        },
        {
          "type": "string",
          "exitType": "string",
          "edgeId": 8,
          "edgeName": "string",
          "profileId": 4,
          "cidrIp": "string",
          "cost": 2,
          "advertise": true
        },
        {
          "type": "string",
          "exitType": "string",
          "edgeId": 4,
          "edgeName": "string",
          "profileId": 2,
          "cidrIp": "string",
          "cost": 1,
          "advertise": true
        },
        {
          "type": "string",
          "exitType": "string",
          "edgeId": 8,
          "edgeName": "string",
          "profileId": 7,
          "cidrIp": "string",
          "cost": 9,
          "advertise": false
        },
        {
          "type": "string",
          "exitType": "string",
          "edgeId": 1,
          "edgeName": "string",
          "profileId": 3,
          "cidrIp": "string",
          "cost": 1,
          "advertise": true
        },
        {
          "type": "string",
          "exitType": "string",
          "edgeId": 4,
          "edgeName": "string",
          "profileId": 4,
          "cidrIp": "string",
          "cost": 3,
          "advertise": false
        },
        {
          "type": "string",
          "exitType": "string",
          "edgeId": 3,
          "edgeName": "string",
          "profileId": 8,
          "cidrIp": "string",
          "cost": 4,
          "advertise": true
        }
      ],
      "subnet": "string"
    }
  ],
  "exits": {
    "edges": [
      {
        "id": 1,
        "name": "string",
        "logicalId": "string",
        "type": "string"
      },
      {
        "id": 1,
        "name": "string",
        "logicalId": "string",
        "type": "string"
      },
      {
        "id": 2,
        "name": "string",
        "logicalId": "string",
        "type": "string"
      },
      {
        "id": 6,
        "name": "string",
        "logicalId": "string",
        "type": "string"
      },
      {
        "id": 9,
        "name": "string",
        "logicalId": "string",
        "type": "string"
      },
      {
        "id": 3,
        "name": "string",
        "logicalId": "string",
        "type": "string"
      }
    ],
    "hubs": [
      {
        "id": 5,
        "name": "string",
        "logicalId": "string",
        "type": "string"
      },
      {
        "id": 10,
        "name": "string",
        "logicalId": "string",
        "type": "string"
      },
      {
        "id": 3,
        "name": "string",
        "logicalId": "string",
        "type": "string"
      }
    ],
    "gateways": [
      {
        "id": 10,
        "name": "string",
        "logicalId": "string",
        "type": "string"
      },
      {
        "id": 8,
        "name": "string",
        "logicalId": "string",
        "type": "string"
      },
      {
        "id": 4,
        "name": "string",
        "logicalId": "string",
        "type": "string"
      },
      {
        "id": 9,
        "name": "string",
        "logicalId": "string",
        "type": "string"
      },
      {
        "id": 1,
        "name": "string",
        "logicalId": "string",
        "type": "string"
      }
    ],
    "nvs": [
      {
        "id": 8,
        "name": "string",
        "logicalId": "string",
        "type": "string"
      },
      {
        "id": 1,
        "name": "string",
        "logicalId": "string",
        "type": "string"
      },
      {
        "id": 1,
        "name": "string",
        "logicalId": "string",
        "type": "string"
      },
      {
        "id": 2,
        "name": "string",
        "logicalId": "string",
        "type": "string"
      }
    ]
  }
}