[
  {
    "id": 1,
    "created": "string",
    "operatorId": 7,
    "networkId": 7,
    "enterpriseId": 5,
    "edgeId": 9,
    "gatewayId": 3,
    "parentGroupId": 1,
    "description": "string",
    "object": "string",
    "name": "string",
    "type": "string",
    "logicalId": "string",
    "alertsEnabled": 1,
    "operatorAlertsEnabled": 0,
    "status": "string",
    "statusModified": "string",
    "previousData": {},
    "previousCreated": "string",
    "draftData": "string",
    "draftCreated": "string",
    "draftComment": "string",
    "data": {},
    "lastContact": "string",
    "version": "string",
    "modified": "string"
  },
  {
    "id": 5,
    "created": "string",
    "operatorId": 6,
    "networkId": 8,
    "enterpriseId": 10,
    "edgeId": 2,
    "gatewayId": 9,
    "parentGroupId": 2,
    "description": "string",
    "object": "string",
    "name": "string",
    "type": "string",
    "logicalId": "string",
    "alertsEnabled": 0,
    "operatorAlertsEnabled": 1,
    "status": "string",
    "statusModified": "string",
    "previousData": {},
    "previousCreated": "string",
    "draftData": "string",
    "draftCreated": "string",
    "draftComment": "string",
    "data": {},
    "lastContact": "string",
    "version": "string",
    "modified": "string"
  },
  {
    "id": 4,
    "created": "string",
    "operatorId": 4,
    "networkId": 9,
    "enterpriseId": 3,
    "edgeId": 8,
    "gatewayId": 5,
    "parentGroupId": 7,
    "description": "string",
    "object": "string",
    "name": "string",
    "type": "string",
    "logicalId": "string",
    "alertsEnabled": 0,
    "operatorAlertsEnabled": 1,
    "status": "string",
    "statusModified": "string",
    "previousData": {},
    "previousCreated": "string",
    "draftData": "string",
    "draftCreated": "string",
    "draftComment": "string",
    "data": {},
    "lastContact": "string",
    "version": "string",
    "modified": "string"
  },
  {
    "id": 1,
    "created": "string",
    "operatorId": 1,
    "networkId": 6,
    "enterpriseId": 6,
    "edgeId": 5,
    "gatewayId": 10,
    "parentGroupId": 8,
    "description": "string",
    "object": "string",
    "name": "string",
    "type": "string",
    "logicalId": "string",
    "alertsEnabled": 0,
    "operatorAlertsEnabled": 1,
    "status": "string",
    "statusModified": "string",
    "previousData": {},
    "previousCreated": "string",
    "draftData": "string",
    "draftCreated": "string",
    "draftComment": "string",
    "data": {},
    "lastContact": "string",
    "version": "string",
    "modified": "string"
  }
]