[
  {
    "configurationType": "SEGMENT_BASED",
    "created": "string",
    "description": "string",
    "edgeCount": 4,
    "effective": "string",
    "id": 9,
    "logicalId": "string",
    "modified": "string",
    "modules": [
      {
        "created": "string",
        "effective": "string",
        "id": 3,
        "isSmallData": 1,
        "modified": "string",
        "name": "imageUpdate",
        "type": "GATEWAY",
        "description": "string",
        "configurationId": 4,
        "data": {},
        "refs": {},
        "schemaVersion": "string"
      },
      {
        "created": "string",
        "effective": "string",
        "id": 3,
        "isSmallData": 1,
        "modified": "string",
        "name": "properties",
        "type": "ENTERPRISE",
        "description": "string",
        "configurationId": 4,
        "data": {},
        "refs": {},
        "schemaVersion": "string"
      },
      {
        "created": "string",
        "effective": "string",
        "id": 5,
        "isSmallData": 1,
        "modified": "string",
        "name": "QOS",
        "type": "GATEWAY",
        "description": "string",
        "configurationId": 3,
        "data": {},
        "refs": {},
        "schemaVersion": "string"
      },
      {
        "created": "string",
        "effective": "string",
        "id": 7,
        "isSmallData": 1,
        "modified": "string",
        "name": "properties",
        "type": "GATEWAY",
        "description": "string",
        "configurationId": 6,
        "data": {},
        "refs": {},
        "schemaVersion": "string"
      },
      {
        "created": "string",
        "effective": "string",
        "id": 1,
        "isSmallData": 1,
        "modified": "string",
        "name": "WAN",
        "type": "GATEWAY",
        "description": "string",
        "configurationId": 3,
        "data": {},
        "refs": {},
        "schemaVersion": "string"
      },
      {
        "created": "string",
        "effective": "string",
        "id": 4,
        "isSmallData": 0,
        "modified": "string",
        "name": "properties",
        "type": "OPERATOR",
        "description": "string",
        "configurationId": 1,
        "data": {},
        "refs": {},
        "schemaVersion": "string"
      }
    ],
    "name": "string",
    "schemaVersion": "string",
    "version": "string"
  }
]