[
  {
    "id": 4,
    "created": "string",
    "operatorId": 4,
    "networkId": 4,
    "enterpriseId": 2,
    "enterpriseProxyId": 6,
    "name": "string",
    "userType": "MSP",
    "fromUserType": "CUSTOM",
    "isSuper": 9,
    "description": "string",
    "precedence": 1,
    "modified": "string"
  },
  {
    "id": 2,
    "created": "string",
    "operatorId": 4,
    "networkId": 4,
    "enterpriseId": 9,
    "enterpriseProxyId": 7,
    "name": "string",
    "userType": "OPERATOR",
    "fromUserType": "ENTERPRISE",
    "isSuper": 3,
    "description": "string",
    "precedence": 3,
    "modified": "string"
  }
]