{
  "actions": [
    {
      "name": "switchPage",
      "protocol": "REST",
      "method": "GET",
      "entitypath": "{base_path}/{version}/switchdisco/switchpage?{query}",
      "requestSchema": "schema.json",
      "responseSchema": "schema.json",
      "timeout": 0,
      "sendEmpty": false,
      "sendGetBody": false,
      "requestDatatype": "JSON",
      "responseDatatype": "JSON",
      "headers": {},
      "responseObjects": [
        {
          "type": "default",
          "key": "",
          "mockFile": "mockdatafiles/switchPage-default.json"
        }
      ]
    },
    {
      "name": "vlanPage",
      "protocol": "REST",
      "method": "GET",
      "entitypath": "{base_path}/{version}/switchdisco/vlanpage?{query}",
      "requestSchema": "schema.json",
      "responseSchema": "schema.json",
      "timeout": 0,
      "sendEmpty": false,
      "sendGetBody": false,
      "requestDatatype": "JSON",
      "responseDatatype": "JSON",
      "headers": {},
      "responseObjects": [
        {
          "type": "default",
          "key": "",
          "mockFile": "mockdatafiles/vlanPage-default.json"
        }
      ]
    },
    {
      "name": "interfacePage",
      "protocol": "REST",
      "method": "GET",
      "entitypath": "{base_path}/{version}/switchdisco/interfacepage?{query}",
      "requestSchema": "schema.json",
      "responseSchema": "schema.json",
      "timeout": 0,
      "sendEmpty": false,
      "sendGetBody": false,
      "requestDatatype": "JSON",
      "responseDatatype": "JSON",
      "headers": {},
      "responseObjects": [
        {
          "type": "default",
          "key": "",
          "mockFile": "mockdatafiles/interfacePage-default.json"
        }
      ]
    },
    {
      "name": "elementPage",
      "protocol": "REST",
      "method": "GET",
      "entitypath": "{base_path}/{version}/switchdisco/elementpage?{query}",
      "requestSchema": "schema.json",
      "responseSchema": "schema.json",
      "timeout": 0,
      "sendEmpty": false,
      "sendGetBody": false,
      "requestDatatype": "JSON",
      "responseDatatype": "JSON",
      "headers": {},
      "responseObjects": [
        {
          "type": "default",
          "key": "",
          "mockFile": "mockdatafiles/elementPage-default.json"
        }
      ]
    },
    {
      "name": "getSwitch",
      "protocol": "REST",
      "method": "GET",
      "entitypath": "{base_path}/{version}/switchdisco/switchdetails?{query}",
      "requestSchema": "schema.json",
      "responseSchema": "schema.json",
      "timeout": 0,
      "sendEmpty": false,
      "sendGetBody": false,
      "requestDatatype": "JSON",
      "responseDatatype": "JSON",
      "headers": {},
      "responseObjects": [
        {
          "type": "default",
          "key": "",
          "mockFile": "mockdatafiles/getSwitch-default.json"
        }
      ]
    },
    {
      "name": "deleteSwitches",
      "protocol": "REST",
      "method": "POST",
      "entitypath": "{base_path}/{version}/switchdisco/deleteSwitches?{query}",
      "requestSchema": "schema.json",
      "responseSchema": "schema.json",
      "timeout": 0,
      "sendEmpty": false,
      "sendGetBody": false,
      "requestDatatype": "JSON",
      "responseDatatype": "JSON",
      "headers": {},
      "responseObjects": [
        {
          "type": "default",
          "key": "",
          "mockFile": ""
        }
      ]
    }
  ]
}