[
  {
    "id": 1,
    "dc_id": 1,
    "dc_ip": "10.0.0.3",
    "dc_name": "dc.tcpwave.com",
    "domain_name": "tcpwave.com",
    "service_type": "DNS",
    "principal_type": "string",
    "principal_name": "computer.tcpwave.com",
    "realm": "TCPWAVE.COM",
    "encryption_type": "RC4-HMAC-NT employs 128-bit encryption.",
    "updated_by_name": "2017",
    "updated_time": "3/18/2016 3:37",
    "created_by_name": "admin",
    "created_time": "3/18/2016 3:37",
    "file_data": "string",
    "file_name": "krb5.keytab",
    "dnsDomainName": "tcpwave.com",
    "dnsServerName": "ns.tcpwave.com",
    "dnsIp": "10.0.0.2",
    "dnsId": 1
  },
  {
    "id": 1,
    "dc_id": 1,
    "dc_ip": "10.0.0.3",
    "dc_name": "dc.tcpwave.com",
    "domain_name": "tcpwave.com",
    "service_type": "DNS",
    "principal_type": "string",
    "principal_name": "computer.tcpwave.com",
    "realm": "TCPWAVE.COM",
    "encryption_type": "RC4-HMAC-NT employs 128-bit encryption.",
    "updated_by_name": "2017",
    "updated_time": "3/18/2016 3:37",
    "created_by_name": "admin",
    "created_time": "3/18/2016 3:37",
    "file_data": "string",
    "file_name": "krb5.keytab",
    "dnsDomainName": "tcpwave.com",
    "dnsServerName": "ns.tcpwave.com",
    "dnsIp": "10.0.0.2",
    "dnsId": 1
  },
  {
    "id": 1,
    "dc_id": 1,
    "dc_ip": "10.0.0.3",
    "dc_name": "dc.tcpwave.com",
    "domain_name": "tcpwave.com",
    "service_type": "DNS",
    "principal_type": "string",
    "principal_name": "computer.tcpwave.com",
    "realm": "TCPWAVE.COM",
    "encryption_type": "RC4-HMAC-NT employs 128-bit encryption.",
    "updated_by_name": "2017",
    "updated_time": "3/18/2016 3:37",
    "created_by_name": "admin",
    "created_time": "3/18/2016 3:37",
    "file_data": "string",
    "file_name": "krb5.keytab",
    "dnsDomainName": "tcpwave.com",
    "dnsServerName": "ns.tcpwave.com",
    "dnsIp": "10.0.0.2",
    "dnsId": 1
  }
]