[
  {
    "id": 45,
    "name": "edu.com",
    "old_name": "accitrade.com",
    "description": "Domain for edu.com",
    "zone_id": 34,
    "updateSubDomain": true,
    "created_by": 2017,
    "created_by_name": "Stephen",
    "created_time": "3/18/2016 3:39",
    "updated_by": 2019,
    "updated_by_name": "John",
    "updated_time": "3/18/2016 4:37",
    "is_managed": "Yes",
    "contact_email": "Stephen.martin@gmail.com",
    "organization_id": 990,
    "organization_name": "EARTH",
    "restrictedDomain": "yes",
    "object_address": "10.0.0.20",
    "contact_phone": "1 (877) 609-2236",
    "updated_time_string": "3/18/2016 4:37",
    "created_time_string": "3/18/2016 3:39",
    "created_by_login_name": "Stephen",
    "updated_by_login_name": "John"
  },
  {
    "id": 45,
    "name": "edu.com",
    "old_name": "accitrade.com",
    "description": "Domain for edu.com",
    "zone_id": 34,
    "updateSubDomain": true,
    "created_by": 2017,
    "created_by_name": "Stephen",
    "created_time": "3/18/2016 3:39",
    "updated_by": 2019,
    "updated_by_name": "John",
    "updated_time": "3/18/2016 4:37",
    "is_managed": "Yes",
    "contact_email": "Stephen.martin@gmail.com",
    "organization_id": 990,
    "organization_name": "EARTH",
    "restrictedDomain": "yes",
    "object_address": "10.0.0.20",
    "contact_phone": "1 (877) 609-2236",
    "updated_time_string": "3/18/2016 4:37",
    "created_time_string": "3/18/2016 3:39",
    "created_by_login_name": "Stephen",
    "updated_by_login_name": "John"
  },
  {
    "id": 45,
    "name": "edu.com",
    "old_name": "accitrade.com",
    "description": "Domain for edu.com",
    "zone_id": 34,
    "updateSubDomain": true,
    "created_by": 2017,
    "created_by_name": "Stephen",
    "created_time": "3/18/2016 3:39",
    "updated_by": 2019,
    "updated_by_name": "John",
    "updated_time": "3/18/2016 4:37",
    "is_managed": "Yes",
    "contact_email": "Stephen.martin@gmail.com",
    "organization_id": 990,
    "organization_name": "EARTH",
    "restrictedDomain": "yes",
    "object_address": "10.0.0.20",
    "contact_phone": "1 (877) 609-2236",
    "updated_time_string": "3/18/2016 4:37",
    "created_time_string": "3/18/2016 3:39",
    "created_by_login_name": "Stephen",
    "updated_by_login_name": "John"
  }
]