{
  "ipAddress": "10.2.2.3",
  "sysDesc": "string",
  "sysUpTime": "2hrs",
  "sysContact": "John",
  "sysName": "Switch",
  "sysLocation": "TCPWave",
  "ifNumber": "001",
  "mac": "string",
  "cmdId": 23,
  "subnetIP": "string",
  "discoveredElements": 1,
  "startTime": "string",
  "endTime": "string",
  "discoveredBy": "sadm"
}