[
  {
    "id": 2,
    "type": "Network/Subnet/Object",
    "target": "10.0.0.0/24",
    "level": "Network/Subnet/Object/Domain/Subnet Group etc.",
    "created_by": 3,
    "created_by_user": "string",
    "created_time": "string",
    "created_time_string": "string",
    "target_address": "string",
    "target_name": "[\"10.1.0.0/16\"]",
    "target_description": "string",
    "admin_admin_groups": "group1,group2,group3",
    "subnet_within_sgroup": "10.0.0.0/24,10.0.1.0/24",
    "privilege": "READ/READ-WRITE",
    "privilegeCode": "4 = READ; 6 = READ-WRITE",
    "admin_name": "string",
    "admin_role": "Functional Admin"
  },
  {
    "id": 6,
    "type": "Network/Subnet/Object",
    "target": "10.0.0.0/24",
    "level": "Network/Subnet/Object/Domain/Subnet Group etc.",
    "created_by": 1,
    "created_by_user": "string",
    "created_time": "string",
    "created_time_string": "string",
    "target_address": "string",
    "target_name": "[\"10.1.0.0/16\"]",
    "target_description": "string",
    "admin_admin_groups": "group1,group2,group3",
    "subnet_within_sgroup": "10.0.0.0/24,10.0.1.0/24",
    "privilege": "READ/READ-WRITE",
    "privilegeCode": "4 = READ; 6 = READ-WRITE",
    "admin_name": "string",
    "admin_role": "Functional Admin"
  }
]