{
  "recordsTotal": 40,
  "recordsFiltered": 40,
  "data": [
    {
      "index": "2",
      "switchIP": "10.2.3.4",
      "name": "string",
      "status": "Up",
      "portNames": "eth0,eth1",
      "type": "Data",
      "ifIndex": "1"
    },
    {
      "index": "2",
      "switchIP": "10.2.3.4",
      "name": "string",
      "status": "Up",
      "portNames": "eth0,eth1",
      "type": "Data",
      "ifIndex": "1"
    },
    {
      "index": "2",
      "switchIP": "10.2.3.4",
      "name": "string",
      "status": "Up",
      "portNames": "eth0,eth1",
      "type": "Data",
      "ifIndex": "1"
    },
    {
      "index": "2",
      "switchIP": "10.2.3.4",
      "name": "string",
      "status": "Up",
      "portNames": "eth0,eth1",
      "type": "Data",
      "ifIndex": "1"
    },
    {
      "index": "2",
      "switchIP": "10.2.3.4",
      "name": "string",
      "status": "Up",
      "portNames": "eth0,eth1",
      "type": "Data",
      "ifIndex": "1"
    },
    {
      "index": "2",
      "switchIP": "10.2.3.4",
      "name": "string",
      "status": "Up",
      "portNames": "eth0,eth1",
      "type": "Data",
      "ifIndex": "1"
    }
  ]
}