{
  "actions": [
    {
      "name": "getClogConfig",
      "protocol": "REST",
      "method": "GET",
      "entitypath": "{base_path}/{version}/centralLogging/centralLoggingConfig?{query}",
      "requestSchema": "schema.json",
      "responseSchema": "schema.json",
      "timeout": 0,
      "sendEmpty": false,
      "sendGetBody": false,
      "requestDatatype": "JSON",
      "responseDatatype": "JSON",
      "headers": {},
      "responseObjects": [
        {
          "type": "default",
          "key": "",
          "mockFile": "mockdatafiles/getClogConfig-default.json"
        }
      ]
    },
    {
      "name": "getClogFullConfig",
      "protocol": "REST",
      "method": "GET",
      "entitypath": "{base_path}/{version}/centralLogging/centralLoggingFullConfig?{query}",
      "requestSchema": "schema.json",
      "responseSchema": "schema.json",
      "timeout": 0,
      "sendEmpty": false,
      "sendGetBody": false,
      "requestDatatype": "JSON",
      "responseDatatype": "JSON",
      "headers": {},
      "responseObjects": [
        {
          "type": "default",
          "key": "",
          "mockFile": "mockdatafiles/getClogFullConfig-default.json"
        }
      ]
    },
    {
      "name": "getClogServerLogConfig",
      "protocol": "REST",
      "method": "GET",
      "entitypath": "{base_path}/{version}/centralLogging/centralLoggingServerLogConfig?{query}",
      "requestSchema": "schema.json",
      "responseSchema": "schema.json",
      "timeout": 0,
      "sendEmpty": false,
      "sendGetBody": false,
      "requestDatatype": "JSON",
      "responseDatatype": "JSON",
      "headers": {},
      "responseObjects": [
        {
          "type": "default",
          "key": "",
          "mockFile": "mockdatafiles/getClogServerLogConfig-default.json"
        }
      ]
    },
    {
      "name": "fullConfigupdate",
      "protocol": "REST",
      "method": "POST",
      "entitypath": "{base_path}/{version}/centralLogging/fullConfigUpdate?{query}",
      "requestSchema": "schema.json",
      "responseSchema": "schema.json",
      "timeout": 0,
      "sendEmpty": false,
      "sendGetBody": false,
      "requestDatatype": "JSON",
      "responseDatatype": "JSON",
      "headers": {},
      "responseObjects": [
        {
          "type": "default",
          "key": "",
          "mockFile": ""
        }
      ]
    },
    {
      "name": "changeServerClogSetting",
      "protocol": "REST",
      "method": "GET",
      "entitypath": "{base_path}/{version}/centralLogging/serverCentralLoggingSetting?{query}",
      "requestSchema": "schema.json",
      "responseSchema": "schema.json",
      "timeout": 0,
      "sendEmpty": false,
      "sendGetBody": false,
      "requestDatatype": "JSON",
      "responseDatatype": "JSON",
      "headers": {},
      "responseObjects": [
        {
          "type": "default",
          "key": "",
          "mockFile": ""
        }
      ]
    }
  ]
}