[
  {
    "count": 1,
    "organization_id": 134,
    "network_id": 156,
    "fullAddress": "10.1.10.135",
    "primary_dhcp_server": "10.1.56.24",
    "organization_name": "Internal",
    "address": "10.1.10.45",
    "email_id": "admin@tcpwave.com"
  }
]