[
  {
    "id": 3,
    "name": "string",
    "oldName": "string",
    "cname": "string",
    "selectedMode": "string",
    "currentMode": "string",
    "description": "string",
    "lastChecked": "string",
    "lastCheckedString": "string",
    "lastUpdateStatus": "string",
    "createdBy": 8,
    "createdByName": "string",
    "createdTime": "string",
    "createdTimeString": "string",
    "updatedBy": 9,
    "updatedByName": "string",
    "updatedTime": "string",
    "updatedTimeString": "string",
    "targets": [
      {
        "id": 7,
        "serviceName": "string",
        "serviceId": 8,
        "serviceMode": "string",
        "target": "string",
        "createdBy": 5,
        "createdByName": "string",
        "createdTime": "string",
        "createdTimeString": "string",
        "updatedBy": 3,
        "updatedByName": "string",
        "updatedTime": "string",
        "updatedTimeString": "string"
      },
      {
        "id": 2,
        "serviceName": "string",
        "serviceId": 10,
        "serviceMode": "string",
        "target": "string",
        "createdBy": 9,
        "createdByName": "string",
        "createdTime": "string",
        "createdTimeString": "string",
        "updatedBy": 3,
        "updatedByName": "string",
        "updatedTime": "string",
        "updatedTimeString": "string"
      },
      {
        "id": 5,
        "serviceName": "string",
        "serviceId": 7,
        "serviceMode": "string",
        "target": "string",
        "createdBy": 1,
        "createdByName": "string",
        "createdTime": "string",
        "createdTimeString": "string",
        "updatedBy": 3,
        "updatedByName": "string",
        "updatedTime": "string",
        "updatedTimeString": "string"
      },
      {
        "id": 6,
        "serviceName": "string",
        "serviceId": 8,
        "serviceMode": "string",
        "target": "string",
        "createdBy": 4,
        "createdByName": "string",
        "createdTime": "string",
        "createdTimeString": "string",
        "updatedBy": 4,
        "updatedByName": "string",
        "updatedTime": "string",
        "updatedTimeString": "string"
      },
      {
        "id": 7,
        "serviceName": "string",
        "serviceId": 7,
        "serviceMode": "string",
        "target": "string",
        "createdBy": 9,
        "createdByName": "string",
        "createdTime": "string",
        "createdTimeString": "string",
        "updatedBy": 6,
        "updatedByName": "string",
        "updatedTime": "string",
        "updatedTimeString": "string"
      },
      {
        "id": 8,
        "serviceName": "string",
        "serviceId": 3,
        "serviceMode": "string",
        "target": "string",
        "createdBy": 9,
        "createdByName": "string",
        "createdTime": "string",
        "createdTimeString": "string",
        "updatedBy": 7,
        "updatedByName": "string",
        "updatedTime": "string",
        "updatedTimeString": "string"
      },
      {
        "id": 9,
        "serviceName": "string",
        "serviceId": 10,
        "serviceMode": "string",
        "target": "string",
        "createdBy": 6,
        "createdByName": "string",
        "createdTime": "string",
        "createdTimeString": "string",
        "updatedBy": 9,
        "updatedByName": "string",
        "updatedTime": "string",
        "updatedTimeString": "string"
      },
      {
        "id": 6,
        "serviceName": "string",
        "serviceId": 3,
        "serviceMode": "string",
        "target": "string",
        "createdBy": 10,
        "createdByName": "string",
        "createdTime": "string",
        "createdTimeString": "string",
        "updatedBy": 6,
        "updatedByName": "string",
        "updatedTime": "string",
        "updatedTimeString": "string"
      }
    ]
  },
  {
    "id": 4,
    "name": "string",
    "oldName": "string",
    "cname": "string",
    "selectedMode": "string",
    "currentMode": "string",
    "description": "string",
    "lastChecked": "string",
    "lastCheckedString": "string",
    "lastUpdateStatus": "string",
    "createdBy": 8,
    "createdByName": "string",
    "createdTime": "string",
    "createdTimeString": "string",
    "updatedBy": 2,
    "updatedByName": "string",
    "updatedTime": "string",
    "updatedTimeString": "string",
    "targets": [
      {
        "id": 9,
        "serviceName": "string",
        "serviceId": 3,
        "serviceMode": "string",
        "target": "string",
        "createdBy": 4,
        "createdByName": "string",
        "createdTime": "string",
        "createdTimeString": "string",
        "updatedBy": 7,
        "updatedByName": "string",
        "updatedTime": "string",
        "updatedTimeString": "string"
      },
      {
        "id": 7,
        "serviceName": "string",
        "serviceId": 9,
        "serviceMode": "string",
        "target": "string",
        "createdBy": 5,
        "createdByName": "string",
        "createdTime": "string",
        "createdTimeString": "string",
        "updatedBy": 2,
        "updatedByName": "string",
        "updatedTime": "string",
        "updatedTimeString": "string"
      },
      {
        "id": 8,
        "serviceName": "string",
        "serviceId": 2,
        "serviceMode": "string",
        "target": "string",
        "createdBy": 8,
        "createdByName": "string",
        "createdTime": "string",
        "createdTimeString": "string",
        "updatedBy": 2,
        "updatedByName": "string",
        "updatedTime": "string",
        "updatedTimeString": "string"
      },
      {
        "id": 2,
        "serviceName": "string",
        "serviceId": 10,
        "serviceMode": "string",
        "target": "string",
        "createdBy": 4,
        "createdByName": "string",
        "createdTime": "string",
        "createdTimeString": "string",
        "updatedBy": 5,
        "updatedByName": "string",
        "updatedTime": "string",
        "updatedTimeString": "string"
      },
      {
        "id": 10,
        "serviceName": "string",
        "serviceId": 2,
        "serviceMode": "string",
        "target": "string",
        "createdBy": 3,
        "createdByName": "string",
        "createdTime": "string",
        "createdTimeString": "string",
        "updatedBy": 2,
        "updatedByName": "string",
        "updatedTime": "string",
        "updatedTimeString": "string"
      },
      {
        "id": 5,
        "serviceName": "string",
        "serviceId": 7,
        "serviceMode": "string",
        "target": "string",
        "createdBy": 10,
        "createdByName": "string",
        "createdTime": "string",
        "createdTimeString": "string",
        "updatedBy": 3,
        "updatedByName": "string",
        "updatedTime": "string",
        "updatedTimeString": "string"
      }
    ]
  },
  {
    "id": 8,
    "name": "string",
    "oldName": "string",
    "cname": "string",
    "selectedMode": "string",
    "currentMode": "string",
    "description": "string",
    "lastChecked": "string",
    "lastCheckedString": "string",
    "lastUpdateStatus": "string",
    "createdBy": 6,
    "createdByName": "string",
    "createdTime": "string",
    "createdTimeString": "string",
    "updatedBy": 3,
    "updatedByName": "string",
    "updatedTime": "string",
    "updatedTimeString": "string",
    "targets": [
      {
        "id": 3,
        "serviceName": "string",
        "serviceId": 8,
        "serviceMode": "string",
        "target": "string",
        "createdBy": 6,
        "createdByName": "string",
        "createdTime": "string",
        "createdTimeString": "string",
        "updatedBy": 10,
        "updatedByName": "string",
        "updatedTime": "string",
        "updatedTimeString": "string"
      }
    ]
  },
  {
    "id": 1,
    "name": "string",
    "oldName": "string",
    "cname": "string",
    "selectedMode": "string",
    "currentMode": "string",
    "description": "string",
    "lastChecked": "string",
    "lastCheckedString": "string",
    "lastUpdateStatus": "string",
    "createdBy": 4,
    "createdByName": "string",
    "createdTime": "string",
    "createdTimeString": "string",
    "updatedBy": 3,
    "updatedByName": "string",
    "updatedTime": "string",
    "updatedTimeString": "string",
    "targets": [
      {
        "id": 7,
        "serviceName": "string",
        "serviceId": 8,
        "serviceMode": "string",
        "target": "string",
        "createdBy": 3,
        "createdByName": "string",
        "createdTime": "string",
        "createdTimeString": "string",
        "updatedBy": 4,
        "updatedByName": "string",
        "updatedTime": "string",
        "updatedTimeString": "string"
      },
      {
        "id": 2,
        "serviceName": "string",
        "serviceId": 4,
        "serviceMode": "string",
        "target": "string",
        "createdBy": 1,
        "createdByName": "string",
        "createdTime": "string",
        "createdTimeString": "string",
        "updatedBy": 8,
        "updatedByName": "string",
        "updatedTime": "string",
        "updatedTimeString": "string"
      },
      {
        "id": 2,
        "serviceName": "string",
        "serviceId": 8,
        "serviceMode": "string",
        "target": "string",
        "createdBy": 8,
        "createdByName": "string",
        "createdTime": "string",
        "createdTimeString": "string",
        "updatedBy": 8,
        "updatedByName": "string",
        "updatedTime": "string",
        "updatedTimeString": "string"
      },
      {
        "id": 8,
        "serviceName": "string",
        "serviceId": 7,
        "serviceMode": "string",
        "target": "string",
        "createdBy": 5,
        "createdByName": "string",
        "createdTime": "string",
        "createdTimeString": "string",
        "updatedBy": 8,
        "updatedByName": "string",
        "updatedTime": "string",
        "updatedTimeString": "string"
      },
      {
        "id": 6,
        "serviceName": "string",
        "serviceId": 10,
        "serviceMode": "string",
        "target": "string",
        "createdBy": 3,
        "createdByName": "string",
        "createdTime": "string",
        "createdTimeString": "string",
        "updatedBy": 1,
        "updatedByName": "string",
        "updatedTime": "string",
        "updatedTimeString": "string"
      },
      {
        "id": 4,
        "serviceName": "string",
        "serviceId": 5,
        "serviceMode": "string",
        "target": "string",
        "createdBy": 9,
        "createdByName": "string",
        "createdTime": "string",
        "createdTimeString": "string",
        "updatedBy": 10,
        "updatedByName": "string",
        "updatedTime": "string",
        "updatedTimeString": "string"
      },
      {
        "id": 5,
        "serviceName": "string",
        "serviceId": 2,
        "serviceMode": "string",
        "target": "string",
        "createdBy": 1,
        "createdByName": "string",
        "createdTime": "string",
        "createdTimeString": "string",
        "updatedBy": 10,
        "updatedByName": "string",
        "updatedTime": "string",
        "updatedTimeString": "string"
      },
      {
        "id": 4,
        "serviceName": "string",
        "serviceId": 5,
        "serviceMode": "string",
        "target": "string",
        "createdBy": 4,
        "createdByName": "string",
        "createdTime": "string",
        "createdTimeString": "string",
        "updatedBy": 9,
        "updatedByName": "string",
        "updatedTime": "string",
        "updatedTimeString": "string"
      },
      {
        "id": 10,
        "serviceName": "string",
        "serviceId": 2,
        "serviceMode": "string",
        "target": "string",
        "createdBy": 7,
        "createdByName": "string",
        "createdTime": "string",
        "createdTimeString": "string",
        "updatedBy": 10,
        "updatedByName": "string",
        "updatedTime": "string",
        "updatedTimeString": "string"
      },
      {
        "id": 3,
        "serviceName": "string",
        "serviceId": 10,
        "serviceMode": "string",
        "target": "string",
        "createdBy": 8,
        "createdByName": "string",
        "createdTime": "string",
        "createdTimeString": "string",
        "updatedBy": 7,
        "updatedByName": "string",
        "updatedTime": "string",
        "updatedTimeString": "string"
      }
    ]
  }
]