{
  "$id": "schema.json",
  "type": "object",
  "schema": "http://json-schema.org/draft-07/schema#",
  "translate": false,
  "dynamicfields": true,
  "properties": {
    "ph_request_type": {
      "type": "string",
      "description": "type of request (internal to adapter)",
      "default": "prepareSnapshot",
      "enum": [
        "prepareSnapshot",
        "applySnapshot",
        "backupBinlog",
        "applyBinlog",
        "restoreDB",
        "deleteDBSnapshot",
        "listAwsS3File",
        "deleteAWSS3Files",
        "downloadAWSS3File",
        "restoreAWSS3File",
        "backupDbToAWSS3"
      ],
      "external_name": "ph_request_type"
    }
  },
  "definitions": {}
}