[
  {
    "id": 8,
    "name": "string",
    "description": "string",
    "addr1": 162,
    "addr2": 192,
    "addr3": 10,
    "addr4": 6,
    "mask_length": 32,
    "fullAddress": "10.1.10.185/24",
    "sharedNetwork": "shared_network2",
    "split_mask_length": 16,
    "start_addr_val": 4,
    "end_addr_val": 5,
    "network_id": 3,
    "network_name": "string",
    "network_address": "10.0.0.0",
    "network_mask": 32,
    "subnet_group_id": 7,
    "subnet_group_name": "string",
    "contact_name": "string",
    "first_name": "string",
    "middle_name": "string",
    "last_name": "string",
    "email_id": "string",
    "organization_name": "TCPWave",
    "location_name": "string",
    "street1": "string",
    "street2": "string",
    "city": "string",
    "state": "string",
    "country": "string",
    "zip": "string",
    "template_id": 3,
    "template_name": "string",
    "primary_domain": "string",
    "primary_dhcp_server": "string",
    "primary_dhcp_server_address": "string",
    "server_id": 7,
    "router_name": "Router-1",
    "routerAddress": "10.10.0.1",
    "router_option": "First IP in the subnet",
    "percent_full": 4,
    "object_count": 10,
    "domain_id": 10,
    "created_time": "string",
    "updated_time": "string",
    "vlan_id": "string",
    "created_by_name": "string",
    "updated_by_name": "string",
    "created_by_login_name": "string",
    "updated_by_login_name": "string",
    "extensions": [
      {
        "name": "RITS_ID-1",
        "value": "Admin/Network/Subnet"
      },
      {
        "name": "RITS_ID-1",
        "value": "Admin/Network/Subnet"
      },
      {
        "name": "RITS_ID-1",
        "value": "Admin/Network/Subnet"
      },
      {
        "name": "RITS_ID-1",
        "value": "Admin/Network/Subnet"
      },
      {
        "name": "RITS_ID-1",
        "value": "Admin/Network/Subnet"
      },
      {
        "name": "RITS_ID-1",
        "value": "Admin/Network/Subnet"
      },
      {
        "name": "RITS_ID-1",
        "value": "Admin/Network/Subnet"
      },
      {
        "name": "RITS_ID-1",
        "value": "Admin/Network/Subnet"
      }
    ],
    "awsSubnetId": "18772",
    "cloudProviderId": 4,
    "vrf_name": "network4_vrf",
    "cloudProviderName": "DDS_Cloud",
    "subnetTemplateName": "SubnetTemplate",
    "enable_discovery": "Yes/No",
    "discoveryTemplateId": 41010,
    "discovery_template": "DiscoveryTemp1",
    "reclaim_objects": "Yes/No",
    "schedule_reclaim": "Yes/No",
    "createRevZone": "Yes/No",
    "dmzVisible": "Yes/No",
    "zoneTemplateId": 41010,
    "zoneTemplateName": "ZoneTemp1",
    "dnssec_enable": "Yes/No",
    "nsec_option": "NSEC/NSEC3",
    "serialFormat": "NODATE/DATE",
    "monitoringService": "Yes/No",
    "dhcpFailoverPeer": "nusartx-dp",
    "quickAddress": "string",
    "viewList": [
      {
        "id": 1,
        "name": "internal",
        "newName": "external",
        "matchClients": "[ACL1, ACL2, ACL3]",
        "matchDestinations": "[ACL1, ACL2, ACL3]",
        "matchClientsValue": "localhost;10.0.0.0/16",
        "matchDestinationsValue": "localhost;10.0.0.0/16",
        "organizationId": 1,
        "organizationName": "TCPWave",
        "createdBy": 1,
        "createdByName": "User1",
        "updatedBy": 1,
        "updatedByName": "1",
        "createdTime": "10/1/2016",
        "updatedTime": "10/2/2016",
        "createdTimeString": "10/1/2016 6:57",
        "updatedTimeString": "10/1/2016 6:57",
        "created_by_login_name": "string",
        "updated_by_login_name": "string",
        "sequence": 1,
        "geoType": "string",
        "matchGeoClients": "string",
        "matchGeoDestinations": "string"
      },
      {
        "id": 1,
        "name": "internal",
        "newName": "external",
        "matchClients": "[ACL1, ACL2, ACL3]",
        "matchDestinations": "[ACL1, ACL2, ACL3]",
        "matchClientsValue": "localhost;10.0.0.0/16",
        "matchDestinationsValue": "localhost;10.0.0.0/16",
        "organizationId": 1,
        "organizationName": "TCPWave",
        "createdBy": 1,
        "createdByName": "User1",
        "updatedBy": 1,
        "updatedByName": "1",
        "createdTime": "10/1/2016",
        "updatedTime": "10/2/2016",
        "createdTimeString": "10/1/2016 6:57",
        "updatedTimeString": "10/1/2016 6:57",
        "created_by_login_name": "string",
        "updated_by_login_name": "string",
        "sequence": 1,
        "geoType": "string",
        "matchGeoClients": "string",
        "matchGeoDestinations": "string"
      },
      {
        "id": 1,
        "name": "internal",
        "newName": "external",
        "matchClients": "[ACL1, ACL2, ACL3]",
        "matchDestinations": "[ACL1, ACL2, ACL3]",
        "matchClientsValue": "localhost;10.0.0.0/16",
        "matchDestinationsValue": "localhost;10.0.0.0/16",
        "organizationId": 1,
        "organizationName": "TCPWave",
        "createdBy": 1,
        "createdByName": "User1",
        "updatedBy": 1,
        "updatedByName": "1",
        "createdTime": "10/1/2016",
        "updatedTime": "10/2/2016",
        "createdTimeString": "10/1/2016 6:57",
        "updatedTimeString": "10/1/2016 6:57",
        "created_by_login_name": "string",
        "updated_by_login_name": "string",
        "sequence": 1,
        "geoType": "string",
        "matchGeoClients": "string",
        "matchGeoDestinations": "string"
      },
      {
        "id": 1,
        "name": "internal",
        "newName": "external",
        "matchClients": "[ACL1, ACL2, ACL3]",
        "matchDestinations": "[ACL1, ACL2, ACL3]",
        "matchClientsValue": "localhost;10.0.0.0/16",
        "matchDestinationsValue": "localhost;10.0.0.0/16",
        "organizationId": 1,
        "organizationName": "TCPWave",
        "createdBy": 1,
        "createdByName": "User1",
        "updatedBy": 1,
        "updatedByName": "1",
        "createdTime": "10/1/2016",
        "updatedTime": "10/2/2016",
        "createdTimeString": "10/1/2016 6:57",
        "updatedTimeString": "10/1/2016 6:57",
        "created_by_login_name": "string",
        "updated_by_login_name": "string",
        "sequence": 1,
        "geoType": "string",
        "matchGeoClients": "string",
        "matchGeoDestinations": "string"
      },
      {
        "id": 1,
        "name": "internal",
        "newName": "external",
        "matchClients": "[ACL1, ACL2, ACL3]",
        "matchDestinations": "[ACL1, ACL2, ACL3]",
        "matchClientsValue": "localhost;10.0.0.0/16",
        "matchDestinationsValue": "localhost;10.0.0.0/16",
        "organizationId": 1,
        "organizationName": "TCPWave",
        "createdBy": 1,
        "createdByName": "User1",
        "updatedBy": 1,
        "updatedByName": "1",
        "createdTime": "10/1/2016",
        "updatedTime": "10/2/2016",
        "createdTimeString": "10/1/2016 6:57",
        "updatedTimeString": "10/1/2016 6:57",
        "created_by_login_name": "string",
        "updated_by_login_name": "string",
        "sequence": 1,
        "geoType": "string",
        "matchGeoClients": "string",
        "matchGeoDestinations": "string"
      },
      {
        "id": 1,
        "name": "internal",
        "newName": "external",
        "matchClients": "[ACL1, ACL2, ACL3]",
        "matchDestinations": "[ACL1, ACL2, ACL3]",
        "matchClientsValue": "localhost;10.0.0.0/16",
        "matchDestinationsValue": "localhost;10.0.0.0/16",
        "organizationId": 1,
        "organizationName": "TCPWave",
        "createdBy": 1,
        "createdByName": "User1",
        "updatedBy": 1,
        "updatedByName": "1",
        "createdTime": "10/1/2016",
        "updatedTime": "10/2/2016",
        "createdTimeString": "10/1/2016 6:57",
        "updatedTimeString": "10/1/2016 6:57",
        "created_by_login_name": "string",
        "updated_by_login_name": "string",
        "sequence": 1,
        "geoType": "string",
        "matchGeoClients": "string",
        "matchGeoDestinations": "string"
      },
      {
        "id": 1,
        "name": "internal",
        "newName": "external",
        "matchClients": "[ACL1, ACL2, ACL3]",
        "matchDestinations": "[ACL1, ACL2, ACL3]",
        "matchClientsValue": "localhost;10.0.0.0/16",
        "matchDestinationsValue": "localhost;10.0.0.0/16",
        "organizationId": 1,
        "organizationName": "TCPWave",
        "createdBy": 1,
        "createdByName": "User1",
        "updatedBy": 1,
        "updatedByName": "1",
        "createdTime": "10/1/2016",
        "updatedTime": "10/2/2016",
        "createdTimeString": "10/1/2016 6:57",
        "updatedTimeString": "10/1/2016 6:57",
        "created_by_login_name": "string",
        "updated_by_login_name": "string",
        "sequence": 1,
        "geoType": "string",
        "matchGeoClients": "string",
        "matchGeoDestinations": "string"
      },
      {
        "id": 1,
        "name": "internal",
        "newName": "external",
        "matchClients": "[ACL1, ACL2, ACL3]",
        "matchDestinations": "[ACL1, ACL2, ACL3]",
        "matchClientsValue": "localhost;10.0.0.0/16",
        "matchDestinationsValue": "localhost;10.0.0.0/16",
        "organizationId": 1,
        "organizationName": "TCPWave",
        "createdBy": 1,
        "createdByName": "User1",
        "updatedBy": 1,
        "updatedByName": "1",
        "createdTime": "10/1/2016",
        "updatedTime": "10/2/2016",
        "createdTimeString": "10/1/2016 6:57",
        "updatedTimeString": "10/1/2016 6:57",
        "created_by_login_name": "string",
        "updated_by_login_name": "string",
        "sequence": 1,
        "geoType": "string",
        "matchGeoClients": "string",
        "matchGeoDestinations": "string"
      },
      {
        "id": 1,
        "name": "internal",
        "newName": "external",
        "matchClients": "[ACL1, ACL2, ACL3]",
        "matchDestinations": "[ACL1, ACL2, ACL3]",
        "matchClientsValue": "localhost;10.0.0.0/16",
        "matchDestinationsValue": "localhost;10.0.0.0/16",
        "organizationId": 1,
        "organizationName": "TCPWave",
        "createdBy": 1,
        "createdByName": "User1",
        "updatedBy": 1,
        "updatedByName": "1",
        "createdTime": "10/1/2016",
        "updatedTime": "10/2/2016",
        "createdTimeString": "10/1/2016 6:57",
        "updatedTimeString": "10/1/2016 6:57",
        "created_by_login_name": "string",
        "updated_by_login_name": "string",
        "sequence": 1,
        "geoType": "string",
        "matchGeoClients": "string",
        "matchGeoDestinations": "string"
      },
      {
        "id": 1,
        "name": "internal",
        "newName": "external",
        "matchClients": "[ACL1, ACL2, ACL3]",
        "matchDestinations": "[ACL1, ACL2, ACL3]",
        "matchClientsValue": "localhost;10.0.0.0/16",
        "matchDestinationsValue": "localhost;10.0.0.0/16",
        "organizationId": 1,
        "organizationName": "TCPWave",
        "createdBy": 1,
        "createdByName": "User1",
        "updatedBy": 1,
        "updatedByName": "1",
        "createdTime": "10/1/2016",
        "updatedTime": "10/2/2016",
        "createdTimeString": "10/1/2016 6:57",
        "updatedTimeString": "10/1/2016 6:57",
        "created_by_login_name": "string",
        "updated_by_login_name": "string",
        "sequence": 1,
        "geoType": "string",
        "matchGeoClients": "string",
        "matchGeoDestinations": "string"
      }
    ],
    "updated_time_string": "string",
    "created_time_string": "string",
    "schedule_job_id": "Rest_800"
  },
  {
    "id": 1,
    "name": "string",
    "description": "string",
    "addr1": 162,
    "addr2": 192,
    "addr3": 10,
    "addr4": 8,
    "mask_length": 32,
    "fullAddress": "10.1.10.185/24",
    "sharedNetwork": "shared_network2",
    "split_mask_length": 16,
    "start_addr_val": 5,
    "end_addr_val": 8,
    "network_id": 3,
    "network_name": "string",
    "network_address": "10.0.0.0",
    "network_mask": 32,
    "subnet_group_id": 3,
    "subnet_group_name": "string",
    "contact_name": "string",
    "first_name": "string",
    "middle_name": "string",
    "last_name": "string",
    "email_id": "string",
    "organization_name": "TCPWave",
    "location_name": "string",
    "street1": "string",
    "street2": "string",
    "city": "string",
    "state": "string",
    "country": "string",
    "zip": "string",
    "template_id": 6,
    "template_name": "string",
    "primary_domain": "string",
    "primary_dhcp_server": "string",
    "primary_dhcp_server_address": "string",
    "server_id": 5,
    "router_name": "Router-1",
    "routerAddress": "10.10.0.1",
    "router_option": "First IP in the subnet",
    "percent_full": 2,
    "object_count": 4,
    "domain_id": 10,
    "created_time": "string",
    "updated_time": "string",
    "vlan_id": "string",
    "created_by_name": "string",
    "updated_by_name": "string",
    "created_by_login_name": "string",
    "updated_by_login_name": "string",
    "extensions": [
      {
        "name": "RITS_ID-1",
        "value": "Admin/Network/Subnet"
      },
      {
        "name": "RITS_ID-1",
        "value": "Admin/Network/Subnet"
      },
      {
        "name": "RITS_ID-1",
        "value": "Admin/Network/Subnet"
      },
      {
        "name": "RITS_ID-1",
        "value": "Admin/Network/Subnet"
      }
    ],
    "awsSubnetId": "18772",
    "cloudProviderId": 5,
    "vrf_name": "network4_vrf",
    "cloudProviderName": "DDS_Cloud",
    "subnetTemplateName": "SubnetTemplate",
    "enable_discovery": "Yes/No",
    "discoveryTemplateId": 41010,
    "discovery_template": "DiscoveryTemp1",
    "reclaim_objects": "Yes/No",
    "schedule_reclaim": "Yes/No",
    "createRevZone": "Yes/No",
    "dmzVisible": "Yes/No",
    "zoneTemplateId": 41010,
    "zoneTemplateName": "ZoneTemp1",
    "dnssec_enable": "Yes/No",
    "nsec_option": "NSEC/NSEC3",
    "serialFormat": "NODATE/DATE",
    "monitoringService": "Yes/No",
    "dhcpFailoverPeer": "nusartx-dp",
    "quickAddress": "string",
    "viewList": [
      {
        "id": 1,
        "name": "internal",
        "newName": "external",
        "matchClients": "[ACL1, ACL2, ACL3]",
        "matchDestinations": "[ACL1, ACL2, ACL3]",
        "matchClientsValue": "localhost;10.0.0.0/16",
        "matchDestinationsValue": "localhost;10.0.0.0/16",
        "organizationId": 1,
        "organizationName": "TCPWave",
        "createdBy": 1,
        "createdByName": "User1",
        "updatedBy": 1,
        "updatedByName": "1",
        "createdTime": "10/1/2016",
        "updatedTime": "10/2/2016",
        "createdTimeString": "10/1/2016 6:57",
        "updatedTimeString": "10/1/2016 6:57",
        "created_by_login_name": "string",
        "updated_by_login_name": "string",
        "sequence": 1,
        "geoType": "string",
        "matchGeoClients": "string",
        "matchGeoDestinations": "string"
      },
      {
        "id": 1,
        "name": "internal",
        "newName": "external",
        "matchClients": "[ACL1, ACL2, ACL3]",
        "matchDestinations": "[ACL1, ACL2, ACL3]",
        "matchClientsValue": "localhost;10.0.0.0/16",
        "matchDestinationsValue": "localhost;10.0.0.0/16",
        "organizationId": 1,
        "organizationName": "TCPWave",
        "createdBy": 1,
        "createdByName": "User1",
        "updatedBy": 1,
        "updatedByName": "1",
        "createdTime": "10/1/2016",
        "updatedTime": "10/2/2016",
        "createdTimeString": "10/1/2016 6:57",
        "updatedTimeString": "10/1/2016 6:57",
        "created_by_login_name": "string",
        "updated_by_login_name": "string",
        "sequence": 1,
        "geoType": "string",
        "matchGeoClients": "string",
        "matchGeoDestinations": "string"
      },
      {
        "id": 1,
        "name": "internal",
        "newName": "external",
        "matchClients": "[ACL1, ACL2, ACL3]",
        "matchDestinations": "[ACL1, ACL2, ACL3]",
        "matchClientsValue": "localhost;10.0.0.0/16",
        "matchDestinationsValue": "localhost;10.0.0.0/16",
        "organizationId": 1,
        "organizationName": "TCPWave",
        "createdBy": 1,
        "createdByName": "User1",
        "updatedBy": 1,
        "updatedByName": "1",
        "createdTime": "10/1/2016",
        "updatedTime": "10/2/2016",
        "createdTimeString": "10/1/2016 6:57",
        "updatedTimeString": "10/1/2016 6:57",
        "created_by_login_name": "string",
        "updated_by_login_name": "string",
        "sequence": 1,
        "geoType": "string",
        "matchGeoClients": "string",
        "matchGeoDestinations": "string"
      },
      {
        "id": 1,
        "name": "internal",
        "newName": "external",
        "matchClients": "[ACL1, ACL2, ACL3]",
        "matchDestinations": "[ACL1, ACL2, ACL3]",
        "matchClientsValue": "localhost;10.0.0.0/16",
        "matchDestinationsValue": "localhost;10.0.0.0/16",
        "organizationId": 1,
        "organizationName": "TCPWave",
        "createdBy": 1,
        "createdByName": "User1",
        "updatedBy": 1,
        "updatedByName": "1",
        "createdTime": "10/1/2016",
        "updatedTime": "10/2/2016",
        "createdTimeString": "10/1/2016 6:57",
        "updatedTimeString": "10/1/2016 6:57",
        "created_by_login_name": "string",
        "updated_by_login_name": "string",
        "sequence": 1,
        "geoType": "string",
        "matchGeoClients": "string",
        "matchGeoDestinations": "string"
      },
      {
        "id": 1,
        "name": "internal",
        "newName": "external",
        "matchClients": "[ACL1, ACL2, ACL3]",
        "matchDestinations": "[ACL1, ACL2, ACL3]",
        "matchClientsValue": "localhost;10.0.0.0/16",
        "matchDestinationsValue": "localhost;10.0.0.0/16",
        "organizationId": 1,
        "organizationName": "TCPWave",
        "createdBy": 1,
        "createdByName": "User1",
        "updatedBy": 1,
        "updatedByName": "1",
        "createdTime": "10/1/2016",
        "updatedTime": "10/2/2016",
        "createdTimeString": "10/1/2016 6:57",
        "updatedTimeString": "10/1/2016 6:57",
        "created_by_login_name": "string",
        "updated_by_login_name": "string",
        "sequence": 1,
        "geoType": "string",
        "matchGeoClients": "string",
        "matchGeoDestinations": "string"
      },
      {
        "id": 1,
        "name": "internal",
        "newName": "external",
        "matchClients": "[ACL1, ACL2, ACL3]",
        "matchDestinations": "[ACL1, ACL2, ACL3]",
        "matchClientsValue": "localhost;10.0.0.0/16",
        "matchDestinationsValue": "localhost;10.0.0.0/16",
        "organizationId": 1,
        "organizationName": "TCPWave",
        "createdBy": 1,
        "createdByName": "User1",
        "updatedBy": 1,
        "updatedByName": "1",
        "createdTime": "10/1/2016",
        "updatedTime": "10/2/2016",
        "createdTimeString": "10/1/2016 6:57",
        "updatedTimeString": "10/1/2016 6:57",
        "created_by_login_name": "string",
        "updated_by_login_name": "string",
        "sequence": 1,
        "geoType": "string",
        "matchGeoClients": "string",
        "matchGeoDestinations": "string"
      },
      {
        "id": 1,
        "name": "internal",
        "newName": "external",
        "matchClients": "[ACL1, ACL2, ACL3]",
        "matchDestinations": "[ACL1, ACL2, ACL3]",
        "matchClientsValue": "localhost;10.0.0.0/16",
        "matchDestinationsValue": "localhost;10.0.0.0/16",
        "organizationId": 1,
        "organizationName": "TCPWave",
        "createdBy": 1,
        "createdByName": "User1",
        "updatedBy": 1,
        "updatedByName": "1",
        "createdTime": "10/1/2016",
        "updatedTime": "10/2/2016",
        "createdTimeString": "10/1/2016 6:57",
        "updatedTimeString": "10/1/2016 6:57",
        "created_by_login_name": "string",
        "updated_by_login_name": "string",
        "sequence": 1,
        "geoType": "string",
        "matchGeoClients": "string",
        "matchGeoDestinations": "string"
      },
      {
        "id": 1,
        "name": "internal",
        "newName": "external",
        "matchClients": "[ACL1, ACL2, ACL3]",
        "matchDestinations": "[ACL1, ACL2, ACL3]",
        "matchClientsValue": "localhost;10.0.0.0/16",
        "matchDestinationsValue": "localhost;10.0.0.0/16",
        "organizationId": 1,
        "organizationName": "TCPWave",
        "createdBy": 1,
        "createdByName": "User1",
        "updatedBy": 1,
        "updatedByName": "1",
        "createdTime": "10/1/2016",
        "updatedTime": "10/2/2016",
        "createdTimeString": "10/1/2016 6:57",
        "updatedTimeString": "10/1/2016 6:57",
        "created_by_login_name": "string",
        "updated_by_login_name": "string",
        "sequence": 1,
        "geoType": "string",
        "matchGeoClients": "string",
        "matchGeoDestinations": "string"
      },
      {
        "id": 1,
        "name": "internal",
        "newName": "external",
        "matchClients": "[ACL1, ACL2, ACL3]",
        "matchDestinations": "[ACL1, ACL2, ACL3]",
        "matchClientsValue": "localhost;10.0.0.0/16",
        "matchDestinationsValue": "localhost;10.0.0.0/16",
        "organizationId": 1,
        "organizationName": "TCPWave",
        "createdBy": 1,
        "createdByName": "User1",
        "updatedBy": 1,
        "updatedByName": "1",
        "createdTime": "10/1/2016",
        "updatedTime": "10/2/2016",
        "createdTimeString": "10/1/2016 6:57",
        "updatedTimeString": "10/1/2016 6:57",
        "created_by_login_name": "string",
        "updated_by_login_name": "string",
        "sequence": 1,
        "geoType": "string",
        "matchGeoClients": "string",
        "matchGeoDestinations": "string"
      },
      {
        "id": 1,
        "name": "internal",
        "newName": "external",
        "matchClients": "[ACL1, ACL2, ACL3]",
        "matchDestinations": "[ACL1, ACL2, ACL3]",
        "matchClientsValue": "localhost;10.0.0.0/16",
        "matchDestinationsValue": "localhost;10.0.0.0/16",
        "organizationId": 1,
        "organizationName": "TCPWave",
        "createdBy": 1,
        "createdByName": "User1",
        "updatedBy": 1,
        "updatedByName": "1",
        "createdTime": "10/1/2016",
        "updatedTime": "10/2/2016",
        "createdTimeString": "10/1/2016 6:57",
        "updatedTimeString": "10/1/2016 6:57",
        "created_by_login_name": "string",
        "updated_by_login_name": "string",
        "sequence": 1,
        "geoType": "string",
        "matchGeoClients": "string",
        "matchGeoDestinations": "string"
      }
    ],
    "updated_time_string": "string",
    "created_time_string": "string",
    "schedule_job_id": "Rest_800"
  },
  {
    "id": 4,
    "name": "string",
    "description": "string",
    "addr1": 162,
    "addr2": 192,
    "addr3": 10,
    "addr4": 7,
    "mask_length": 32,
    "fullAddress": "10.1.10.185/24",
    "sharedNetwork": "shared_network2",
    "split_mask_length": 16,
    "start_addr_val": 8,
    "end_addr_val": 1,
    "network_id": 10,
    "network_name": "string",
    "network_address": "10.0.0.0",
    "network_mask": 32,
    "subnet_group_id": 8,
    "subnet_group_name": "string",
    "contact_name": "string",
    "first_name": "string",
    "middle_name": "string",
    "last_name": "string",
    "email_id": "string",
    "organization_name": "TCPWave",
    "location_name": "string",
    "street1": "string",
    "street2": "string",
    "city": "string",
    "state": "string",
    "country": "string",
    "zip": "string",
    "template_id": 5,
    "template_name": "string",
    "primary_domain": "string",
    "primary_dhcp_server": "string",
    "primary_dhcp_server_address": "string",
    "server_id": 6,
    "router_name": "Router-1",
    "routerAddress": "10.10.0.1",
    "router_option": "First IP in the subnet",
    "percent_full": 9,
    "object_count": 9,
    "domain_id": 4,
    "created_time": "string",
    "updated_time": "string",
    "vlan_id": "string",
    "created_by_name": "string",
    "updated_by_name": "string",
    "created_by_login_name": "string",
    "updated_by_login_name": "string",
    "extensions": [
      {
        "name": "RITS_ID-1",
        "value": "Admin/Network/Subnet"
      },
      {
        "name": "RITS_ID-1",
        "value": "Admin/Network/Subnet"
      },
      {
        "name": "RITS_ID-1",
        "value": "Admin/Network/Subnet"
      },
      {
        "name": "RITS_ID-1",
        "value": "Admin/Network/Subnet"
      },
      {
        "name": "RITS_ID-1",
        "value": "Admin/Network/Subnet"
      },
      {
        "name": "RITS_ID-1",
        "value": "Admin/Network/Subnet"
      },
      {
        "name": "RITS_ID-1",
        "value": "Admin/Network/Subnet"
      },
      {
        "name": "RITS_ID-1",
        "value": "Admin/Network/Subnet"
      },
      {
        "name": "RITS_ID-1",
        "value": "Admin/Network/Subnet"
      }
    ],
    "awsSubnetId": "18772",
    "cloudProviderId": 3,
    "vrf_name": "network4_vrf",
    "cloudProviderName": "DDS_Cloud",
    "subnetTemplateName": "SubnetTemplate",
    "enable_discovery": "Yes/No",
    "discoveryTemplateId": 41010,
    "discovery_template": "DiscoveryTemp1",
    "reclaim_objects": "Yes/No",
    "schedule_reclaim": "Yes/No",
    "createRevZone": "Yes/No",
    "dmzVisible": "Yes/No",
    "zoneTemplateId": 41010,
    "zoneTemplateName": "ZoneTemp1",
    "dnssec_enable": "Yes/No",
    "nsec_option": "NSEC/NSEC3",
    "serialFormat": "NODATE/DATE",
    "monitoringService": "Yes/No",
    "dhcpFailoverPeer": "nusartx-dp",
    "quickAddress": "string",
    "viewList": [
      {
        "id": 1,
        "name": "internal",
        "newName": "external",
        "matchClients": "[ACL1, ACL2, ACL3]",
        "matchDestinations": "[ACL1, ACL2, ACL3]",
        "matchClientsValue": "localhost;10.0.0.0/16",
        "matchDestinationsValue": "localhost;10.0.0.0/16",
        "organizationId": 1,
        "organizationName": "TCPWave",
        "createdBy": 1,
        "createdByName": "User1",
        "updatedBy": 1,
        "updatedByName": "1",
        "createdTime": "10/1/2016",
        "updatedTime": "10/2/2016",
        "createdTimeString": "10/1/2016 6:57",
        "updatedTimeString": "10/1/2016 6:57",
        "created_by_login_name": "string",
        "updated_by_login_name": "string",
        "sequence": 1,
        "geoType": "string",
        "matchGeoClients": "string",
        "matchGeoDestinations": "string"
      }
    ],
    "updated_time_string": "string",
    "created_time_string": "string",
    "schedule_job_id": "Rest_800"
  }
]