{
  "actions": [
    {
      "name": "listDNS",
      "protocol": "REST",
      "method": "GET",
      "entitypath": "{base_path}/{version}/checkouts/list?{query}",
      "requestSchema": "schema.json",
      "responseSchema": "schema.json",
      "timeout": 0,
      "sendEmpty": false,
      "sendGetBody": false,
      "requestDatatype": "JSON",
      "responseDatatype": "JSON",
      "headers": {},
      "responseObjects": [
        {
          "type": "default",
          "key": "",
          "mockFile": "mockdatafiles/listDNS-default.json"
        }
      ]
    },
    {
      "name": "runAndGetCheckouts",
      "protocol": "REST",
      "method": "GET",
      "entitypath": "{base_path}/{version}/checkouts/runAndList?{query}",
      "requestSchema": "schema.json",
      "responseSchema": "schema.json",
      "timeout": 0,
      "sendEmpty": false,
      "sendGetBody": false,
      "requestDatatype": "JSON",
      "responseDatatype": "JSON",
      "headers": {},
      "responseObjects": [
        {
          "type": "default",
          "key": "",
          "mockFile": "mockdatafiles/runAndGetCheckouts-default.json"
        }
      ]
    },
    {
      "name": "setBaseLine",
      "protocol": "REST",
      "method": "POST",
      "entitypath": "{base_path}/{version}/checkouts/baseline?{query}",
      "requestSchema": "schema.json",
      "responseSchema": "schema.json",
      "timeout": 0,
      "sendEmpty": false,
      "sendGetBody": false,
      "requestDatatype": "JSON",
      "responseDatatype": "JSON",
      "headers": {},
      "responseObjects": [
        {
          "type": "default",
          "key": "",
          "mockFile": ""
        }
      ]
    },
    {
      "name": "getIPAMList",
      "protocol": "REST",
      "method": "GET",
      "entitypath": "{base_path}/{version}/checkouts/ipamlist?{query}",
      "requestSchema": "schema.json",
      "responseSchema": "schema.json",
      "timeout": 0,
      "sendEmpty": false,
      "sendGetBody": false,
      "requestDatatype": "JSON",
      "responseDatatype": "JSON",
      "headers": {},
      "responseObjects": [
        {
          "type": "default",
          "key": "",
          "mockFile": "mockdatafiles/getIPAMList-default.json"
        }
      ]
    }
  ]
}