{
  "total": 20,
  "recordsTotal": 40,
  "recordsFiltered": 40,
  "data": [
    {
      "id": 21,
      "channel": "named",
      "type": 5,
      "type_string": "SYSLOG/FILE/STDERR/ NULL",
      "versions": 6,
      "size": 1024000,
      "facility": "syslog",
      "severity": 1,
      "print_time": true,
      "print_severity": true,
      "print_category": true,
      "special_channel": false,
      "severity_text": "debug",
      "debug_level": 10,
      "file_path": "/var/named/log/named.log",
      "updated_time": "3/18/2016 4:37",
      "updated_by_name": "John",
      "created_by_name": "Stephen",
      "created_time": "3/18/2016 3:39",
      "updated_time_string": "3/18/2016 4:37",
      "created_time_string": "3/18/2016 3:39"
    }
  ]
}