[
  {
    "start_time": "2017-10-03 00:01:00",
    "server_name": "Test-Appliance",
    "aaaa": 100,
    "cname": 100,
    "mx": 100,
    "ns": 100,
    "ptr": 100,
    "soa": 100,
    "a": 100,
    "srv": 100
  }
]