{
  "actions": [
    {
      "name": "configure",
      "protocol": "REST",
      "method": "POST",
      "entitypath": "{base_path}/{version}/rootaccessmgmt/configure?{query}",
      "requestSchema": "schema.json",
      "responseSchema": "schema.json",
      "timeout": 0,
      "sendEmpty": false,
      "sendGetBody": false,
      "requestDatatype": "JSON",
      "responseDatatype": "JSON",
      "headers": {},
      "responseObjects": [
        {
          "type": "default",
          "key": "",
          "mockFile": ""
        }
      ]
    },
    {
      "name": "listVaultTypes",
      "protocol": "REST",
      "method": "GET",
      "entitypath": "{base_path}/{version}/rootaccessmgmt/list_vault_types?{query}",
      "requestSchema": "schema.json",
      "responseSchema": "schema.json",
      "timeout": 0,
      "sendEmpty": false,
      "sendGetBody": false,
      "requestDatatype": "JSON",
      "responseDatatype": "JSON",
      "headers": {},
      "responseObjects": [
        {
          "type": "default",
          "key": "",
          "mockFile": "mockdatafiles/listVaultTypes-default.json"
        }
      ]
    },
    {
      "name": "getVaultDetails",
      "protocol": "REST",
      "method": "GET",
      "entitypath": "{base_path}/{version}/rootaccessmgmt/get?{query}",
      "requestSchema": "schema.json",
      "responseSchema": "schema.json",
      "timeout": 0,
      "sendEmpty": false,
      "sendGetBody": false,
      "requestDatatype": "JSON",
      "responseDatatype": "JSON",
      "headers": {},
      "responseObjects": [
        {
          "type": "default",
          "key": "",
          "mockFile": "mockdatafiles/getVaultDetails-default.json"
        }
      ]
    }
  ]
}