{
  "total": 20,
  "recordsTotal": 40,
  "recordsFiltered": 40,
  "data": [
    {
      "name": "string",
      "id": "string",
      "type": "string",
      "ntp": "string",
      "bgp": "string",
      "ssh": "string",
      "snmp": "string",
      "snmp_trap": "string",
      "tacacs_servers": "string",
      "organization": "Internal",
      "bind": "string",
      "ipv4": "string",
      "master_z": 3,
      "slave_z": 3,
      "server_current_status": 1,
      "server_current_heartbeat": 6,
      "syslog_servers": "string",
      "last_updated": "string",
      "last_sync": "string",
      "ntp_servers": "string",
      "master_server": "string",
      "slave_server": "string",
      "amq_version": "string",
      "unbound": "string",
      "dhcp": "string",
      "patch_level": "string",
      "zebra_version": "string",
      "nsd_version": "string",
      "dr_config": "string",
      "tims_dns_version": "string",
      "tims_dhcp_version": "string",
      "bgp_peers": "string"
    },
    {
      "name": "string",
      "id": "string",
      "type": "string",
      "ntp": "string",
      "bgp": "string",
      "ssh": "string",
      "snmp": "string",
      "snmp_trap": "string",
      "tacacs_servers": "string",
      "organization": "Internal",
      "bind": "string",
      "ipv4": "string",
      "master_z": 5,
      "slave_z": 5,
      "server_current_status": 5,
      "server_current_heartbeat": 6,
      "syslog_servers": "string",
      "last_updated": "string",
      "last_sync": "string",
      "ntp_servers": "string",
      "master_server": "string",
      "slave_server": "string",
      "amq_version": "string",
      "unbound": "string",
      "dhcp": "string",
      "patch_level": "string",
      "zebra_version": "string",
      "nsd_version": "string",
      "dr_config": "string",
      "tims_dns_version": "string",
      "tims_dhcp_version": "string",
      "bgp_peers": "string"
    },
    {
      "name": "string",
      "id": "string",
      "type": "string",
      "ntp": "string",
      "bgp": "string",
      "ssh": "string",
      "snmp": "string",
      "snmp_trap": "string",
      "tacacs_servers": "string",
      "organization": "Internal",
      "bind": "string",
      "ipv4": "string",
      "master_z": 6,
      "slave_z": 6,
      "server_current_status": 8,
      "server_current_heartbeat": 6,
      "syslog_servers": "string",
      "last_updated": "string",
      "last_sync": "string",
      "ntp_servers": "string",
      "master_server": "string",
      "slave_server": "string",
      "amq_version": "string",
      "unbound": "string",
      "dhcp": "string",
      "patch_level": "string",
      "zebra_version": "string",
      "nsd_version": "string",
      "dr_config": "string",
      "tims_dns_version": "string",
      "tims_dhcp_version": "string",
      "bgp_peers": "string"
    },
    {
      "name": "string",
      "id": "string",
      "type": "string",
      "ntp": "string",
      "bgp": "string",
      "ssh": "string",
      "snmp": "string",
      "snmp_trap": "string",
      "tacacs_servers": "string",
      "organization": "Internal",
      "bind": "string",
      "ipv4": "string",
      "master_z": 2,
      "slave_z": 8,
      "server_current_status": 1,
      "server_current_heartbeat": 8,
      "syslog_servers": "string",
      "last_updated": "string",
      "last_sync": "string",
      "ntp_servers": "string",
      "master_server": "string",
      "slave_server": "string",
      "amq_version": "string",
      "unbound": "string",
      "dhcp": "string",
      "patch_level": "string",
      "zebra_version": "string",
      "nsd_version": "string",
      "dr_config": "string",
      "tims_dns_version": "string",
      "tims_dhcp_version": "string",
      "bgp_peers": "string"
    },
    {
      "name": "string",
      "id": "string",
      "type": "string",
      "ntp": "string",
      "bgp": "string",
      "ssh": "string",
      "snmp": "string",
      "snmp_trap": "string",
      "tacacs_servers": "string",
      "organization": "Internal",
      "bind": "string",
      "ipv4": "string",
      "master_z": 1,
      "slave_z": 3,
      "server_current_status": 3,
      "server_current_heartbeat": 9,
      "syslog_servers": "string",
      "last_updated": "string",
      "last_sync": "string",
      "ntp_servers": "string",
      "master_server": "string",
      "slave_server": "string",
      "amq_version": "string",
      "unbound": "string",
      "dhcp": "string",
      "patch_level": "string",
      "zebra_version": "string",
      "nsd_version": "string",
      "dr_config": "string",
      "tims_dns_version": "string",
      "tims_dhcp_version": "string",
      "bgp_peers": "string"
    },
    {
      "name": "string",
      "id": "string",
      "type": "string",
      "ntp": "string",
      "bgp": "string",
      "ssh": "string",
      "snmp": "string",
      "snmp_trap": "string",
      "tacacs_servers": "string",
      "organization": "Internal",
      "bind": "string",
      "ipv4": "string",
      "master_z": 1,
      "slave_z": 10,
      "server_current_status": 2,
      "server_current_heartbeat": 3,
      "syslog_servers": "string",
      "last_updated": "string",
      "last_sync": "string",
      "ntp_servers": "string",
      "master_server": "string",
      "slave_server": "string",
      "amq_version": "string",
      "unbound": "string",
      "dhcp": "string",
      "patch_level": "string",
      "zebra_version": "string",
      "nsd_version": "string",
      "dr_config": "string",
      "tims_dns_version": "string",
      "tims_dhcp_version": "string",
      "bgp_peers": "string"
    },
    {
      "name": "string",
      "id": "string",
      "type": "string",
      "ntp": "string",
      "bgp": "string",
      "ssh": "string",
      "snmp": "string",
      "snmp_trap": "string",
      "tacacs_servers": "string",
      "organization": "Internal",
      "bind": "string",
      "ipv4": "string",
      "master_z": 8,
      "slave_z": 3,
      "server_current_status": 6,
      "server_current_heartbeat": 6,
      "syslog_servers": "string",
      "last_updated": "string",
      "last_sync": "string",
      "ntp_servers": "string",
      "master_server": "string",
      "slave_server": "string",
      "amq_version": "string",
      "unbound": "string",
      "dhcp": "string",
      "patch_level": "string",
      "zebra_version": "string",
      "nsd_version": "string",
      "dr_config": "string",
      "tims_dns_version": "string",
      "tims_dhcp_version": "string",
      "bgp_peers": "string"
    }
  ]
}