{
  "id": 1,
  "oldName": "string",
  "name": "string",
  "addr1": 6,
  "addr2": 6,
  "addr3": 1,
  "addr4": 9,
  "address": "string",
  "startAddress": "string",
  "created_by": 1,
  "updated_by": 4,
  "server_name": "lisartx-est015-sl012",
  "server_id": 121,
  "email_check": 2,
  "snmp_check": 8,
  "percentageFull": 6,
  "reverse_zone_serial": 2016102800,
  "server_count": 10,
  "dmzVisible": "Yes/No",
  "zoneTemplateId": 41010,
  "zoneTemplateName": "ZoneTemp1",
  "dnssec_enable": "Yes/No",
  "nsec_option": "NSEC/NSEC3",
  "serialFormat": "NODATE/DATE",
  "created_time": "string",
  "updated_time": "string",
  "created_by_name": "string",
  "updated_by_name": "string",
  "created_by_login_name": "string",
  "updated_by_login_name": "string",
  "network_usage": "string",
  "enable_discovery": "Yes/No",
  "discoveryTemplateId": 41010,
  "discovery_template": "DiscoveryTemp1",
  "createRevZone": "Yes/No",
  "extensions": [
    {
      "name": "RITS_ID-1",
      "value": "Admin/Network/Subnet"
    },
    {
      "name": "RITS_ID-1",
      "value": "Admin/Network/Subnet"
    },
    {
      "name": "RITS_ID-1",
      "value": "Admin/Network/Subnet"
    },
    {
      "name": "RITS_ID-1",
      "value": "Admin/Network/Subnet"
    },
    {
      "name": "RITS_ID-1",
      "value": "Admin/Network/Subnet"
    },
    {
      "name": "RITS_ID-1",
      "value": "Admin/Network/Subnet"
    },
    {
      "name": "RITS_ID-1",
      "value": "Admin/Network/Subnet"
    },
    {
      "name": "RITS_ID-1",
      "value": "Admin/Network/Subnet"
    },
    {
      "name": "RITS_ID-1",
      "value": "Admin/Network/Subnet"
    },
    {
      "name": "RITS_ID-1",
      "value": "Admin/Network/Subnet"
    }
  ],
  "monitoringService": "string",
  "contact_name": "string",
  "first_name": "string",
  "middle_name": "string",
  "last_name": "string",
  "contact_email_id": "string",
  "contact_id": 3,
  "selectedMasterServer": "[BindAuth1, BindAuth2]",
  "selectedSlaveServer": "[NSD1,BindCache1]",
  "rrs": "[RR1, RR2]",
  "templateList": "[ZoneTemp1, ZoneTemp2]",
  "customTemplate": true,
  "mask_length": 6,
  "nw_mask_length": 10,
  "organization_id": 4,
  "organization_name": "string",
  "subnet_count": 10,
  "object_count": 4,
  "description": "string",
  "email_id": "admin@tcpwave.com",
  "percent_full": 8,
  "reverse_zone": "string",
  "updated_time_string": "string",
  "created_time_string": "string"
}