[
  {
    "id": 121,
    "server_name": "WIND-est015-sl09113",
    "windows_user_name": "Administrator",
    "password": "abc123",
    "server_ip": "10.1.10.45",
    "organization_name": "EARTH",
    "server_type": "MSDHCP",
    "isAlive": false,
    "description": "DNS appliance added by TCPWave IPAM by Professional Services.",
    "created_by": 2017,
    "created_time": "3/18/2016 3:39",
    "created_by_name": "Stephen",
    "created_time_string": "3/18/2016 3:39",
    "updated_by": 1145,
    "updated_time": "9/18/2018 4:37",
    "updated_by_name": "John",
    "updated_time_string": "3/18/2016 4:37",
    "httpsEnabled": 1,
    "old_server_ip": "10.0.1.8",
    "domain_name": "test.com",
    "newPassword": "abc1234"
  },
  {
    "id": 121,
    "server_name": "WIND-est015-sl09113",
    "windows_user_name": "Administrator",
    "password": "abc123",
    "server_ip": "10.1.10.45",
    "organization_name": "EARTH",
    "server_type": "MSDHCP",
    "isAlive": true,
    "description": "DNS appliance added by TCPWave IPAM by Professional Services.",
    "created_by": 2017,
    "created_time": "3/18/2016 3:39",
    "created_by_name": "Stephen",
    "created_time_string": "3/18/2016 3:39",
    "updated_by": 1145,
    "updated_time": "9/18/2018 4:37",
    "updated_by_name": "John",
    "updated_time_string": "3/18/2016 4:37",
    "httpsEnabled": 1,
    "old_server_ip": "10.0.1.8",
    "domain_name": "test.com",
    "newPassword": "abc1234"
  }
]