[
  {
    "id": 1,
    "name": "Subnet Group",
    "description": "SALES US Subnet Group",
    "organization_id": 1,
    "organization_name": "Internal",
    "bootp_id": 13,
    "option_template_id": 11,
    "policy_template_id": 2,
    "oldName": "Comm-Equipment",
    "updated_time": "3/18/2016 3:49",
    "updated_by_name": "admin",
    "created_by_name": "admin",
    "created_time": "3/18/2016 3:39",
    "updated_time_string": "3/18/2016 4:37",
    "created_time_string": "3/18/2016 4:37"
  },
  {
    "id": 1,
    "name": "Subnet Group",
    "description": "SALES US Subnet Group",
    "organization_id": 1,
    "organization_name": "Internal",
    "bootp_id": 13,
    "option_template_id": 11,
    "policy_template_id": 10,
    "oldName": "Comm-Equipment",
    "updated_time": "3/18/2016 3:49",
    "updated_by_name": "admin",
    "created_by_name": "admin",
    "created_time": "3/18/2016 3:39",
    "updated_time_string": "3/18/2016 4:37",
    "created_time_string": "3/18/2016 4:37"
  },
  {
    "id": 1,
    "name": "Subnet Group",
    "description": "SALES US Subnet Group",
    "organization_id": 1,
    "organization_name": "Internal",
    "bootp_id": 13,
    "option_template_id": 11,
    "policy_template_id": 6,
    "oldName": "Comm-Equipment",
    "updated_time": "3/18/2016 3:49",
    "updated_by_name": "admin",
    "created_by_name": "admin",
    "created_time": "3/18/2016 3:39",
    "updated_time_string": "3/18/2016 4:37",
    "created_time_string": "3/18/2016 4:37"
  },
  {
    "id": 1,
    "name": "Subnet Group",
    "description": "SALES US Subnet Group",
    "organization_id": 1,
    "organization_name": "Internal",
    "bootp_id": 13,
    "option_template_id": 11,
    "policy_template_id": 9,
    "oldName": "Comm-Equipment",
    "updated_time": "3/18/2016 3:49",
    "updated_by_name": "admin",
    "created_by_name": "admin",
    "created_time": "3/18/2016 3:39",
    "updated_time_string": "3/18/2016 4:37",
    "created_time_string": "3/18/2016 4:37"
  }
]