[
  {
    "id": 1,
    "oldName": "string",
    "name": "string",
    "addr1": 5,
    "addr2": 8,
    "addr3": 9,
    "addr4": 2,
    "address": "string",
    "startAddress": "string",
    "created_by": 5,
    "updated_by": 7,
    "server_name": "lisartx-est015-sl012",
    "server_id": 121,
    "email_check": 5,
    "snmp_check": 5,
    "percentageFull": 9,
    "reverse_zone_serial": 2016102800,
    "server_count": 3,
    "dmzVisible": "Yes/No",
    "zoneTemplateId": 41010,
    "zoneTemplateName": "ZoneTemp1",
    "dnssec_enable": "Yes/No",
    "nsec_option": "NSEC/NSEC3",
    "serialFormat": "NODATE/DATE",
    "created_time": "string",
    "updated_time": "string",
    "created_by_name": "string",
    "updated_by_name": "string",
    "created_by_login_name": "string",
    "updated_by_login_name": "string",
    "network_usage": "string",
    "enable_discovery": "Yes/No",
    "discoveryTemplateId": 41010,
    "discovery_template": "DiscoveryTemp1",
    "createRevZone": "Yes/No",
    "extensions": [
      {
        "name": "RITS_ID-1",
        "value": "Admin/Network/Subnet"
      },
      {
        "name": "RITS_ID-1",
        "value": "Admin/Network/Subnet"
      },
      {
        "name": "RITS_ID-1",
        "value": "Admin/Network/Subnet"
      },
      {
        "name": "RITS_ID-1",
        "value": "Admin/Network/Subnet"
      },
      {
        "name": "RITS_ID-1",
        "value": "Admin/Network/Subnet"
      },
      {
        "name": "RITS_ID-1",
        "value": "Admin/Network/Subnet"
      }
    ],
    "monitoringService": "string",
    "contact_name": "string",
    "first_name": "string",
    "middle_name": "string",
    "last_name": "string",
    "contact_email_id": "string",
    "contact_id": 2,
    "selectedMasterServer": "[BindAuth1, BindAuth2]",
    "selectedSlaveServer": "[NSD1,BindCache1]",
    "rrs": "[RR1, RR2]",
    "templateList": "[ZoneTemp1, ZoneTemp2]",
    "customTemplate": false,
    "mask_length": 9,
    "nw_mask_length": 6,
    "organization_id": 1,
    "organization_name": "string",
    "subnet_count": 3,
    "object_count": 8,
    "description": "string",
    "email_id": "admin@tcpwave.com",
    "percent_full": 3,
    "reverse_zone": "string",
    "updated_time_string": "string",
    "created_time_string": "string"
  },
  {
    "id": 5,
    "oldName": "string",
    "name": "string",
    "addr1": 1,
    "addr2": 4,
    "addr3": 4,
    "addr4": 2,
    "address": "string",
    "startAddress": "string",
    "created_by": 6,
    "updated_by": 5,
    "server_name": "lisartx-est015-sl012",
    "server_id": 121,
    "email_check": 4,
    "snmp_check": 9,
    "percentageFull": 1,
    "reverse_zone_serial": 2016102800,
    "server_count": 6,
    "dmzVisible": "Yes/No",
    "zoneTemplateId": 41010,
    "zoneTemplateName": "ZoneTemp1",
    "dnssec_enable": "Yes/No",
    "nsec_option": "NSEC/NSEC3",
    "serialFormat": "NODATE/DATE",
    "created_time": "string",
    "updated_time": "string",
    "created_by_name": "string",
    "updated_by_name": "string",
    "created_by_login_name": "string",
    "updated_by_login_name": "string",
    "network_usage": "string",
    "enable_discovery": "Yes/No",
    "discoveryTemplateId": 41010,
    "discovery_template": "DiscoveryTemp1",
    "createRevZone": "Yes/No",
    "extensions": [
      {
        "name": "RITS_ID-1",
        "value": "Admin/Network/Subnet"
      },
      {
        "name": "RITS_ID-1",
        "value": "Admin/Network/Subnet"
      },
      {
        "name": "RITS_ID-1",
        "value": "Admin/Network/Subnet"
      }
    ],
    "monitoringService": "string",
    "contact_name": "string",
    "first_name": "string",
    "middle_name": "string",
    "last_name": "string",
    "contact_email_id": "string",
    "contact_id": 2,
    "selectedMasterServer": "[BindAuth1, BindAuth2]",
    "selectedSlaveServer": "[NSD1,BindCache1]",
    "rrs": "[RR1, RR2]",
    "templateList": "[ZoneTemp1, ZoneTemp2]",
    "customTemplate": false,
    "mask_length": 8,
    "nw_mask_length": 2,
    "organization_id": 9,
    "organization_name": "string",
    "subnet_count": 7,
    "object_count": 3,
    "description": "string",
    "email_id": "admin@tcpwave.com",
    "percent_full": 9,
    "reverse_zone": "string",
    "updated_time_string": "string",
    "created_time_string": "string"
  }
]