[
  {
    "applianceName": "string",
    "applianceIp": "string",
    "applianceType": "string",
    "dnsGroups": "string",
    "dhcpGroups": "string",
    "dnsCriticalConfigChecks": 5,
    "dhcpCriticalConfigChecks": 3,
    "dnsOkConfigChecks": 10,
    "dhcpOkConfigChecks": 7,
    "dnsCriticalAlerts": 8,
    "dnsOkAlerts": 6,
    "dnsWarningAlerts": 7,
    "dhcpCriticalAlerts": 3,
    "dhcpOkAlerts": 3,
    "dhcpWarningAlerts": 2,
    "commonConfigChecks": 9,
    "dnsHeartbeat": false,
    "dhcpHeartbeat": false,
    "dnsId": 3,
    "dhcpId": 3,
    "criticalConfigChecks": 10,
    "okConfigChecks": 4,
    "criticalAlerts": 4,
    "okAlerts": 2,
    "warningAlerts": 2,
    "heartbeat": false
  }
]