{
  "objectName": "AWS172311623",
  "objectAddress": "10.31.16.23",
  "objectId": 501,
  "subnetAddress": "10.31.16.0",
  "templateId": 101,
  "templateName": "AWS-Instance-Provisioning-Template",
  "organizationId": 1,
  "organizationName": "Internal",
  "status": "RUNING",
  "publicIP": "string",
  "dnsName": "AWS172311623.test.com",
  "providerTemplate": {
    "name": "AWS-Instance-Provisioning-Template",
    "newName": "Default-AWS-Instance-Provisioning-Template",
    "id": 101,
    "organizationName": "Internal",
    "organizationId": 1,
    "cloudProviderType": "AWS",
    "cloudProviderName": "AWS-Provider",
    "cloudProviderId": 21,
    "instanceTmplJsonStr": "'{\"zone\":\"us-east1-b\",\"machineType\":\"f1-micro\",\"bootDiskImageFamily\":\"centos\",\"bootDiskImage\":\"centos-6-v20180401\",\"nonDepricatedImage\":true,\"bootDiskType\":\"pd-standard\",\"bootDiskSize\":\"10\",\"bootDiskAutoDelete\":true,\"allowHttpTraffic\":true,\"allowHttpsTraffic\":true}'",
    "description": "AWS Instance template test",
    "created_by_name": "admin",
    "updated_by": 21,
    "updated_by_name": "admin",
    "created_time_string": "2019-03-13 03:16:04",
    "updated_time_string": "2019-03-16 05:26:05"
  }
}