{
  "total": 20,
  "recordsTotal": 40,
  "recordsFiltered": 40,
  "data": [
    {
      "id": 121,
      "name": "Admin-group-1",
      "oldName": "Admin-group",
      "description": "Admin group description",
      "organization_id": 111,
      "organization_name": "TCPWave",
      "updated_time": "1479201874000",
      "updated_by_name": "admin1",
      "created_by_name": "admin2",
      "created_time": "1479201867000",
      "updated_time_string": "12/15/2016 7:14:17",
      "created_time_string": "11/15/2016 6:04:15"
    },
    {
      "id": 121,
      "name": "Admin-group-1",
      "oldName": "Admin-group",
      "description": "Admin group description",
      "organization_id": 111,
      "organization_name": "TCPWave",
      "updated_time": "1479201874000",
      "updated_by_name": "admin1",
      "created_by_name": "admin2",
      "created_time": "1479201867000",
      "updated_time_string": "12/15/2016 7:14:17",
      "created_time_string": "11/15/2016 6:04:15"
    },
    {
      "id": 121,
      "name": "Admin-group-1",
      "oldName": "Admin-group",
      "description": "Admin group description",
      "organization_id": 111,
      "organization_name": "TCPWave",
      "updated_time": "1479201874000",
      "updated_by_name": "admin1",
      "created_by_name": "admin2",
      "created_time": "1479201867000",
      "updated_time_string": "12/15/2016 7:14:17",
      "created_time_string": "11/15/2016 6:04:15"
    }
  ]
}