{
  "actions": [
    {
      "name": "postClouddnsproviderEdit",
      "protocol": "REST",
      "method": "POST",
      "entitypath": "{base_path}/{version}/clouddnsprovider/edit?{query}",
      "requestSchema": "schema.json",
      "responseSchema": "schema.json",
      "timeout": 0,
      "sendEmpty": false,
      "sendGetBody": false,
      "requestDatatype": "JSON",
      "responseDatatype": "JSON",
      "headers": {},
      "responseObjects": [
        {
          "type": "default",
          "key": "",
          "mockFile": ""
        }
      ]
    },
    {
      "name": "updateTemplate",
      "protocol": "REST",
      "method": "POST",
      "entitypath": "{base_path}/{version}/clouddnsprovider/update_template?{query}",
      "requestSchema": "schema.json",
      "responseSchema": "schema.json",
      "timeout": 0,
      "sendEmpty": false,
      "sendGetBody": false,
      "requestDatatype": "JSON",
      "responseDatatype": "JSON",
      "headers": {},
      "responseObjects": [
        {
          "type": "default",
          "key": "",
          "mockFile": ""
        }
      ]
    },
    {
      "name": "removePermission",
      "protocol": "REST",
      "method": "POST",
      "entitypath": "{base_path}/{version}/clouddnsprovider/disassociate?{query}",
      "requestSchema": "schema.json",
      "responseSchema": "schema.json",
      "timeout": 0,
      "sendEmpty": false,
      "sendGetBody": false,
      "requestDatatype": "JSON",
      "responseDatatype": "JSON",
      "headers": {},
      "responseObjects": [
        {
          "type": "default",
          "key": "",
          "mockFile": ""
        }
      ]
    },
    {
      "name": "listProviderTemplates",
      "protocol": "REST",
      "method": "GET",
      "entitypath": "{base_path}/{version}/clouddnsprovider/list_provider_templates?{query}",
      "requestSchema": "schema.json",
      "responseSchema": "schema.json",
      "timeout": 0,
      "sendEmpty": false,
      "sendGetBody": false,
      "requestDatatype": "JSON",
      "responseDatatype": "JSON",
      "headers": {},
      "responseObjects": [
        {
          "type": "default",
          "key": "",
          "mockFile": "mockdatafiles/listProviderTemplates-default.json"
        }
      ]
    },
    {
      "name": "listProviderTypes",
      "protocol": "REST",
      "method": "GET",
      "entitypath": "{base_path}/{version}/clouddnsprovider/list_provider_types?{query}",
      "requestSchema": "schema.json",
      "responseSchema": "schema.json",
      "timeout": 0,
      "sendEmpty": false,
      "sendGetBody": false,
      "requestDatatype": "JSON",
      "responseDatatype": "JSON",
      "headers": {},
      "responseObjects": [
        {
          "type": "default",
          "key": "",
          "mockFile": "mockdatafiles/listProviderTypes-default.json"
        }
      ]
    },
    {
      "name": "cloudPPage",
      "protocol": "REST",
      "method": "GET",
      "entitypath": "{base_path}/{version}/clouddnsprovider/search?{query}",
      "requestSchema": "schema.json",
      "responseSchema": "schema.json",
      "timeout": 0,
      "sendEmpty": false,
      "sendGetBody": false,
      "requestDatatype": "JSON",
      "responseDatatype": "JSON",
      "headers": {},
      "responseObjects": [
        {
          "type": "default",
          "key": "",
          "mockFile": "mockdatafiles/cloudPPage-default.json"
        }
      ]
    },
    {
      "name": "searchCloudPReferences",
      "protocol": "REST",
      "method": "GET",
      "entitypath": "{base_path}/{version}/clouddnsprovider/references?{query}",
      "requestSchema": "schema.json",
      "responseSchema": "schema.json",
      "timeout": 0,
      "sendEmpty": false,
      "sendGetBody": false,
      "requestDatatype": "JSON",
      "responseDatatype": "JSON",
      "headers": {},
      "responseObjects": [
        {
          "type": "default",
          "key": "",
          "mockFile": ""
        }
      ]
    },
    {
      "name": "getCloudProvider",
      "protocol": "REST",
      "method": "GET",
      "entitypath": "{base_path}/{version}/clouddnsprovider/get?{query}",
      "requestSchema": "schema.json",
      "responseSchema": "schema.json",
      "timeout": 0,
      "sendEmpty": false,
      "sendGetBody": false,
      "requestDatatype": "JSON",
      "responseDatatype": "JSON",
      "headers": {},
      "responseObjects": [
        {
          "type": "default",
          "key": "",
          "mockFile": "mockdatafiles/getCloudProvider-default.json"
        }
      ]
    },
    {
      "name": "add",
      "protocol": "REST",
      "method": "POST",
      "entitypath": "{base_path}/{version}/clouddnsprovider/add?{query}",
      "requestSchema": "schema.json",
      "responseSchema": "schema.json",
      "timeout": 0,
      "sendEmpty": false,
      "sendGetBody": false,
      "requestDatatype": "JSON",
      "responseDatatype": "JSON",
      "headers": {},
      "responseObjects": [
        {
          "type": "default",
          "key": "",
          "mockFile": ""
        }
      ]
    },
    {
      "name": "getClouddnsproviderList",
      "protocol": "REST",
      "method": "GET",
      "entitypath": "{base_path}/{version}/clouddnsprovider/list?{query}",
      "requestSchema": "schema.json",
      "responseSchema": "schema.json",
      "timeout": 0,
      "sendEmpty": false,
      "sendGetBody": false,
      "requestDatatype": "JSON",
      "responseDatatype": "JSON",
      "headers": {},
      "responseObjects": [
        {
          "type": "default",
          "key": "",
          "mockFile": "mockdatafiles/getClouddnsproviderList-default.json"
        }
      ]
    },
    {
      "name": "postClouddnsproviderDelete",
      "protocol": "REST",
      "method": "POST",
      "entitypath": "{base_path}/{version}/clouddnsprovider/delete?{query}",
      "requestSchema": "schema.json",
      "responseSchema": "schema.json",
      "timeout": 0,
      "sendEmpty": false,
      "sendGetBody": false,
      "requestDatatype": "JSON",
      "responseDatatype": "JSON",
      "headers": {},
      "responseObjects": [
        {
          "type": "default",
          "key": "",
          "mockFile": ""
        }
      ]
    }
  ]
}