{
  "min": "string",
  "max": "string",
  "avg": "string",
  "tx": "string",
  "rx": "string",
  "loss": "string",
  "hops": [
    {
      "index": 4,
      "host": "string",
      "ip": "string",
      "time": "string",
      "lost": "string"
    },
    {
      "index": 10,
      "host": "string",
      "ip": "string",
      "time": "string",
      "lost": "string"
    },
    {
      "index": 4,
      "host": "string",
      "ip": "string",
      "time": "string",
      "lost": "string"
    },
    {
      "index": 7,
      "host": "string",
      "ip": "string",
      "time": "string",
      "lost": "string"
    },
    {
      "index": 7,
      "host": "string",
      "ip": "string",
      "time": "string",
      "lost": "string"
    },
    {
      "index": 4,
      "host": "string",
      "ip": "string",
      "time": "string",
      "lost": "string"
    },
    {
      "index": 6,
      "host": "string",
      "ip": "string",
      "time": "string",
      "lost": "string"
    },
    {
      "index": 10,
      "host": "string",
      "ip": "string",
      "time": "string",
      "lost": "string"
    }
  ]
}