{
  "nicDevice": "eth0",
  "nicType": "Ethernet",
  "nicOnboot": "yes/no",
  "nicNM_controlled": "none",
  "nicBootproto": "none",
  "ipv6Init": "fe80::a00:27ff:fecd:c5de",
  "ipv4Addr": "192.168.0.105",
  "gateway": "192.168.0.1",
  "ipv6Addr": "2000::2",
  "ipv6DefaultGw": "2000::1",
  "netMask": "255.255.255.0",
  "broadCast": "192.168.0.255",
  "nicNetwork": "192.168.0.0",
  "nicHwaddr": "08:00:27:cd:c5:de",
  "master": "bond0",
  "slave": "yes/no",
  "bond_mode": "string",
  "isMgmtInterface": false,
  "serverName": "remote-1",
  "serverIP": "192.168.0.105",
  "serverType": "BIND AUTH",
  "nicJSON": "string"
}