[
  {
    "id": 1,
    "name": "cardsprod",
    "newName": "eurprod",
    "description": "Access Control List for the cardsprod.",
    "special": "TRUE",
    "value": "10.1.10.172",
    "refAclName": "cardsprod",
    "sequence": 2,
    "exclude": "10.0.0.0/24",
    "aclDataList": "[(name = cardsmig, value = 10.0.0.0, exclude = no, sequence = 1)]",
    "aclElementList": "[10.0.0.1,10.0.0.3,any]",
    "referenceCount": 3,
    "created_by": 2017,
    "created_by_name": "Stephen",
    "created_time": "3/18/2016 4:37",
    "updated_by": 2019,
    "updated_by_name": "John",
    "updated_time": "3/18/2016 4:37",
    "updated_time_string": "3/18/2016 3:39",
    "created_time_string": "3/18/2016 3:39",
    "created_by_login_name": "Stephen",
    "updated_by_login_name": "John"
  },
  {
    "id": 1,
    "name": "cardsprod",
    "newName": "eurprod",
    "description": "Access Control List for the cardsprod.",
    "special": "TRUE",
    "value": "10.1.10.172",
    "refAclName": "cardsprod",
    "sequence": 2,
    "exclude": "10.0.0.0/24",
    "aclDataList": "[(name = cardsmig, value = 10.0.0.0, exclude = no, sequence = 1)]",
    "aclElementList": "[10.0.0.1,10.0.0.3,any]",
    "referenceCount": 3,
    "created_by": 2017,
    "created_by_name": "Stephen",
    "created_time": "3/18/2016 4:37",
    "updated_by": 2019,
    "updated_by_name": "John",
    "updated_time": "3/18/2016 4:37",
    "updated_time_string": "3/18/2016 3:39",
    "created_time_string": "3/18/2016 3:39",
    "created_by_login_name": "Stephen",
    "updated_by_login_name": "John"
  }
]