[
  {
    "addr1": 4,
    "addr2": 3,
    "addr3": 3,
    "addr4": 8,
    "address": "172.16.13.5",
    "organization_name": "Internal",
    "domain_name": "domain.com",
    "subnet_address": "10.0.0.0/24",
    "network_address": "172.16.13.0",
    "class_code": "string",
    "mac": "aa:bb:cc:ddd:ee:ff",
    "model_type": "string",
    "serial_num": "string",
    "description": "string",
    "contact_name": "string",
    "contact_first_name": "string",
    "contact_middle_name": "string",
    "contact_last_name": "string",
    "contact_email_id": "abc@gmail.com",
    "location_name": "abcdef",
    "street1": "abc",
    "street2": "def",
    "city": "zxcv",
    "state": "asdf",
    "zip": "50000",
    "country": "xyza",
    "name": "timsobject",
    "ttl": 1200,
    "option_template_name": "dhcp_option",
    "alias": "zxcvb",
    "alloc_type": "Static/Manual/Dynamic/Reserved etc",
    "alloc_type_desc": "Static/Dynamic/Manual/Auto/Reserved",
    "update_ns_a": false,
    "update_ns_ptr": true,
    "dyn_update_rrs_a": false,
    "dyn_update_rrs_ptr": false,
    "dyn_update_rrs_cname": false,
    "dyn_update_rrs_mx": false,
    "isDeleterrsChecked": "0 or 1",
    "rrs": [
      {
        "id": 39447,
        "owner": "www.converge.com",
        "rrclass": "IN ",
        "rrtype": "CNAME",
        "ttl": 1200,
        "data": "string",
        "description": "Zone RR migrated to TCPWave IPAM by Professional Services.",
        "ipAddr": "192.168.1.43",
        "domain_id": 135978,
        "domain": "converge.com",
        "updated_by": "2019",
        "updated_time": "3/18/2016 4:37",
        "created_by": "2017",
        "created_time": "3/18/2016 3:39",
        "name": "cons.atcc.com.",
        "is_ad_rr": "No",
        "subnet_id": 318534,
        "network_id": 7939,
        "subnet_address": "10.10.0.0",
        "organization_id": 990,
        "organization_name": "EARTH",
        "is_external_rr": "No",
        "proxy": 1,
        "view_id": 21,
        "view_name": "Moscow",
        "viewList": "[Internal, Moscow]",
        "updated_time_string": "3/18/2016 4:37",
        "created_time_string": "3/18/2016 4:37",
        "created_by_login_name": "Stephen",
        "updated_by_login_name": "Stephen",
        "mask": 28,
        "extensions": [
          {
            "name": "RITS_ID-1",
            "value": "Admin/Network/Subnet"
          },
          {
            "name": "RITS_ID-1",
            "value": "Admin/Network/Subnet"
          },
          {
            "name": "RITS_ID-1",
            "value": "Admin/Network/Subnet"
          },
          {
            "name": "RITS_ID-1",
            "value": "Admin/Network/Subnet"
          }
        ],
        "zoneName": "atcc.com",
        "networkAddress": "10.0.0.0"
      },
      {
        "id": 39447,
        "owner": "www.converge.com",
        "rrclass": "IN ",
        "rrtype": "CNAME",
        "ttl": 1200,
        "data": "string",
        "description": "Zone RR migrated to TCPWave IPAM by Professional Services.",
        "ipAddr": "192.168.1.43",
        "domain_id": 135978,
        "domain": "converge.com",
        "updated_by": "2019",
        "updated_time": "3/18/2016 4:37",
        "created_by": "2017",
        "created_time": "3/18/2016 3:39",
        "name": "cons.atcc.com.",
        "is_ad_rr": "No",
        "subnet_id": 318534,
        "network_id": 7939,
        "subnet_address": "10.10.0.0",
        "organization_id": 990,
        "organization_name": "EARTH",
        "is_external_rr": "No",
        "proxy": 1,
        "view_id": 21,
        "view_name": "Moscow",
        "viewList": "[Internal, Moscow]",
        "updated_time_string": "3/18/2016 4:37",
        "created_time_string": "3/18/2016 4:37",
        "created_by_login_name": "Stephen",
        "updated_by_login_name": "Stephen",
        "mask": 28,
        "extensions": [
          {
            "name": "RITS_ID-1",
            "value": "Admin/Network/Subnet"
          },
          {
            "name": "RITS_ID-1",
            "value": "Admin/Network/Subnet"
          },
          {
            "name": "RITS_ID-1",
            "value": "Admin/Network/Subnet"
          },
          {
            "name": "RITS_ID-1",
            "value": "Admin/Network/Subnet"
          },
          {
            "name": "RITS_ID-1",
            "value": "Admin/Network/Subnet"
          },
          {
            "name": "RITS_ID-1",
            "value": "Admin/Network/Subnet"
          },
          {
            "name": "RITS_ID-1",
            "value": "Admin/Network/Subnet"
          },
          {
            "name": "RITS_ID-1",
            "value": "Admin/Network/Subnet"
          },
          {
            "name": "RITS_ID-1",
            "value": "Admin/Network/Subnet"
          }
        ],
        "zoneName": "atcc.com",
        "networkAddress": "10.0.0.0"
      },
      {
        "id": 39447,
        "owner": "www.converge.com",
        "rrclass": "IN ",
        "rrtype": "CNAME",
        "ttl": 1200,
        "data": "string",
        "description": "Zone RR migrated to TCPWave IPAM by Professional Services.",
        "ipAddr": "192.168.1.43",
        "domain_id": 135978,
        "domain": "converge.com",
        "updated_by": "2019",
        "updated_time": "3/18/2016 4:37",
        "created_by": "2017",
        "created_time": "3/18/2016 3:39",
        "name": "cons.atcc.com.",
        "is_ad_rr": "No",
        "subnet_id": 318534,
        "network_id": 7939,
        "subnet_address": "10.10.0.0",
        "organization_id": 990,
        "organization_name": "EARTH",
        "is_external_rr": "No",
        "proxy": 1,
        "view_id": 21,
        "view_name": "Moscow",
        "viewList": "[Internal, Moscow]",
        "updated_time_string": "3/18/2016 4:37",
        "created_time_string": "3/18/2016 4:37",
        "created_by_login_name": "Stephen",
        "updated_by_login_name": "Stephen",
        "mask": 28,
        "extensions": [
          {
            "name": "RITS_ID-1",
            "value": "Admin/Network/Subnet"
          },
          {
            "name": "RITS_ID-1",
            "value": "Admin/Network/Subnet"
          }
        ],
        "zoneName": "atcc.com",
        "networkAddress": "10.0.0.0"
      },
      {
        "id": 39447,
        "owner": "www.converge.com",
        "rrclass": "IN ",
        "rrtype": "CNAME",
        "ttl": 1200,
        "data": "string",
        "description": "Zone RR migrated to TCPWave IPAM by Professional Services.",
        "ipAddr": "192.168.1.43",
        "domain_id": 135978,
        "domain": "converge.com",
        "updated_by": "2019",
        "updated_time": "3/18/2016 4:37",
        "created_by": "2017",
        "created_time": "3/18/2016 3:39",
        "name": "cons.atcc.com.",
        "is_ad_rr": "No",
        "subnet_id": 318534,
        "network_id": 7939,
        "subnet_address": "10.10.0.0",
        "organization_id": 990,
        "organization_name": "EARTH",
        "is_external_rr": "No",
        "proxy": 1,
        "view_id": 21,
        "view_name": "Moscow",
        "viewList": "[Internal, Moscow]",
        "updated_time_string": "3/18/2016 4:37",
        "created_time_string": "3/18/2016 4:37",
        "created_by_login_name": "Stephen",
        "updated_by_login_name": "Stephen",
        "mask": 28,
        "extensions": [
          {
            "name": "RITS_ID-1",
            "value": "Admin/Network/Subnet"
          },
          {
            "name": "RITS_ID-1",
            "value": "Admin/Network/Subnet"
          },
          {
            "name": "RITS_ID-1",
            "value": "Admin/Network/Subnet"
          },
          {
            "name": "RITS_ID-1",
            "value": "Admin/Network/Subnet"
          },
          {
            "name": "RITS_ID-1",
            "value": "Admin/Network/Subnet"
          },
          {
            "name": "RITS_ID-1",
            "value": "Admin/Network/Subnet"
          },
          {
            "name": "RITS_ID-1",
            "value": "Admin/Network/Subnet"
          }
        ],
        "zoneName": "atcc.com",
        "networkAddress": "10.0.0.0"
      },
      {
        "id": 39447,
        "owner": "www.converge.com",
        "rrclass": "IN ",
        "rrtype": "CNAME",
        "ttl": 1200,
        "data": "string",
        "description": "Zone RR migrated to TCPWave IPAM by Professional Services.",
        "ipAddr": "192.168.1.43",
        "domain_id": 135978,
        "domain": "converge.com",
        "updated_by": "2019",
        "updated_time": "3/18/2016 4:37",
        "created_by": "2017",
        "created_time": "3/18/2016 3:39",
        "name": "cons.atcc.com.",
        "is_ad_rr": "No",
        "subnet_id": 318534,
        "network_id": 7939,
        "subnet_address": "10.10.0.0",
        "organization_id": 990,
        "organization_name": "EARTH",
        "is_external_rr": "No",
        "proxy": 1,
        "view_id": 21,
        "view_name": "Moscow",
        "viewList": "[Internal, Moscow]",
        "updated_time_string": "3/18/2016 4:37",
        "created_time_string": "3/18/2016 4:37",
        "created_by_login_name": "Stephen",
        "updated_by_login_name": "Stephen",
        "mask": 28,
        "extensions": [
          {
            "name": "RITS_ID-1",
            "value": "Admin/Network/Subnet"
          },
          {
            "name": "RITS_ID-1",
            "value": "Admin/Network/Subnet"
          },
          {
            "name": "RITS_ID-1",
            "value": "Admin/Network/Subnet"
          },
          {
            "name": "RITS_ID-1",
            "value": "Admin/Network/Subnet"
          },
          {
            "name": "RITS_ID-1",
            "value": "Admin/Network/Subnet"
          }
        ],
        "zoneName": "atcc.com",
        "networkAddress": "10.0.0.0"
      },
      {
        "id": 39447,
        "owner": "www.converge.com",
        "rrclass": "IN ",
        "rrtype": "CNAME",
        "ttl": 1200,
        "data": "string",
        "description": "Zone RR migrated to TCPWave IPAM by Professional Services.",
        "ipAddr": "192.168.1.43",
        "domain_id": 135978,
        "domain": "converge.com",
        "updated_by": "2019",
        "updated_time": "3/18/2016 4:37",
        "created_by": "2017",
        "created_time": "3/18/2016 3:39",
        "name": "cons.atcc.com.",
        "is_ad_rr": "No",
        "subnet_id": 318534,
        "network_id": 7939,
        "subnet_address": "10.10.0.0",
        "organization_id": 990,
        "organization_name": "EARTH",
        "is_external_rr": "No",
        "proxy": 1,
        "view_id": 21,
        "view_name": "Moscow",
        "viewList": "[Internal, Moscow]",
        "updated_time_string": "3/18/2016 4:37",
        "created_time_string": "3/18/2016 4:37",
        "created_by_login_name": "Stephen",
        "updated_by_login_name": "Stephen",
        "mask": 28,
        "extensions": [
          {
            "name": "RITS_ID-1",
            "value": "Admin/Network/Subnet"
          },
          {
            "name": "RITS_ID-1",
            "value": "Admin/Network/Subnet"
          },
          {
            "name": "RITS_ID-1",
            "value": "Admin/Network/Subnet"
          },
          {
            "name": "RITS_ID-1",
            "value": "Admin/Network/Subnet"
          },
          {
            "name": "RITS_ID-1",
            "value": "Admin/Network/Subnet"
          },
          {
            "name": "RITS_ID-1",
            "value": "Admin/Network/Subnet"
          },
          {
            "name": "RITS_ID-1",
            "value": "Admin/Network/Subnet"
          }
        ],
        "zoneName": "atcc.com",
        "networkAddress": "10.0.0.0"
      },
      {
        "id": 39447,
        "owner": "www.converge.com",
        "rrclass": "IN ",
        "rrtype": "CNAME",
        "ttl": 1200,
        "data": "string",
        "description": "Zone RR migrated to TCPWave IPAM by Professional Services.",
        "ipAddr": "192.168.1.43",
        "domain_id": 135978,
        "domain": "converge.com",
        "updated_by": "2019",
        "updated_time": "3/18/2016 4:37",
        "created_by": "2017",
        "created_time": "3/18/2016 3:39",
        "name": "cons.atcc.com.",
        "is_ad_rr": "No",
        "subnet_id": 318534,
        "network_id": 7939,
        "subnet_address": "10.10.0.0",
        "organization_id": 990,
        "organization_name": "EARTH",
        "is_external_rr": "No",
        "proxy": 1,
        "view_id": 21,
        "view_name": "Moscow",
        "viewList": "[Internal, Moscow]",
        "updated_time_string": "3/18/2016 4:37",
        "created_time_string": "3/18/2016 4:37",
        "created_by_login_name": "Stephen",
        "updated_by_login_name": "Stephen",
        "mask": 28,
        "extensions": [
          {
            "name": "RITS_ID-1",
            "value": "Admin/Network/Subnet"
          },
          {
            "name": "RITS_ID-1",
            "value": "Admin/Network/Subnet"
          },
          {
            "name": "RITS_ID-1",
            "value": "Admin/Network/Subnet"
          },
          {
            "name": "RITS_ID-1",
            "value": "Admin/Network/Subnet"
          },
          {
            "name": "RITS_ID-1",
            "value": "Admin/Network/Subnet"
          },
          {
            "name": "RITS_ID-1",
            "value": "Admin/Network/Subnet"
          },
          {
            "name": "RITS_ID-1",
            "value": "Admin/Network/Subnet"
          }
        ],
        "zoneName": "atcc.com",
        "networkAddress": "10.0.0.0"
      },
      {
        "id": 39447,
        "owner": "www.converge.com",
        "rrclass": "IN ",
        "rrtype": "CNAME",
        "ttl": 1200,
        "data": "string",
        "description": "Zone RR migrated to TCPWave IPAM by Professional Services.",
        "ipAddr": "192.168.1.43",
        "domain_id": 135978,
        "domain": "converge.com",
        "updated_by": "2019",
        "updated_time": "3/18/2016 4:37",
        "created_by": "2017",
        "created_time": "3/18/2016 3:39",
        "name": "cons.atcc.com.",
        "is_ad_rr": "No",
        "subnet_id": 318534,
        "network_id": 7939,
        "subnet_address": "10.10.0.0",
        "organization_id": 990,
        "organization_name": "EARTH",
        "is_external_rr": "No",
        "proxy": 1,
        "view_id": 21,
        "view_name": "Moscow",
        "viewList": "[Internal, Moscow]",
        "updated_time_string": "3/18/2016 4:37",
        "created_time_string": "3/18/2016 4:37",
        "created_by_login_name": "Stephen",
        "updated_by_login_name": "Stephen",
        "mask": 28,
        "extensions": [
          {
            "name": "RITS_ID-1",
            "value": "Admin/Network/Subnet"
          },
          {
            "name": "RITS_ID-1",
            "value": "Admin/Network/Subnet"
          },
          {
            "name": "RITS_ID-1",
            "value": "Admin/Network/Subnet"
          },
          {
            "name": "RITS_ID-1",
            "value": "Admin/Network/Subnet"
          }
        ],
        "zoneName": "atcc.com",
        "networkAddress": "10.0.0.0"
      }
    ],
    "created_by_name": "John",
    "updated_by_name": "qwert",
    "updated_time": "12:10:50 11-28-2018",
    "dhcp_server": "string",
    "created_by_login_name": "John",
    "updated_by_login_name": "John",
    "viewName": "viewname",
    "extensions": [
      {
        "name": "RITS_ID-1",
        "value": "Admin/Network/Subnet"
      },
      {
        "name": "RITS_ID-1",
        "value": "Admin/Network/Subnet"
      }
    ],
    "cloudAttributes": {},
    "cloudExtensions": [
      {
        "name": "RITS_ID-1",
        "value": "Admin/Network/Subnet"
      },
      {
        "name": "RITS_ID-1",
        "value": "Admin/Network/Subnet"
      },
      {
        "name": "RITS_ID-1",
        "value": "Admin/Network/Subnet"
      },
      {
        "name": "RITS_ID-1",
        "value": "Admin/Network/Subnet"
      },
      {
        "name": "RITS_ID-1",
        "value": "Admin/Network/Subnet"
      },
      {
        "name": "RITS_ID-1",
        "value": "Admin/Network/Subnet"
      },
      {
        "name": "RITS_ID-1",
        "value": "Admin/Network/Subnet"
      },
      {
        "name": "RITS_ID-1",
        "value": "Admin/Network/Subnet"
      },
      {
        "name": "RITS_ID-1",
        "value": "Admin/Network/Subnet"
      }
    ],
    "switchName": "switch1",
    "isRenew": "string",
    "operation": "add/edit/delete",
    "deletedRRs": "[RR1, RR2]",
    "addedRRs": "[RR3, RR4]",
    "viewList": [
      {
        "id": 1,
        "name": "internal",
        "newName": "external",
        "matchClients": "[ACL1, ACL2, ACL3]",
        "matchDestinations": "[ACL1, ACL2, ACL3]",
        "matchClientsValue": "localhost;10.0.0.0/16",
        "matchDestinationsValue": "localhost;10.0.0.0/16",
        "organizationId": 1,
        "organizationName": "TCPWave",
        "createdBy": 1,
        "createdByName": "User1",
        "updatedBy": 1,
        "updatedByName": "1",
        "createdTime": "10/1/2016",
        "updatedTime": "10/2/2016",
        "createdTimeString": "10/1/2016 6:57",
        "updatedTimeString": "10/1/2016 6:57",
        "created_by_login_name": "string",
        "updated_by_login_name": "string",
        "sequence": 1,
        "geoType": "string",
        "matchGeoClients": "string",
        "matchGeoDestinations": "string"
      },
      {
        "id": 1,
        "name": "internal",
        "newName": "external",
        "matchClients": "[ACL1, ACL2, ACL3]",
        "matchDestinations": "[ACL1, ACL2, ACL3]",
        "matchClientsValue": "localhost;10.0.0.0/16",
        "matchDestinationsValue": "localhost;10.0.0.0/16",
        "organizationId": 1,
        "organizationName": "TCPWave",
        "createdBy": 1,
        "createdByName": "User1",
        "updatedBy": 1,
        "updatedByName": "1",
        "createdTime": "10/1/2016",
        "updatedTime": "10/2/2016",
        "createdTimeString": "10/1/2016 6:57",
        "updatedTimeString": "10/1/2016 6:57",
        "created_by_login_name": "string",
        "updated_by_login_name": "string",
        "sequence": 1,
        "geoType": "string",
        "matchGeoClients": "string",
        "matchGeoDestinations": "string"
      },
      {
        "id": 1,
        "name": "internal",
        "newName": "external",
        "matchClients": "[ACL1, ACL2, ACL3]",
        "matchDestinations": "[ACL1, ACL2, ACL3]",
        "matchClientsValue": "localhost;10.0.0.0/16",
        "matchDestinationsValue": "localhost;10.0.0.0/16",
        "organizationId": 1,
        "organizationName": "TCPWave",
        "createdBy": 1,
        "createdByName": "User1",
        "updatedBy": 1,
        "updatedByName": "1",
        "createdTime": "10/1/2016",
        "updatedTime": "10/2/2016",
        "createdTimeString": "10/1/2016 6:57",
        "updatedTimeString": "10/1/2016 6:57",
        "created_by_login_name": "string",
        "updated_by_login_name": "string",
        "sequence": 1,
        "geoType": "string",
        "matchGeoClients": "string",
        "matchGeoDestinations": "string"
      }
    ],
    "allowClassesArray": [
      "string",
      "string"
    ],
    "denyClassesArray": [
      "string",
      "string"
    ],
    "ip_address": "172.16.13.1",
    "mac_address": "aa:bb:cc:dd:ee:ff",
    "client_hostname": "abcd",
    "starts": "2019-03-01 02:59:09",
    "ends": "2019-03-01 03:04:09",
    "updated_time_string": "string",
    "created_time_string": "string",
    "last_seen_string": "2019-03-14 06:58:42",
    "managed_by": "admin",
    "monitored_by": "admin",
    "change_control_team": "string",
    "terminal_server_kvm": "string",
    "end_of_life": "2019-03-14 06:58:42",
    "room": "string",
    "floor": "string",
    "last_seen": "2019-03-14 06:58:42",
    "rrsXML": "string"
  },
  {
    "addr1": 4,
    "addr2": 10,
    "addr3": 7,
    "addr4": 9,
    "address": "172.16.13.5",
    "organization_name": "Internal",
    "domain_name": "domain.com",
    "subnet_address": "10.0.0.0/24",
    "network_address": "172.16.13.0",
    "class_code": "string",
    "mac": "aa:bb:cc:ddd:ee:ff",
    "model_type": "string",
    "serial_num": "string",
    "description": "string",
    "contact_name": "string",
    "contact_first_name": "string",
    "contact_middle_name": "string",
    "contact_last_name": "string",
    "contact_email_id": "abc@gmail.com",
    "location_name": "abcdef",
    "street1": "abc",
    "street2": "def",
    "city": "zxcv",
    "state": "asdf",
    "zip": "50000",
    "country": "xyza",
    "name": "timsobject",
    "ttl": 1200,
    "option_template_name": "dhcp_option",
    "alias": "zxcvb",
    "alloc_type": "Static/Manual/Dynamic/Reserved etc",
    "alloc_type_desc": "Static/Dynamic/Manual/Auto/Reserved",
    "update_ns_a": true,
    "update_ns_ptr": true,
    "dyn_update_rrs_a": false,
    "dyn_update_rrs_ptr": true,
    "dyn_update_rrs_cname": true,
    "dyn_update_rrs_mx": false,
    "isDeleterrsChecked": "0 or 1",
    "rrs": [
      {
        "id": 39447,
        "owner": "www.converge.com",
        "rrclass": "IN ",
        "rrtype": "CNAME",
        "ttl": 1200,
        "data": "string",
        "description": "Zone RR migrated to TCPWave IPAM by Professional Services.",
        "ipAddr": "192.168.1.43",
        "domain_id": 135978,
        "domain": "converge.com",
        "updated_by": "2019",
        "updated_time": "3/18/2016 4:37",
        "created_by": "2017",
        "created_time": "3/18/2016 3:39",
        "name": "cons.atcc.com.",
        "is_ad_rr": "No",
        "subnet_id": 318534,
        "network_id": 7939,
        "subnet_address": "10.10.0.0",
        "organization_id": 990,
        "organization_name": "EARTH",
        "is_external_rr": "No",
        "proxy": 1,
        "view_id": 21,
        "view_name": "Moscow",
        "viewList": "[Internal, Moscow]",
        "updated_time_string": "3/18/2016 4:37",
        "created_time_string": "3/18/2016 4:37",
        "created_by_login_name": "Stephen",
        "updated_by_login_name": "Stephen",
        "mask": 28,
        "extensions": [
          {
            "name": "RITS_ID-1",
            "value": "Admin/Network/Subnet"
          },
          {
            "name": "RITS_ID-1",
            "value": "Admin/Network/Subnet"
          }
        ],
        "zoneName": "atcc.com",
        "networkAddress": "10.0.0.0"
      },
      {
        "id": 39447,
        "owner": "www.converge.com",
        "rrclass": "IN ",
        "rrtype": "CNAME",
        "ttl": 1200,
        "data": "string",
        "description": "Zone RR migrated to TCPWave IPAM by Professional Services.",
        "ipAddr": "192.168.1.43",
        "domain_id": 135978,
        "domain": "converge.com",
        "updated_by": "2019",
        "updated_time": "3/18/2016 4:37",
        "created_by": "2017",
        "created_time": "3/18/2016 3:39",
        "name": "cons.atcc.com.",
        "is_ad_rr": "No",
        "subnet_id": 318534,
        "network_id": 7939,
        "subnet_address": "10.10.0.0",
        "organization_id": 990,
        "organization_name": "EARTH",
        "is_external_rr": "No",
        "proxy": 1,
        "view_id": 21,
        "view_name": "Moscow",
        "viewList": "[Internal, Moscow]",
        "updated_time_string": "3/18/2016 4:37",
        "created_time_string": "3/18/2016 4:37",
        "created_by_login_name": "Stephen",
        "updated_by_login_name": "Stephen",
        "mask": 28,
        "extensions": [
          {
            "name": "RITS_ID-1",
            "value": "Admin/Network/Subnet"
          },
          {
            "name": "RITS_ID-1",
            "value": "Admin/Network/Subnet"
          },
          {
            "name": "RITS_ID-1",
            "value": "Admin/Network/Subnet"
          },
          {
            "name": "RITS_ID-1",
            "value": "Admin/Network/Subnet"
          },
          {
            "name": "RITS_ID-1",
            "value": "Admin/Network/Subnet"
          },
          {
            "name": "RITS_ID-1",
            "value": "Admin/Network/Subnet"
          },
          {
            "name": "RITS_ID-1",
            "value": "Admin/Network/Subnet"
          }
        ],
        "zoneName": "atcc.com",
        "networkAddress": "10.0.0.0"
      },
      {
        "id": 39447,
        "owner": "www.converge.com",
        "rrclass": "IN ",
        "rrtype": "CNAME",
        "ttl": 1200,
        "data": "string",
        "description": "Zone RR migrated to TCPWave IPAM by Professional Services.",
        "ipAddr": "192.168.1.43",
        "domain_id": 135978,
        "domain": "converge.com",
        "updated_by": "2019",
        "updated_time": "3/18/2016 4:37",
        "created_by": "2017",
        "created_time": "3/18/2016 3:39",
        "name": "cons.atcc.com.",
        "is_ad_rr": "No",
        "subnet_id": 318534,
        "network_id": 7939,
        "subnet_address": "10.10.0.0",
        "organization_id": 990,
        "organization_name": "EARTH",
        "is_external_rr": "No",
        "proxy": 1,
        "view_id": 21,
        "view_name": "Moscow",
        "viewList": "[Internal, Moscow]",
        "updated_time_string": "3/18/2016 4:37",
        "created_time_string": "3/18/2016 4:37",
        "created_by_login_name": "Stephen",
        "updated_by_login_name": "Stephen",
        "mask": 28,
        "extensions": [
          {
            "name": "RITS_ID-1",
            "value": "Admin/Network/Subnet"
          },
          {
            "name": "RITS_ID-1",
            "value": "Admin/Network/Subnet"
          },
          {
            "name": "RITS_ID-1",
            "value": "Admin/Network/Subnet"
          },
          {
            "name": "RITS_ID-1",
            "value": "Admin/Network/Subnet"
          },
          {
            "name": "RITS_ID-1",
            "value": "Admin/Network/Subnet"
          },
          {
            "name": "RITS_ID-1",
            "value": "Admin/Network/Subnet"
          }
        ],
        "zoneName": "atcc.com",
        "networkAddress": "10.0.0.0"
      },
      {
        "id": 39447,
        "owner": "www.converge.com",
        "rrclass": "IN ",
        "rrtype": "CNAME",
        "ttl": 1200,
        "data": "string",
        "description": "Zone RR migrated to TCPWave IPAM by Professional Services.",
        "ipAddr": "192.168.1.43",
        "domain_id": 135978,
        "domain": "converge.com",
        "updated_by": "2019",
        "updated_time": "3/18/2016 4:37",
        "created_by": "2017",
        "created_time": "3/18/2016 3:39",
        "name": "cons.atcc.com.",
        "is_ad_rr": "No",
        "subnet_id": 318534,
        "network_id": 7939,
        "subnet_address": "10.10.0.0",
        "organization_id": 990,
        "organization_name": "EARTH",
        "is_external_rr": "No",
        "proxy": 1,
        "view_id": 21,
        "view_name": "Moscow",
        "viewList": "[Internal, Moscow]",
        "updated_time_string": "3/18/2016 4:37",
        "created_time_string": "3/18/2016 4:37",
        "created_by_login_name": "Stephen",
        "updated_by_login_name": "Stephen",
        "mask": 28,
        "extensions": [
          {
            "name": "RITS_ID-1",
            "value": "Admin/Network/Subnet"
          },
          {
            "name": "RITS_ID-1",
            "value": "Admin/Network/Subnet"
          }
        ],
        "zoneName": "atcc.com",
        "networkAddress": "10.0.0.0"
      },
      {
        "id": 39447,
        "owner": "www.converge.com",
        "rrclass": "IN ",
        "rrtype": "CNAME",
        "ttl": 1200,
        "data": "string",
        "description": "Zone RR migrated to TCPWave IPAM by Professional Services.",
        "ipAddr": "192.168.1.43",
        "domain_id": 135978,
        "domain": "converge.com",
        "updated_by": "2019",
        "updated_time": "3/18/2016 4:37",
        "created_by": "2017",
        "created_time": "3/18/2016 3:39",
        "name": "cons.atcc.com.",
        "is_ad_rr": "No",
        "subnet_id": 318534,
        "network_id": 7939,
        "subnet_address": "10.10.0.0",
        "organization_id": 990,
        "organization_name": "EARTH",
        "is_external_rr": "No",
        "proxy": 1,
        "view_id": 21,
        "view_name": "Moscow",
        "viewList": "[Internal, Moscow]",
        "updated_time_string": "3/18/2016 4:37",
        "created_time_string": "3/18/2016 4:37",
        "created_by_login_name": "Stephen",
        "updated_by_login_name": "Stephen",
        "mask": 28,
        "extensions": [
          {
            "name": "RITS_ID-1",
            "value": "Admin/Network/Subnet"
          },
          {
            "name": "RITS_ID-1",
            "value": "Admin/Network/Subnet"
          },
          {
            "name": "RITS_ID-1",
            "value": "Admin/Network/Subnet"
          },
          {
            "name": "RITS_ID-1",
            "value": "Admin/Network/Subnet"
          },
          {
            "name": "RITS_ID-1",
            "value": "Admin/Network/Subnet"
          },
          {
            "name": "RITS_ID-1",
            "value": "Admin/Network/Subnet"
          }
        ],
        "zoneName": "atcc.com",
        "networkAddress": "10.0.0.0"
      },
      {
        "id": 39447,
        "owner": "www.converge.com",
        "rrclass": "IN ",
        "rrtype": "CNAME",
        "ttl": 1200,
        "data": "string",
        "description": "Zone RR migrated to TCPWave IPAM by Professional Services.",
        "ipAddr": "192.168.1.43",
        "domain_id": 135978,
        "domain": "converge.com",
        "updated_by": "2019",
        "updated_time": "3/18/2016 4:37",
        "created_by": "2017",
        "created_time": "3/18/2016 3:39",
        "name": "cons.atcc.com.",
        "is_ad_rr": "No",
        "subnet_id": 318534,
        "network_id": 7939,
        "subnet_address": "10.10.0.0",
        "organization_id": 990,
        "organization_name": "EARTH",
        "is_external_rr": "No",
        "proxy": 1,
        "view_id": 21,
        "view_name": "Moscow",
        "viewList": "[Internal, Moscow]",
        "updated_time_string": "3/18/2016 4:37",
        "created_time_string": "3/18/2016 4:37",
        "created_by_login_name": "Stephen",
        "updated_by_login_name": "Stephen",
        "mask": 28,
        "extensions": [
          {
            "name": "RITS_ID-1",
            "value": "Admin/Network/Subnet"
          },
          {
            "name": "RITS_ID-1",
            "value": "Admin/Network/Subnet"
          },
          {
            "name": "RITS_ID-1",
            "value": "Admin/Network/Subnet"
          },
          {
            "name": "RITS_ID-1",
            "value": "Admin/Network/Subnet"
          },
          {
            "name": "RITS_ID-1",
            "value": "Admin/Network/Subnet"
          },
          {
            "name": "RITS_ID-1",
            "value": "Admin/Network/Subnet"
          },
          {
            "name": "RITS_ID-1",
            "value": "Admin/Network/Subnet"
          },
          {
            "name": "RITS_ID-1",
            "value": "Admin/Network/Subnet"
          }
        ],
        "zoneName": "atcc.com",
        "networkAddress": "10.0.0.0"
      },
      {
        "id": 39447,
        "owner": "www.converge.com",
        "rrclass": "IN ",
        "rrtype": "CNAME",
        "ttl": 1200,
        "data": "string",
        "description": "Zone RR migrated to TCPWave IPAM by Professional Services.",
        "ipAddr": "192.168.1.43",
        "domain_id": 135978,
        "domain": "converge.com",
        "updated_by": "2019",
        "updated_time": "3/18/2016 4:37",
        "created_by": "2017",
        "created_time": "3/18/2016 3:39",
        "name": "cons.atcc.com.",
        "is_ad_rr": "No",
        "subnet_id": 318534,
        "network_id": 7939,
        "subnet_address": "10.10.0.0",
        "organization_id": 990,
        "organization_name": "EARTH",
        "is_external_rr": "No",
        "proxy": 1,
        "view_id": 21,
        "view_name": "Moscow",
        "viewList": "[Internal, Moscow]",
        "updated_time_string": "3/18/2016 4:37",
        "created_time_string": "3/18/2016 4:37",
        "created_by_login_name": "Stephen",
        "updated_by_login_name": "Stephen",
        "mask": 28,
        "extensions": [
          {
            "name": "RITS_ID-1",
            "value": "Admin/Network/Subnet"
          },
          {
            "name": "RITS_ID-1",
            "value": "Admin/Network/Subnet"
          },
          {
            "name": "RITS_ID-1",
            "value": "Admin/Network/Subnet"
          },
          {
            "name": "RITS_ID-1",
            "value": "Admin/Network/Subnet"
          },
          {
            "name": "RITS_ID-1",
            "value": "Admin/Network/Subnet"
          },
          {
            "name": "RITS_ID-1",
            "value": "Admin/Network/Subnet"
          },
          {
            "name": "RITS_ID-1",
            "value": "Admin/Network/Subnet"
          }
        ],
        "zoneName": "atcc.com",
        "networkAddress": "10.0.0.0"
      }
    ],
    "created_by_name": "John",
    "updated_by_name": "qwert",
    "updated_time": "12:10:50 11-28-2018",
    "dhcp_server": "string",
    "created_by_login_name": "John",
    "updated_by_login_name": "John",
    "viewName": "viewname",
    "extensions": [
      {
        "name": "RITS_ID-1",
        "value": "Admin/Network/Subnet"
      },
      {
        "name": "RITS_ID-1",
        "value": "Admin/Network/Subnet"
      },
      {
        "name": "RITS_ID-1",
        "value": "Admin/Network/Subnet"
      },
      {
        "name": "RITS_ID-1",
        "value": "Admin/Network/Subnet"
      },
      {
        "name": "RITS_ID-1",
        "value": "Admin/Network/Subnet"
      },
      {
        "name": "RITS_ID-1",
        "value": "Admin/Network/Subnet"
      },
      {
        "name": "RITS_ID-1",
        "value": "Admin/Network/Subnet"
      },
      {
        "name": "RITS_ID-1",
        "value": "Admin/Network/Subnet"
      },
      {
        "name": "RITS_ID-1",
        "value": "Admin/Network/Subnet"
      },
      {
        "name": "RITS_ID-1",
        "value": "Admin/Network/Subnet"
      }
    ],
    "cloudAttributes": {},
    "cloudExtensions": [
      {
        "name": "RITS_ID-1",
        "value": "Admin/Network/Subnet"
      },
      {
        "name": "RITS_ID-1",
        "value": "Admin/Network/Subnet"
      },
      {
        "name": "RITS_ID-1",
        "value": "Admin/Network/Subnet"
      },
      {
        "name": "RITS_ID-1",
        "value": "Admin/Network/Subnet"
      },
      {
        "name": "RITS_ID-1",
        "value": "Admin/Network/Subnet"
      }
    ],
    "switchName": "switch1",
    "isRenew": "string",
    "operation": "add/edit/delete",
    "deletedRRs": "[RR1, RR2]",
    "addedRRs": "[RR3, RR4]",
    "viewList": [
      {
        "id": 1,
        "name": "internal",
        "newName": "external",
        "matchClients": "[ACL1, ACL2, ACL3]",
        "matchDestinations": "[ACL1, ACL2, ACL3]",
        "matchClientsValue": "localhost;10.0.0.0/16",
        "matchDestinationsValue": "localhost;10.0.0.0/16",
        "organizationId": 1,
        "organizationName": "TCPWave",
        "createdBy": 1,
        "createdByName": "User1",
        "updatedBy": 1,
        "updatedByName": "1",
        "createdTime": "10/1/2016",
        "updatedTime": "10/2/2016",
        "createdTimeString": "10/1/2016 6:57",
        "updatedTimeString": "10/1/2016 6:57",
        "created_by_login_name": "string",
        "updated_by_login_name": "string",
        "sequence": 1,
        "geoType": "string",
        "matchGeoClients": "string",
        "matchGeoDestinations": "string"
      },
      {
        "id": 1,
        "name": "internal",
        "newName": "external",
        "matchClients": "[ACL1, ACL2, ACL3]",
        "matchDestinations": "[ACL1, ACL2, ACL3]",
        "matchClientsValue": "localhost;10.0.0.0/16",
        "matchDestinationsValue": "localhost;10.0.0.0/16",
        "organizationId": 1,
        "organizationName": "TCPWave",
        "createdBy": 1,
        "createdByName": "User1",
        "updatedBy": 1,
        "updatedByName": "1",
        "createdTime": "10/1/2016",
        "updatedTime": "10/2/2016",
        "createdTimeString": "10/1/2016 6:57",
        "updatedTimeString": "10/1/2016 6:57",
        "created_by_login_name": "string",
        "updated_by_login_name": "string",
        "sequence": 1,
        "geoType": "string",
        "matchGeoClients": "string",
        "matchGeoDestinations": "string"
      },
      {
        "id": 1,
        "name": "internal",
        "newName": "external",
        "matchClients": "[ACL1, ACL2, ACL3]",
        "matchDestinations": "[ACL1, ACL2, ACL3]",
        "matchClientsValue": "localhost;10.0.0.0/16",
        "matchDestinationsValue": "localhost;10.0.0.0/16",
        "organizationId": 1,
        "organizationName": "TCPWave",
        "createdBy": 1,
        "createdByName": "User1",
        "updatedBy": 1,
        "updatedByName": "1",
        "createdTime": "10/1/2016",
        "updatedTime": "10/2/2016",
        "createdTimeString": "10/1/2016 6:57",
        "updatedTimeString": "10/1/2016 6:57",
        "created_by_login_name": "string",
        "updated_by_login_name": "string",
        "sequence": 1,
        "geoType": "string",
        "matchGeoClients": "string",
        "matchGeoDestinations": "string"
      },
      {
        "id": 1,
        "name": "internal",
        "newName": "external",
        "matchClients": "[ACL1, ACL2, ACL3]",
        "matchDestinations": "[ACL1, ACL2, ACL3]",
        "matchClientsValue": "localhost;10.0.0.0/16",
        "matchDestinationsValue": "localhost;10.0.0.0/16",
        "organizationId": 1,
        "organizationName": "TCPWave",
        "createdBy": 1,
        "createdByName": "User1",
        "updatedBy": 1,
        "updatedByName": "1",
        "createdTime": "10/1/2016",
        "updatedTime": "10/2/2016",
        "createdTimeString": "10/1/2016 6:57",
        "updatedTimeString": "10/1/2016 6:57",
        "created_by_login_name": "string",
        "updated_by_login_name": "string",
        "sequence": 1,
        "geoType": "string",
        "matchGeoClients": "string",
        "matchGeoDestinations": "string"
      }
    ],
    "allowClassesArray": [
      "string",
      "string"
    ],
    "denyClassesArray": [
      "string",
      "string",
      "string",
      "string",
      "string"
    ],
    "ip_address": "172.16.13.1",
    "mac_address": "aa:bb:cc:dd:ee:ff",
    "client_hostname": "abcd",
    "starts": "2019-03-01 02:59:09",
    "ends": "2019-03-01 03:04:09",
    "updated_time_string": "string",
    "created_time_string": "string",
    "last_seen_string": "2019-03-14 06:58:42",
    "managed_by": "admin",
    "monitored_by": "admin",
    "change_control_team": "string",
    "terminal_server_kvm": "string",
    "end_of_life": "2019-03-14 06:58:42",
    "room": "string",
    "floor": "string",
    "last_seen": "2019-03-14 06:58:42",
    "rrsXML": "string"
  }
]