{
  "id": 34,
  "first_name": "tango",
  "middle_name": "chaplin",
  "last_name": "charli",
  "email_id": "adm@tcpwave.com",
  "phone_num": "7878989888",
  "organization_id": 2,
  "organization_name": "TCPWave",
  "isAdmin": true,
  "adminId": 2024,
  "login_name": "NewRADM",
  "roles_id": "RADM",
  "roles_code": "RADM",
  "last_change_time": "string",
  "last_login": "10/14/2016",
  "password_expired": true,
  "account_locked": true,
  "failed_attempts": 3,
  "admin_groups": [
    {
      "id": 121,
      "name": "Admin-group-1",
      "oldName": "Admin-group",
      "description": "Admin group description",
      "organization_id": 111,
      "organization_name": "TCPWave",
      "updated_time": "1479201874000",
      "updated_by_name": "admin1",
      "created_by_name": "admin2",
      "created_time": "1479201867000",
      "updated_time_string": "12/15/2016 7:14:17",
      "created_time_string": "11/15/2016 6:04:15"
    },
    {
      "id": 121,
      "name": "Admin-group-1",
      "oldName": "Admin-group",
      "description": "Admin group description",
      "organization_id": 111,
      "organization_name": "TCPWave",
      "updated_time": "1479201874000",
      "updated_by_name": "admin1",
      "created_by_name": "admin2",
      "created_time": "1479201867000",
      "updated_time_string": "12/15/2016 7:14:17",
      "created_time_string": "11/15/2016 6:04:15"
    },
    {
      "id": 121,
      "name": "Admin-group-1",
      "oldName": "Admin-group",
      "description": "Admin group description",
      "organization_id": 111,
      "organization_name": "TCPWave",
      "updated_time": "1479201874000",
      "updated_by_name": "admin1",
      "created_by_name": "admin2",
      "created_time": "1479201867000",
      "updated_time_string": "12/15/2016 7:14:17",
      "created_time_string": "11/15/2016 6:04:15"
    },
    {
      "id": 121,
      "name": "Admin-group-1",
      "oldName": "Admin-group",
      "description": "Admin group description",
      "organization_id": 111,
      "organization_name": "TCPWave",
      "updated_time": "1479201874000",
      "updated_by_name": "admin1",
      "created_by_name": "admin2",
      "created_time": "1479201867000",
      "updated_time_string": "12/15/2016 7:14:17",
      "created_time_string": "11/15/2016 6:04:15"
    },
    {
      "id": 121,
      "name": "Admin-group-1",
      "oldName": "Admin-group",
      "description": "Admin group description",
      "organization_id": 111,
      "organization_name": "TCPWave",
      "updated_time": "1479201874000",
      "updated_by_name": "admin1",
      "created_by_name": "admin2",
      "created_time": "1479201867000",
      "updated_time_string": "12/15/2016 7:14:17",
      "created_time_string": "11/15/2016 6:04:15"
    },
    {
      "id": 121,
      "name": "Admin-group-1",
      "oldName": "Admin-group",
      "description": "Admin group description",
      "organization_id": 111,
      "organization_name": "TCPWave",
      "updated_time": "1479201874000",
      "updated_by_name": "admin1",
      "created_by_name": "admin2",
      "created_time": "1479201867000",
      "updated_time_string": "12/15/2016 7:14:17",
      "created_time_string": "11/15/2016 6:04:15"
    },
    {
      "id": 121,
      "name": "Admin-group-1",
      "oldName": "Admin-group",
      "description": "Admin group description",
      "organization_id": 111,
      "organization_name": "TCPWave",
      "updated_time": "1479201874000",
      "updated_by_name": "admin1",
      "created_by_name": "admin2",
      "created_time": "1479201867000",
      "updated_time_string": "12/15/2016 7:14:17",
      "created_time_string": "11/15/2016 6:04:15"
    },
    {
      "id": 121,
      "name": "Admin-group-1",
      "oldName": "Admin-group",
      "description": "Admin group description",
      "organization_id": 111,
      "organization_name": "TCPWave",
      "updated_time": "1479201874000",
      "updated_by_name": "admin1",
      "created_by_name": "admin2",
      "created_time": "1479201867000",
      "updated_time_string": "12/15/2016 7:14:17",
      "created_time_string": "11/15/2016 6:04:15"
    }
  ],
  "extensions": "{\"name\":\"network\",\"value\":\"192.168..10.0\"}",
  "admin_image": "string",
  "fileName": "admin.png",
  "new_first_name": "Denial",
  "new_middle_name": "smith",
  "new_last_name": "shawn",
  "new_email_id": "adm@tcpwave.com",
  "new_is_admin": true,
  "new_login_name": "Denial11",
  "roles_name": "RADM",
  "updated_time": "2/4/2016 0:11",
  "updated_by_name": "string",
  "created_by_name": "string",
  "created_time": "1/1/2016 0:09",
  "updated_time_string": "5/3/2016 0:55",
  "created_time_string": "2016-02-012 07:35:43.0"
}