[
  {
    "organization_id": 998,
    "domain_id": 135978,
    "rr_name": "www.edu.com",
    "rr_type": "A",
    "domain_name": "edu.com",
    "server_name": "nuslax-sl0983-191.edu.com",
    "server_ip": "10.1.10.191",
    "rr_value": "10.0.0.1",
    "server_type": "Master",
    "rr_fqdn": "string",
    "status": "Up to Date",
    "server_type_code": "BIND AUTH",
    "organization_name": "EARTH",
    "rev_zone_name": "0-17.144.133.in-addr.arpa",
    "obj_type": "IPv4",
    "getdnssec_enabled": true,
    "dnssec_details": "string",
    "rr_data": "string",
    "maskLength": 24
  }
]