[
  {
    "fileName": "string",
    "fileType": "string",
    "fileSize": 3,
    "id": "string",
    "action_time": "string",
    "operation": "string",
    "target": "string",
    "role": "string",
    "name": "string",
    "status": "string",
    "remote_ip": "string",
    "login_name": "string",
    "change_ticket": "string",
    "error_msg": "string",
    "target_instance": "string",
    "description": "string",
    "attachment": "string",
    "user_id": "string",
    "ipv4_address": "string",
    "command": "string",
    "multipart": "string",
    "organization_id": "string",
    "audit_history_id": "string",
    "created_by_Name": "string",
    "organization_name": "string",
    "updated_time_string": "string",
    "created_time_string": "string",
    "fromDate": "string",
    "toDate": "string",
    "reportType": "string"
  },
  {
    "fileName": "string",
    "fileType": "string",
    "fileSize": 2,
    "id": "string",
    "action_time": "string",
    "operation": "string",
    "target": "string",
    "role": "string",
    "name": "string",
    "status": "string",
    "remote_ip": "string",
    "login_name": "string",
    "change_ticket": "string",
    "error_msg": "string",
    "target_instance": "string",
    "description": "string",
    "attachment": "string",
    "user_id": "string",
    "ipv4_address": "string",
    "command": "string",
    "multipart": "string",
    "organization_id": "string",
    "audit_history_id": "string",
    "created_by_Name": "string",
    "organization_name": "string",
    "updated_time_string": "string",
    "created_time_string": "string",
    "fromDate": "string",
    "toDate": "string",
    "reportType": "string"
  },
  {
    "fileName": "string",
    "fileType": "string",
    "fileSize": 6,
    "id": "string",
    "action_time": "string",
    "operation": "string",
    "target": "string",
    "role": "string",
    "name": "string",
    "status": "string",
    "remote_ip": "string",
    "login_name": "string",
    "change_ticket": "string",
    "error_msg": "string",
    "target_instance": "string",
    "description": "string",
    "attachment": "string",
    "user_id": "string",
    "ipv4_address": "string",
    "command": "string",
    "multipart": "string",
    "organization_id": "string",
    "audit_history_id": "string",
    "created_by_Name": "string",
    "organization_name": "string",
    "updated_time_string": "string",
    "created_time_string": "string",
    "fromDate": "string",
    "toDate": "string",
    "reportType": "string"
  }
]