{
  "serviceId": 1,
  "serviceName": "SYSTEM_CPU",
  "serviceDescription": "Monitor the % CPU of all host types",
  "category": "Appliance Components",
  "bindAuth": "true/false",
  "bindCache": "true/false",
  "unboundCache": "true/false",
  "nsdAuth": "1",
  "dhcp": "true/false",
  "ipam": "true/false",
  "createdBy": 1,
  "createdByName": "User1",
  "updatedBy": 1,
  "updatedByName": "User1",
  "createdTime": "06:57:00 10-1-2019",
  "updatedTime": "08:34:00 12-1-2019",
  "createdTimeString": "06:57:00 10-1-2019",
  "updatedTimeString": "08:34:00 12-1-2019",
  "created_by_login_name": "admin",
  "updated_by_login_name": "admin",
  "enableFlapping": "1",
  "enableAlertAck": "1",
  "enableCritical": "1",
  "enableWarning": "1",
  "enableUnknown": "0",
  "scheduledDownTime": "10/1/2019 12:00:00",
  "criticalThresholdVal": "70",
  "warningThresholdVal": "50",
  "disableAlertFromString": "10/1/2019 12:00:00",
  "disableAlertToString": "12/1/2019 12:00:00",
  "userScriptPath": "string"
}