[
  {
    "topic": "string",
    "tx_msg_count": 10,
    "rx_msg_count": 2,
    "tx_msg_size": 1,
    "rx_msg_size": 1,
    "stat_time": "string"
  },
  {
    "topic": "string",
    "tx_msg_count": 4,
    "rx_msg_count": 8,
    "tx_msg_size": 2,
    "rx_msg_size": 8,
    "stat_time": "string"
  },
  {
    "topic": "string",
    "tx_msg_count": 2,
    "rx_msg_count": 10,
    "tx_msg_size": 8,
    "rx_msg_size": 1,
    "stat_time": "string"
  },
  {
    "topic": "string",
    "tx_msg_count": 9,
    "rx_msg_count": 10,
    "tx_msg_size": 7,
    "rx_msg_size": 4,
    "stat_time": "string"
  }
]