{
  "actions": [
    {
      "name": "categoryList",
      "protocol": "REST",
      "method": "GET",
      "entitypath": "{base_path}/{version}/alarmSubscription/categoryList?{query}",
      "requestSchema": "schema.json",
      "responseSchema": "schema.json",
      "timeout": 0,
      "sendEmpty": false,
      "sendGetBody": false,
      "requestDatatype": "JSON",
      "responseDatatype": "JSON",
      "headers": {},
      "responseObjects": [
        {
          "type": "default",
          "key": "",
          "mockFile": "mockdatafiles/categoryList-default.json"
        }
      ]
    },
    {
      "name": "listCategoryMonitorService",
      "protocol": "REST",
      "method": "GET",
      "entitypath": "{base_path}/{version}/alarmSubscription/thresholdList?{query}",
      "requestSchema": "schema.json",
      "responseSchema": "schema.json",
      "timeout": 0,
      "sendEmpty": false,
      "sendGetBody": false,
      "requestDatatype": "JSON",
      "responseDatatype": "JSON",
      "headers": {},
      "responseObjects": [
        {
          "type": "default",
          "key": "",
          "mockFile": "mockdatafiles/listCategoryMonitorService-default.json"
        }
      ]
    },
    {
      "name": "listComponents",
      "protocol": "REST",
      "method": "GET",
      "entitypath": "{base_path}/{version}/alarmSubscription/componentList?{query}",
      "requestSchema": "schema.json",
      "responseSchema": "schema.json",
      "timeout": 0,
      "sendEmpty": false,
      "sendGetBody": false,
      "requestDatatype": "JSON",
      "responseDatatype": "JSON",
      "headers": {},
      "responseObjects": [
        {
          "type": "default",
          "key": "",
          "mockFile": "mockdatafiles/listComponents-default.json"
        }
      ]
    },
    {
      "name": "addSubscriptions",
      "protocol": "REST",
      "method": "POST",
      "entitypath": "{base_path}/{version}/alarmSubscription/add?{query}",
      "requestSchema": "schema.json",
      "responseSchema": "schema.json",
      "timeout": 0,
      "sendEmpty": false,
      "sendGetBody": false,
      "requestDatatype": "JSON",
      "responseDatatype": "JSON",
      "headers": {},
      "responseObjects": [
        {
          "type": "default",
          "key": "",
          "mockFile": ""
        }
      ]
    },
    {
      "name": "deleteSubscription",
      "protocol": "REST",
      "method": "POST",
      "entitypath": "{base_path}/{version}/alarmSubscription/delete?{query}",
      "requestSchema": "schema.json",
      "responseSchema": "schema.json",
      "timeout": 0,
      "sendEmpty": false,
      "sendGetBody": false,
      "requestDatatype": "JSON",
      "responseDatatype": "JSON",
      "headers": {},
      "responseObjects": [
        {
          "type": "default",
          "key": "",
          "mockFile": ""
        }
      ]
    },
    {
      "name": "getAlarmSubscriptionList",
      "protocol": "REST",
      "method": "GET",
      "entitypath": "{base_path}/{version}/alarmSubscription/list?{query}",
      "requestSchema": "schema.json",
      "responseSchema": "schema.json",
      "timeout": 0,
      "sendEmpty": false,
      "sendGetBody": false,
      "requestDatatype": "JSON",
      "responseDatatype": "JSON",
      "headers": {},
      "responseObjects": [
        {
          "type": "default",
          "key": "",
          "mockFile": "mockdatafiles/getAlarmSubscriptionList-default.json"
        }
      ]
    }
  ]
}