[
  {
    "date": "2019-05-03",
    "time": "10:14:54",
    "query": "tcpwave.com IN SOA",
    "status": "NO ERROR"
  },
  {
    "date": "2019-05-03",
    "time": "10:14:54",
    "query": "tcpwave.com IN SOA",
    "status": "NO ERROR"
  },
  {
    "date": "2019-05-03",
    "time": "10:14:54",
    "query": "tcpwave.com IN SOA",
    "status": "NO ERROR"
  },
  {
    "date": "2019-05-03",
    "time": "10:14:54",
    "query": "tcpwave.com IN SOA",
    "status": "NO ERROR"
  }
]