{
  "actions": [
    {
      "name": "deleteFromScheduledRpt",
      "protocol": "REST",
      "method": "POST",
      "entitypath": "{base_path}/{version}/Scheduledreports/delete?{query}",
      "requestSchema": "schema.json",
      "responseSchema": "schema.json",
      "timeout": 0,
      "sendEmpty": false,
      "sendGetBody": false,
      "requestDatatype": "JSON",
      "responseDatatype": "JSON",
      "headers": {},
      "responseObjects": [
        {
          "type": "default",
          "key": "",
          "mockFile": ""
        }
      ]
    },
    {
      "name": "getScheduledreportsScheduledreportlist",
      "protocol": "REST",
      "method": "GET",
      "entitypath": "{base_path}/{version}/Scheduledreports/Scheduledreportlist?{query}",
      "requestSchema": "schema.json",
      "responseSchema": "schema.json",
      "timeout": 0,
      "sendEmpty": false,
      "sendGetBody": false,
      "requestDatatype": "JSON",
      "responseDatatype": "JSON",
      "headers": {},
      "responseObjects": [
        {
          "type": "default",
          "key": "",
          "mockFile": "mockdatafiles/getScheduledreportsScheduledreportlist-default.json"
        }
      ]
    },
    {
      "name": "subscribeToScheduledRpt",
      "protocol": "REST",
      "method": "POST",
      "entitypath": "{base_path}/{version}/Scheduledreports/subscribe?{query}",
      "requestSchema": "schema.json",
      "responseSchema": "schema.json",
      "timeout": 0,
      "sendEmpty": false,
      "sendGetBody": false,
      "requestDatatype": "JSON",
      "responseDatatype": "JSON",
      "headers": {},
      "responseObjects": [
        {
          "type": "default",
          "key": "",
          "mockFile": ""
        }
      ]
    }
  ]
}