[
  {
    "id": 13,
    "category": "Client",
    "description": "Processing of client requests."
  },
  {
    "id": 13,
    "category": "Client",
    "description": "Processing of client requests."
  }
]