{
  "items": [
    {
      "org": "org-acme-0c5027cd98540e76",
      "port": "port-LAN1-faece15f745e08a0",
      "gateway_ipv4": "string",
      "gateway_ipv6": "string",
      "ipv4": "string",
      "ipv6": "string",
      "mtu": 6,
      "auto_negotiation": false,
      "enabled": false
    },
    {
      "org": "org-acme-0c5027cd98540e76",
      "port": "port-LAN1-faece15f745e08a0",
      "gateway_ipv4": "string",
      "gateway_ipv6": "string",
      "ipv4": "string",
      "ipv6": "string",
      "mtu": 6,
      "auto_negotiation": true,
      "enabled": false
    },
    {
      "org": "org-acme-0c5027cd98540e76",
      "port": "port-LAN1-faece15f745e08a0",
      "gateway_ipv4": "string",
      "gateway_ipv6": "string",
      "ipv4": "string",
      "ipv6": "string",
      "mtu": 8,
      "auto_negotiation": false,
      "enabled": false
    },
    {
      "org": "org-acme-0c5027cd98540e76",
      "port": "port-LAN1-faece15f745e08a0",
      "gateway_ipv4": "string",
      "gateway_ipv6": "string",
      "ipv4": "string",
      "ipv6": "string",
      "mtu": 8,
      "auto_negotiation": true,
      "enabled": false
    },
    {
      "org": "org-acme-0c5027cd98540e76",
      "port": "port-LAN1-faece15f745e08a0",
      "gateway_ipv4": "string",
      "gateway_ipv6": "string",
      "ipv4": "string",
      "ipv6": "string",
      "mtu": 3,
      "auto_negotiation": false,
      "enabled": false
    },
    {
      "org": "org-acme-0c5027cd98540e76",
      "port": "port-LAN1-faece15f745e08a0",
      "gateway_ipv4": "string",
      "gateway_ipv6": "string",
      "ipv4": "string",
      "ipv6": "string",
      "mtu": 9,
      "auto_negotiation": false,
      "enabled": false
    },
    {
      "org": "org-acme-0c5027cd98540e76",
      "port": "port-LAN1-faece15f745e08a0",
      "gateway_ipv4": "string",
      "gateway_ipv6": "string",
      "ipv4": "string",
      "ipv6": "string",
      "mtu": 1,
      "auto_negotiation": true,
      "enabled": true
    },
    {
      "org": "org-acme-0c5027cd98540e76",
      "port": "port-LAN1-faece15f745e08a0",
      "gateway_ipv4": "string",
      "gateway_ipv6": "string",
      "ipv4": "string",
      "ipv6": "string",
      "mtu": 4,
      "auto_negotiation": false,
      "enabled": true
    }
  ]
}