{
  "errors": [],
  "statistics": [
    {
      "owner": "errorJson",
      "description": "New adapter errors available for use",
      "value": 0
    },
    {
      "owner": "errorJson",
      "description": "Adapter errors no longer available for use",
      "value": 0
    },
    {
      "owner": "errorJson",
      "description": "Adapter errors that have been updated (e.g. recommendation changes)",
      "value": 29
    },
    {
      "owner": "packageJson",
      "description": "Number of production dependencies",
      "value": 6
    },
    {
      "owner": "packageJson",
      "description": "Number of development dependencies",
      "value": 9
    },
    {
      "owner": "packageJson",
      "description": "Number of npm scripts",
      "value": 9
    },
    {
      "owner": "packageJson",
      "description": "Runtime Library dependency",
      "value": "^4.9.3"
    },
    {
      "owner": "propertiesSchemaJson",
      "description": "Adapter properties defined in the propertiesSchema file",
      "value": 47
    },
    {
      "owner": "readmeMd",
      "description": "Number of lines in the README.md",
      "value": 450
    },
    {
      "owner": "unitTestJS",
      "description": "Number of lines of code in unit tests",
      "value": 3451
    },
    {
      "owner": "unitTestJS",
      "description": "Number of unit tests",
      "value": 388
    },
    {
      "owner": "integrationTestJS",
      "description": "Number of lines of code in integration tests",
      "value": 8517
    },
    {
      "owner": "integrationTestJS",
      "description": "Number of integration tests",
      "value": 291
    },
    {
      "owner": "staticFile",
      "description": "Number of lines of code in adapterBase.js",
      "value": 484
    },
    {
      "owner": "staticFile",
      "description": "Number of static files added",
      "value": 18
    },
    {
      "owner": "Overall",
      "description": "Total lines of Code",
      "value": 12452
    },
    {
      "owner": "Overall",
      "description": "Total Tests",
      "value": 679
    },
    {
      "owner": "Overall",
      "description": "Total Files",
      "value": 6
    }
  ]
}