{
  "items": [
    {
      "org": "org-acme-0c5027cd98540e76",
      "node": "node-faece15f745e08a0",
      "name": "string",
      "ipv4": "string",
      "remote_as": 1,
      "password": "string",
      "keepalive_time": 1,
      "hold_time": 7
    },
    {
      "org": "org-acme-0c5027cd98540e76",
      "node": "node-faece15f745e08a0",
      "name": "string",
      "ipv4": "string",
      "remote_as": 10,
      "password": "string",
      "keepalive_time": 7,
      "hold_time": 4
    },
    {
      "org": "org-acme-0c5027cd98540e76",
      "node": "node-faece15f745e08a0",
      "name": "string",
      "ipv4": "string",
      "remote_as": 10,
      "password": "string",
      "keepalive_time": 2,
      "hold_time": 7
    }
  ]
}