{
  "org": "string",
  "site": "string",
  "uplink": "string",
  "nets": [
    "string",
    "string",
    "string",
    "string",
    "string",
    "string",
    "string",
    "string",
    "string"
  ],
  "name": "SiteName-cvpn",
  "uid": "string",
  "dev": "string",
  "rgw": "string",
  "auth": "string",
  "psk": "string",
  "x509_local_type": "string",
  "x509_local_key": "string",
  "x509_local_cert": "string",
  "x509_local_cert_subject": "string",
  "x509_remote_auth": "string",
  "x509_remote_cert": "string",
  "x509_remote_cert_subject": "string",
  "x509_remote_ca": "string",
  "x509_remote_ca_subject": "string",
  "ikev": 8,
  "aggressive": true,
  "ikeenc": "string",
  "ikehash": "string",
  "ipsecenc": "string",
  "ipsechash": "string",
  "ikedh": "string",
  "ipsecdh": "string",
  "ike_lifetime": 8,
  "ipsec_lifetime": 8,
  "compress": true,
  "reqid": true,
  "leftid": "string",
  "rightid": "string",
  "fallback": false,
  "inactive": false
}