{
  "actions": [
    {
      "name": "getCvpns",
      "protocol": "REST",
      "method": "GET",
      "entitypath": "{base_path}/{version}/cvpns?{query}",
      "requestSchema": "schema.json",
      "responseSchema": "schema.json",
      "timeout": 0,
      "sendEmpty": false,
      "sendGetBody": false,
      "requestDatatype": "JSON",
      "responseDatatype": "JSON",
      "headers": {},
      "responseObjects": [
        {
          "type": "default",
          "key": "",
          "mockFile": "mockdatafiles/getCvpns-default.json"
        }
      ]
    },
    {
      "name": "getCvpnCvpnid",
      "protocol": "REST",
      "method": "GET",
      "entitypath": "{base_path}/{version}/cvpn/{pathv1}?{query}",
      "requestSchema": "schema.json",
      "responseSchema": "schema.json",
      "timeout": 0,
      "sendEmpty": false,
      "sendGetBody": false,
      "requestDatatype": "JSON",
      "responseDatatype": "JSON",
      "headers": {},
      "responseObjects": [
        {
          "type": "default",
          "key": "",
          "mockFile": "mockdatafiles/getCvpnCvpnid-default.json"
        }
      ]
    },
    {
      "name": "putCvpnCvpnid",
      "protocol": "REST",
      "method": "PUT",
      "entitypath": "{base_path}/{version}/cvpn/{pathv1}?{query}",
      "requestSchema": "schema.json",
      "responseSchema": "schema.json",
      "timeout": 0,
      "sendEmpty": false,
      "sendGetBody": false,
      "requestDatatype": "JSON",
      "responseDatatype": "JSON",
      "headers": {},
      "responseObjects": [
        {
          "type": "default",
          "key": "",
          "mockFile": "mockdatafiles/putCvpnCvpnid-default.json"
        }
      ]
    },
    {
      "name": "deleteCvpnCvpnid",
      "protocol": "REST",
      "method": "DELETE",
      "entitypath": "{base_path}/{version}/cvpn/{pathv1}?{query}",
      "requestSchema": "schema.json",
      "responseSchema": "schema.json",
      "timeout": 0,
      "sendEmpty": false,
      "sendGetBody": false,
      "requestDatatype": "JSON",
      "responseDatatype": "JSON",
      "headers": {},
      "responseObjects": [
        {
          "type": "default",
          "key": "",
          "mockFile": ""
        }
      ]
    },
    {
      "name": "getOrgOrgidCvpns",
      "protocol": "REST",
      "method": "GET",
      "entitypath": "{base_path}/{version}/org/{pathv1}/cvpns?{query}",
      "requestSchema": "schema.json",
      "responseSchema": "schema.json",
      "timeout": 0,
      "sendEmpty": false,
      "sendGetBody": false,
      "requestDatatype": "JSON",
      "responseDatatype": "JSON",
      "headers": {},
      "responseObjects": [
        {
          "type": "default",
          "key": "",
          "mockFile": "mockdatafiles/getOrgOrgidCvpns-default.json"
        }
      ]
    },
    {
      "name": "postOrgOrgidCvpns",
      "protocol": "REST",
      "method": "POST",
      "entitypath": "{base_path}/{version}/org/{pathv1}/cvpns?{query}",
      "requestSchema": "schema.json",
      "responseSchema": "schema.json",
      "timeout": 0,
      "sendEmpty": false,
      "sendGetBody": false,
      "requestDatatype": "JSON",
      "responseDatatype": "JSON",
      "headers": {},
      "responseObjects": [
        {
          "type": "default",
          "key": "",
          "mockFile": "mockdatafiles/postOrgOrgidCvpns-default.json"
        }
      ]
    },
    {
      "name": "getCvpnCvpnidNetid",
      "protocol": "REST",
      "method": "GET",
      "entitypath": "{base_path}/{version}/cvpn/{pathv1}/{pathv2}?{query}",
      "requestSchema": "schema.json",
      "responseSchema": "schema.json",
      "timeout": 0,
      "sendEmpty": false,
      "sendGetBody": false,
      "requestDatatype": "JSON",
      "responseDatatype": "JSON",
      "headers": {},
      "responseObjects": [
        {
          "type": "default",
          "key": "",
          "mockFile": "mockdatafiles/getCvpnCvpnidNetid-default.json"
        }
      ]
    },
    {
      "name": "putCvpnCvpnidNetid",
      "protocol": "REST",
      "method": "PUT",
      "entitypath": "{base_path}/{version}/cvpn/{pathv1}/{pathv2}?{query}",
      "requestSchema": "schema.json",
      "responseSchema": "schema.json",
      "timeout": 0,
      "sendEmpty": false,
      "sendGetBody": false,
      "requestDatatype": "JSON",
      "responseDatatype": "JSON",
      "headers": {},
      "responseObjects": [
        {
          "type": "default",
          "key": "",
          "mockFile": "mockdatafiles/putCvpnCvpnidNetid-default.json"
        }
      ]
    },
    {
      "name": "deleteCvpnCvpnidNetid",
      "protocol": "REST",
      "method": "DELETE",
      "entitypath": "{base_path}/{version}/cvpn/{pathv1}/{pathv2}?{query}",
      "requestSchema": "schema.json",
      "responseSchema": "schema.json",
      "timeout": 0,
      "sendEmpty": false,
      "sendGetBody": false,
      "requestDatatype": "JSON",
      "responseDatatype": "JSON",
      "headers": {},
      "responseObjects": [
        {
          "type": "default",
          "key": "",
          "mockFile": ""
        }
      ]
    }
  ]
}