{
  "id": "string",
  "name": "string",
  "org": "string",
  "users": [
    "string",
    "string",
    "string",
    "string",
    "string",
    "string",
    "string"
  ],
  "active": true,
  "devices": [
    "string",
    "string",
    "string",
    "string",
    "string",
    "string",
    "string",
    "string",
    "string",
    "string"
  ],
  "zones": [
    "string",
    "string",
    "string",
    "string",
    "string",
    "string",
    "string"
  ],
  "apps": [
    "string",
    "string"
  ],
  "sapps": "string",
  "srctype": "all",
  "source_zones": [
    "string",
    "string",
    "string",
    "string",
    "string"
  ],
  "dsttype": "string",
  "tags": "string",
  "allow": false,
  "usergrps": [
    "string",
    "string"
  ],
  "devgrps": [
    "string",
    "string",
    "string",
    "string",
    "string",
    "string"
  ],
  "appgrps": [
    "string",
    "string",
    "string"
  ]
}