{
  "name": "adapter-steel_connect",
  "webName": "Adapter for Integration to Riverbed SteelConnect",
  "supportLevel": "community",
  "vendor": "Riverbed",
  "product": "SteelConnect",
  "techAlliance": false,
  "osVersion": [],
  "apiVersions": [],
  "iapVersions": [
    "2021.1.x",
    "2021.2.x",
    "2022.1.x",
    "2023.1.x"
  ],
  "method": "REST",
  "type": "Adapter",
  "domains": [
    "SD-WAN (SASE)"
  ],
  "tags": [
    "Network Infrastructure Changes",
    "Configuration & Compliance",
    "Software Upgrades & Device Maintenance"
  ],
  "useCases": [
    "Run network compliance checks and remediation",
    "Port/VLAN Configuration",
    "Software Upgrade",
    "Cloud Managed Networks",
    "Router configuration backup or restore",
    "Determine configuration drift",
    "Device Onboarding",
    "Port Turn-up"
  ],
  "deprecated": {
    "isDeprecated": false
  },
  "brokerSince": "",
  "authMethods": [
    {
      "type": "Basic Auth",
      "subtypes": [],
      "primary": true
    }
  ],
  "documentation": {
    "storeLink": "",
    "npmLink": "https://www.npmjs.com/package/@itentialopensource/adapter-steel_connect",
    "repoLink": "https://gitlab.com/itentialopensource/adapters/adapter-steel_connect",
    "docLink": "https://gitlab.com/itentialopensource/adapters/adapter-steel_connect/-/blob/master/README.md?ref_type=heads",
    "demoLinks": [
      {
        "title": "Itential SD-WAN Network Automation Solution",
        "link": "https://www.itential.com/industries/communications-service-providers/sdwan-network-automation/"
      },
      {
        "title": "Multi-Vendor SD-WAN",
        "link": "https://www.itential.com/solutions/sdwan-automation-orchestration/"
      }
    ],
    "trainingLinks": [
      {
        "title": "Itential Academy",
        "link": "https://www.itential.com/itential-academy/"
      }
    ],
    "faqLink": "https://docs.itential.com/opensource/docs/troubleshooting-an-adapter",
    "contributeLink": "https://gitlab.com/itentialopensource/adapters/contributing-guide",
    "issueLink": "https://itential.atlassian.net/servicedesk/customer/portals",
    "webLink": "https://www.itential.com/adapters/riverbed-steelconnect/",
    "vendorLink": "https://www.riverbed.com/",
    "productLink": "https://support.riverbed.com/bin/support/static/179ojgs83ca871oe9bpqhr3t30/html/fk6gkjg9hjl0e9b516mbasv2cf/sc_ug_html/index.html#page/scm/overview.html",
    "apiLinks": [
      {
        "title": "Riverbed SteelConnect API",
        "link": "https://support.riverbed.com/bin/support/static/9fq28fgkb3med9kc5so2r9a2v0/html/gs0er647apkcr6dra5ee6p74h8/sc_ug_html/index.html#page/sc_ug/api_intro.html",
        "public": true
      }
    ],
    "workshopLinks": [],
    "workshopHomePage": "https://www.itential.com/get-started/"
  },
  "assets": [],
  "relatedItems": {
    "adapters": [],
    "integrations": [],
    "ecosystemApplications": [],
    "workflowProjects": [],
    "transformationProjects": [],
    "exampleProjects": []
  }
}