{
  "items": [
    {
      "id": "string",
      "org": "string",
      "name": "LAN",
      "site": "site-HQ-986eec1d96090b93",
      "networks": [
        "string",
        "string",
        "string",
        "string",
        "string",
        "string",
        "string",
        "string",
        "string",
        "string"
      ],
      "mgmt": "string",
      "icmp": "all",
      "guest": "string",
      "breakout_preference": [
        "string",
        "string"
      ],
      "routes": [
        "string",
        "string",
        "string",
        "string",
        "string",
        "string",
        "string"
      ],
      "bcasts": [
        "string",
        "string",
        "string",
        "string",
        "string",
        "string"
      ],
      "tag": 1000,
      "tags": "string"
    },
    {
      "id": "string",
      "org": "string",
      "name": "LAN",
      "site": "site-HQ-986eec1d96090b93",
      "networks": [
        "string",
        "string"
      ],
      "mgmt": "string",
      "icmp": "all",
      "guest": "string",
      "breakout_preference": [
        "string",
        "string",
        "string",
        "string"
      ],
      "routes": [
        "string",
        "string",
        "string",
        "string",
        "string",
        "string",
        "string"
      ],
      "bcasts": [
        "string",
        "string",
        "string"
      ],
      "tag": 1000,
      "tags": "string"
    },
    {
      "id": "string",
      "org": "string",
      "name": "LAN",
      "site": "site-HQ-986eec1d96090b93",
      "networks": [
        "string",
        "string",
        "string",
        "string",
        "string",
        "string"
      ],
      "mgmt": "string",
      "icmp": "all",
      "guest": "string",
      "breakout_preference": [
        "string",
        "string",
        "string",
        "string",
        "string"
      ],
      "routes": [
        "string",
        "string",
        "string"
      ],
      "bcasts": [
        "string",
        "string",
        "string",
        "string",
        "string",
        "string",
        "string"
      ],
      "tag": 1000,
      "tags": "string"
    },
    {
      "id": "string",
      "org": "string",
      "name": "LAN",
      "site": "site-HQ-986eec1d96090b93",
      "networks": [
        "string",
        "string",
        "string"
      ],
      "mgmt": "string",
      "icmp": "all",
      "guest": "string",
      "breakout_preference": [
        "string",
        "string",
        "string",
        "string",
        "string",
        "string",
        "string",
        "string",
        "string",
        "string"
      ],
      "routes": [
        "string",
        "string",
        "string",
        "string",
        "string",
        "string",
        "string",
        "string",
        "string"
      ],
      "bcasts": [
        "string",
        "string",
        "string",
        "string",
        "string",
        "string"
      ],
      "tag": 1000,
      "tags": "string"
    },
    {
      "id": "string",
      "org": "string",
      "name": "LAN",
      "site": "site-HQ-986eec1d96090b93",
      "networks": [
        "string",
        "string",
        "string",
        "string",
        "string"
      ],
      "mgmt": "string",
      "icmp": "all",
      "guest": "string",
      "breakout_preference": [
        "string",
        "string"
      ],
      "routes": [
        "string",
        "string",
        "string",
        "string",
        "string",
        "string",
        "string"
      ],
      "bcasts": [
        "string",
        "string"
      ],
      "tag": 1000,
      "tags": "string"
    },
    {
      "id": "string",
      "org": "string",
      "name": "LAN",
      "site": "site-HQ-986eec1d96090b93",
      "networks": [
        "string",
        "string",
        "string",
        "string",
        "string",
        "string",
        "string",
        "string",
        "string"
      ],
      "mgmt": "string",
      "icmp": "all",
      "guest": "string",
      "breakout_preference": [
        "string",
        "string",
        "string",
        "string",
        "string",
        "string",
        "string",
        "string",
        "string",
        "string"
      ],
      "routes": [
        "string",
        "string",
        "string",
        "string",
        "string"
      ],
      "bcasts": [
        "string",
        "string",
        "string",
        "string",
        "string",
        "string",
        "string",
        "string",
        "string"
      ],
      "tag": 1000,
      "tags": "string"
    },
    {
      "id": "string",
      "org": "string",
      "name": "LAN",
      "site": "site-HQ-986eec1d96090b93",
      "networks": [
        "string",
        "string",
        "string",
        "string",
        "string",
        "string",
        "string",
        "string",
        "string"
      ],
      "mgmt": "string",
      "icmp": "all",
      "guest": "string",
      "breakout_preference": [
        "string",
        "string",
        "string"
      ],
      "routes": [
        "string",
        "string",
        "string",
        "string",
        "string",
        "string",
        "string"
      ],
      "bcasts": [
        "string",
        "string",
        "string",
        "string",
        "string",
        "string",
        "string",
        "string"
      ],
      "tag": 1000,
      "tags": "string"
    },
    {
      "id": "string",
      "org": "string",
      "name": "LAN",
      "site": "site-HQ-986eec1d96090b93",
      "networks": [
        "string",
        "string",
        "string",
        "string",
        "string",
        "string"
      ],
      "mgmt": "string",
      "icmp": "all",
      "guest": "string",
      "breakout_preference": [
        "string",
        "string"
      ],
      "routes": [
        "string",
        "string",
        "string"
      ],
      "bcasts": [
        "string",
        "string",
        "string",
        "string",
        "string",
        "string",
        "string"
      ],
      "tag": 1000,
      "tags": "string"
    },
    {
      "id": "string",
      "org": "string",
      "name": "LAN",
      "site": "site-HQ-986eec1d96090b93",
      "networks": [
        "string",
        "string",
        "string",
        "string",
        "string",
        "string",
        "string"
      ],
      "mgmt": "string",
      "icmp": "all",
      "guest": "string",
      "breakout_preference": [
        "string",
        "string",
        "string",
        "string",
        "string",
        "string",
        "string"
      ],
      "routes": [
        "string",
        "string",
        "string",
        "string",
        "string",
        "string",
        "string"
      ],
      "bcasts": [
        "string",
        "string"
      ],
      "tag": 1000,
      "tags": "string"
    },
    {
      "id": "string",
      "org": "string",
      "name": "LAN",
      "site": "site-HQ-986eec1d96090b93",
      "networks": [
        "string",
        "string",
        "string",
        "string",
        "string",
        "string",
        "string"
      ],
      "mgmt": "string",
      "icmp": "all",
      "guest": "string",
      "breakout_preference": [
        "string",
        "string",
        "string",
        "string",
        "string"
      ],
      "routes": [
        "string",
        "string",
        "string",
        "string"
      ],
      "bcasts": [
        "string",
        "string",
        "string",
        "string",
        "string",
        "string"
      ],
      "tag": 1000,
      "tags": "string"
    }
  ]
}