{
  "items": [
    {
      "id": "string",
      "site": "site-test-57e69c851c6147b4",
      "org": "org-example-8a882293bfddffaf",
      "name": "string",
      "failover": 4,
      "members": [
        "string",
        "string",
        "string",
        "string",
        "string",
        "string"
      ],
      "dcuplinks": [
        "string",
        "string",
        "string",
        "string",
        "string"
      ],
      "url": "string",
      "bgp_graceful_restart": 3,
      "bgp_tep_community_type": "string",
      "bgp_tep_community": 1,
      "bgp_branch_community_type": "string",
      "bgp_branch_community": "string",
      "bgp_deployment_mode": 9,
      "bgp_subnet_splitting": 4,
      "bgp_interceptor": 7,
      "proxy_ip": "string"
    },
    {
      "id": "string",
      "site": "site-test-57e69c851c6147b4",
      "org": "org-example-8a882293bfddffaf",
      "name": "string",
      "failover": 6,
      "members": [
        "string",
        "string",
        "string"
      ],
      "dcuplinks": [
        "string",
        "string",
        "string"
      ],
      "url": "string",
      "bgp_graceful_restart": 8,
      "bgp_tep_community_type": "string",
      "bgp_tep_community": 3,
      "bgp_branch_community_type": "string",
      "bgp_branch_community": "string",
      "bgp_deployment_mode": 8,
      "bgp_subnet_splitting": 1,
      "bgp_interceptor": 10,
      "proxy_ip": "string"
    },
    {
      "id": "string",
      "site": "site-test-57e69c851c6147b4",
      "org": "org-example-8a882293bfddffaf",
      "name": "string",
      "failover": 8,
      "members": [
        "string",
        "string",
        "string",
        "string",
        "string",
        "string"
      ],
      "dcuplinks": [
        "string",
        "string"
      ],
      "url": "string",
      "bgp_graceful_restart": 1,
      "bgp_tep_community_type": "string",
      "bgp_tep_community": 4,
      "bgp_branch_community_type": "string",
      "bgp_branch_community": "string",
      "bgp_deployment_mode": 2,
      "bgp_subnet_splitting": 4,
      "bgp_interceptor": 7,
      "proxy_ip": "string"
    },
    {
      "id": "string",
      "site": "site-test-57e69c851c6147b4",
      "org": "org-example-8a882293bfddffaf",
      "name": "string",
      "failover": 2,
      "members": [
        "string",
        "string",
        "string",
        "string",
        "string",
        "string",
        "string",
        "string"
      ],
      "dcuplinks": [
        "string",
        "string",
        "string",
        "string",
        "string",
        "string",
        "string",
        "string"
      ],
      "url": "string",
      "bgp_graceful_restart": 2,
      "bgp_tep_community_type": "string",
      "bgp_tep_community": 1,
      "bgp_branch_community_type": "string",
      "bgp_branch_community": "string",
      "bgp_deployment_mode": 8,
      "bgp_subnet_splitting": 6,
      "bgp_interceptor": 2,
      "proxy_ip": "string"
    }
  ]
}