{
  "cloud": "zscalerone",
  "psk": "asdgasdgasdfa",
  "site_settings": [
    {
      "site_id": "site-HQ-aa2fad51a350e8a3",
      "site_name": "site-HQ-aa2fad51a350e8a3",
      "vpnid": "si13e2cdda@oo888aed3c573c65.dnslabel.net",
      "primary_zen": "proxyservice-152834f6bac28265",
      "secondary_zen": "proxyservice-152834f6bac28265",
      "mode": "automatic"
    },
    {
      "site_id": "site-HQ-aa2fad51a350e8a3",
      "site_name": "site-HQ-aa2fad51a350e8a3",
      "vpnid": "si13e2cdda@oo888aed3c573c65.dnslabel.net",
      "primary_zen": "proxyservice-152834f6bac28265",
      "secondary_zen": "proxyservice-152834f6bac28265",
      "mode": "automatic"
    },
    {
      "site_id": "site-HQ-aa2fad51a350e8a3",
      "site_name": "site-HQ-aa2fad51a350e8a3",
      "vpnid": "si13e2cdda@oo888aed3c573c65.dnslabel.net",
      "primary_zen": "proxyservice-152834f6bac28265",
      "secondary_zen": "proxyservice-152834f6bac28265",
      "mode": "automatic"
    },
    {
      "site_id": "site-HQ-aa2fad51a350e8a3",
      "site_name": "site-HQ-aa2fad51a350e8a3",
      "vpnid": "si13e2cdda@oo888aed3c573c65.dnslabel.net",
      "primary_zen": "proxyservice-152834f6bac28265",
      "secondary_zen": "proxyservice-152834f6bac28265",
      "mode": "automatic"
    },
    {
      "site_id": "site-HQ-aa2fad51a350e8a3",
      "site_name": "site-HQ-aa2fad51a350e8a3",
      "vpnid": "si13e2cdda@oo888aed3c573c65.dnslabel.net",
      "primary_zen": "proxyservice-152834f6bac28265",
      "secondary_zen": "proxyservice-152834f6bac28265",
      "mode": "automatic"
    },
    {
      "site_id": "site-HQ-aa2fad51a350e8a3",
      "site_name": "site-HQ-aa2fad51a350e8a3",
      "vpnid": "si13e2cdda@oo888aed3c573c65.dnslabel.net",
      "primary_zen": "proxyservice-152834f6bac28265",
      "secondary_zen": "proxyservice-152834f6bac28265",
      "mode": "automatic"
    },
    {
      "site_id": "site-HQ-aa2fad51a350e8a3",
      "site_name": "site-HQ-aa2fad51a350e8a3",
      "vpnid": "si13e2cdda@oo888aed3c573c65.dnslabel.net",
      "primary_zen": "proxyservice-152834f6bac28265",
      "secondary_zen": "proxyservice-152834f6bac28265",
      "mode": "automatic"
    },
    {
      "site_id": "site-HQ-aa2fad51a350e8a3",
      "site_name": "site-HQ-aa2fad51a350e8a3",
      "vpnid": "si13e2cdda@oo888aed3c573c65.dnslabel.net",
      "primary_zen": "proxyservice-152834f6bac28265",
      "secondary_zen": "proxyservice-152834f6bac28265",
      "mode": "automatic"
    }
  ]
}