{
  "actions": [
    {
      "name": "getPrefixes",
      "protocol": "REST",
      "method": "GET",
      "entitypath": "{base_path}/{version}/prefixes?{query}",
      "requestSchema": "schema.json",
      "responseSchema": "schema.json",
      "timeout": 0,
      "sendEmpty": false,
      "sendGetBody": false,
      "requestDatatype": "JSON",
      "responseDatatype": "JSON",
      "headers": {},
      "responseObjects": [
        {
          "type": "default",
          "key": "",
          "mockFile": "mockdatafiles/getPrefixes-default.json"
        }
      ]
    },
    {
      "name": "getPrefixesPrefixid",
      "protocol": "REST",
      "method": "GET",
      "entitypath": "{base_path}/{version}/prefixes/{pathv1}?{query}",
      "requestSchema": "schema.json",
      "responseSchema": "schema.json",
      "timeout": 0,
      "sendEmpty": false,
      "sendGetBody": false,
      "requestDatatype": "JSON",
      "responseDatatype": "JSON",
      "headers": {},
      "responseObjects": [
        {
          "type": "default",
          "key": "",
          "mockFile": "mockdatafiles/getPrefixesPrefixid-default.json"
        }
      ]
    },
    {
      "name": "putPrefixesPrefixid",
      "protocol": "REST",
      "method": "PUT",
      "entitypath": "{base_path}/{version}/prefixes/{pathv1}?{query}",
      "requestSchema": "schema.json",
      "responseSchema": "schema.json",
      "timeout": 0,
      "sendEmpty": false,
      "sendGetBody": false,
      "requestDatatype": "JSON",
      "responseDatatype": "JSON",
      "headers": {},
      "responseObjects": [
        {
          "type": "default",
          "key": "",
          "mockFile": "mockdatafiles/putPrefixesPrefixid-default.json"
        }
      ]
    },
    {
      "name": "deletePrefixesPrefixid",
      "protocol": "REST",
      "method": "DELETE",
      "entitypath": "{base_path}/{version}/prefixes/{pathv1}?{query}",
      "requestSchema": "schema.json",
      "responseSchema": "schema.json",
      "timeout": 0,
      "sendEmpty": false,
      "sendGetBody": false,
      "requestDatatype": "JSON",
      "responseDatatype": "JSON",
      "headers": {},
      "responseObjects": [
        {
          "type": "default",
          "key": "",
          "mockFile": ""
        }
      ]
    },
    {
      "name": "getOrgOrgidPrefix",
      "protocol": "REST",
      "method": "GET",
      "entitypath": "{base_path}/{version}/org/{pathv1}/prefix?{query}",
      "requestSchema": "schema.json",
      "responseSchema": "schema.json",
      "timeout": 0,
      "sendEmpty": false,
      "sendGetBody": false,
      "requestDatatype": "JSON",
      "responseDatatype": "JSON",
      "headers": {},
      "responseObjects": [
        {
          "type": "default",
          "key": "",
          "mockFile": "mockdatafiles/getOrgOrgidPrefix-default.json"
        }
      ]
    },
    {
      "name": "postOrgOrgidPrefix",
      "protocol": "REST",
      "method": "POST",
      "entitypath": "{base_path}/{version}/org/{pathv1}/prefix?{query}",
      "requestSchema": "schema.json",
      "responseSchema": "schema.json",
      "timeout": 0,
      "sendEmpty": false,
      "sendGetBody": false,
      "requestDatatype": "JSON",
      "responseDatatype": "JSON",
      "headers": {},
      "responseObjects": [
        {
          "type": "default",
          "key": "",
          "mockFile": "mockdatafiles/postOrgOrgidPrefix-default.json"
        }
      ]
    }
  ]
}