{
  "name": "string",
  "webcat": "string",
  "sapps": "string",
  "org": "string",
  "predefined": "string",
  "apps": [
    "string",
    "string",
    "string",
    "string"
  ],
  "id": "string",
  "desc": "string"
}