{
  "items": [
    {
      "siteid": "site-abcd1234",
      "type": "{'type' : 'Standard_DS2_v2'}",
      "wanopt": "{'wanopt' : 'm4.large'}",
      "deployRedundant": "{'deployRedundant' : 0}",
      "awsrouting": "{'awsrouting' : 'manual'}",
      "uplinktype": "{'uplinktype' : 'vpc_peer'}",
      "routing": "{'routing' : 'auto'}"
    },
    {
      "siteid": "site-abcd1234",
      "type": "{'type' : 'Standard_DS2_v2'}",
      "wanopt": "{'wanopt' : 'm4.large'}",
      "deployRedundant": "{'deployRedundant' : 0}",
      "awsrouting": "{'awsrouting' : 'manual'}",
      "uplinktype": "{'uplinktype' : 'vpc_peer'}",
      "routing": "{'routing' : 'auto'}"
    },
    {
      "siteid": "site-abcd1234",
      "type": "{'type' : 'Standard_DS2_v2'}",
      "wanopt": "{'wanopt' : 'm4.large'}",
      "deployRedundant": "{'deployRedundant' : 0}",
      "awsrouting": "{'awsrouting' : 'manual'}",
      "uplinktype": "{'uplinktype' : 'vpc_peer'}",
      "routing": "{'routing' : 'auto'}"
    },
    {
      "siteid": "site-abcd1234",
      "type": "{'type' : 'Standard_DS2_v2'}",
      "wanopt": "{'wanopt' : 'm4.large'}",
      "deployRedundant": "{'deployRedundant' : 0}",
      "awsrouting": "{'awsrouting' : 'manual'}",
      "uplinktype": "{'uplinktype' : 'vpc_peer'}",
      "routing": "{'routing' : 'auto'}"
    },
    {
      "siteid": "site-abcd1234",
      "type": "{'type' : 'Standard_DS2_v2'}",
      "wanopt": "{'wanopt' : 'm4.large'}",
      "deployRedundant": "{'deployRedundant' : 0}",
      "awsrouting": "{'awsrouting' : 'manual'}",
      "uplinktype": "{'uplinktype' : 'vpc_peer'}",
      "routing": "{'routing' : 'auto'}"
    }
  ]
}