{
  "id": "shprimary-45a4daaa5c988347",
  "sh_primary_ipv4": "10.20.30.40/24",
  "sh_primary_gwv4": "1.2.3.4",
  "net": "net-Net-2e8cba8f8e39ae08",
  "node": "node-d7ceafbda4ebbe70",
  "org": "org-RVBD-d7ceafbda4ebbe70"
}