{
  "items": [
    {
      "cluster": "string",
      "org": "string",
      "net": "string",
      "public_ipv4": "string",
      "public_ipv6": "string",
      "wan": "string",
      "tags": "string"
    },
    {
      "cluster": "string",
      "org": "string",
      "net": "string",
      "public_ipv4": "string",
      "public_ipv6": "string",
      "wan": "string",
      "tags": "string"
    },
    {
      "cluster": "string",
      "org": "string",
      "net": "string",
      "public_ipv4": "string",
      "public_ipv6": "string",
      "wan": "string",
      "tags": "string"
    },
    {
      "cluster": "string",
      "org": "string",
      "net": "string",
      "public_ipv4": "string",
      "public_ipv6": "string",
      "wan": "string",
      "tags": "string"
    },
    {
      "cluster": "string",
      "org": "string",
      "net": "string",
      "public_ipv4": "string",
      "public_ipv6": "string",
      "wan": "string",
      "tags": "string"
    }
  ]
}