{
  "id": "SDDEDGERTSDGAGASG",
  "name": "Examplecorp",
  "street_address": "Examplecorp, Root Road 14, 12345 Adminten",
  "city": "New York",
  "contact": "root@examplecorp.com, Mrs Alice Example, Root Road 14, 12345 Adminten",
  "uid": 2,
  "realm": "realm",
  "gid": "string",
  "longname": "The example corporation",
  "country": "DE",
  "timezone": "Europe/Berlin",
  "ssh": "takes 1 or 0",
  "ssh_keys": "ssh-rsa AAAAB3N...zaC1yc2EAAAA user@host",
  "console_login_pw": "tjKmC7bEOheH",
  "maint_override_realm": "take 1 or 0.",
  "maint_window_wday": "1 will configure Monday and 7 will configure Sunday.",
  "maint_window_time": "takes in time \"04:00\" or \"16:30\".",
  "maint_immediate": "takes 1 or 0.",
  "wan_opt": "string",
  "wans": [
    "string",
    "string",
    "string",
    "string",
    "string"
  ],
  "vlan_base": "takes an integer like 1000",
  "ipv4_netpool": "takes an IPv4 net pool like 172.16.0.0/12",
  "ipv6_netpool": "takes an IPv6 net pool like fd00:ced0:ced0::/48",
  "ad_bindpass": "string",
  "ad_binduser": "string",
  "ad_domain": "intranet.company.com",
  "ad_ldap_base": "OU=Staff",
  "ad_ldap_filter": "(&(objectClass=user)(objectCategory=person))",
  "ad_ldap_group_filter": "(objectCategory=group)",
  "ad_ldap_server": "ldaps://example.com:636",
  "ad_mode": "bridge",
  "ad_sync_node": "node-024197ce83988201",
  "dir_live": false,
  "dir_type": "string",
  "facebook_application_id": "string",
  "facebook_application_secret": "string",
  "google_api_client_id": "string",
  "google_api_client_secret": "string",
  "google_api_domain": "acme-inc.com",
  "google_api_iss": "string",
  "google_api_pem_private_key": "string",
  "google_api_prn": "string",
  "twitter_api_consumer_key": "string",
  "twitter_api_consumer_secret": "string",
  "walled_garden_extra": "string",
  "breakout_preference": [
    "string",
    "string",
    "string",
    "string",
    "string",
    "string",
    "string"
  ],
  "breakout_sitelink_site": "This takes a site ID.",
  "legal_disclaimer_state": false,
  "legal_disclaimer_text": "string",
  "ntp": "string"
}