{
  "id": "string",
  "org": "string",
  "ceexportpolicy": "string",
  "default_originate": false,
  "filters": [
    "string",
    "string",
    "string",
    "string",
    "string",
    "string",
    "string",
    "string",
    "string"
  ],
  "uplinks": [
    "string"
  ]
}