{
  "actions": [
    {
      "name": "getShprimaryShprimaryid",
      "protocol": "REST",
      "method": "GET",
      "entitypath": "{base_path}/{version}/shprimary/{pathv1}?{query}",
      "requestSchema": "schema.json",
      "responseSchema": "schema.json",
      "timeout": 0,
      "sendEmpty": false,
      "sendGetBody": false,
      "requestDatatype": "JSON",
      "responseDatatype": "JSON",
      "headers": {},
      "responseObjects": [
        {
          "type": "default",
          "key": "",
          "mockFile": "mockdatafiles/getShprimaryShprimaryid-default.json"
        }
      ]
    },
    {
      "name": "putShprimaryShprimaryid",
      "protocol": "REST",
      "method": "PUT",
      "entitypath": "{base_path}/{version}/shprimary/{pathv1}?{query}",
      "requestSchema": "schema.json",
      "responseSchema": "schema.json",
      "timeout": 0,
      "sendEmpty": false,
      "sendGetBody": false,
      "requestDatatype": "JSON",
      "responseDatatype": "JSON",
      "headers": {},
      "responseObjects": [
        {
          "type": "default",
          "key": "",
          "mockFile": "mockdatafiles/putShprimaryShprimaryid-default.json"
        }
      ]
    }
  ]
}