{
  "activeAppliance": "PRIMARY",
  "capacity": 10,
  "disabled": true,
  "droppedFlowsPerSecond": 10,
  "flowLimit": 5,
  "flowLoad": 1,
  "flowsPerSecond": 4,
  "interfaceLimit": 4,
  "ip": "string",
  "master": true,
  "model": "string",
  "name": "string",
  "netflowDeviceCount": 8,
  "netflowInterfaceCount": 9,
  "primaryIp": "string",
  "processedFlowsPerSecond": 9,
  "secondaryIp": "string",
  "serverId": 6,
  "serverLoad": 4,
  "telephonyActiveCallsLimit": 1,
  "telephonyPhones": 4,
  "telephonyPhonesLimit": 5,
  "totalCapacity": 10,
  "totalLoad": 5,
  "virtualIp": "string"
}