{
  "content": [
    {
      "description": "string",
      "emailTo": "string",
      "folderId": 2,
      "id": 7,
      "isEmailed": true,
      "isFtped": false,
      "isPrivate": false,
      "isReadOnly": false,
      "isTemporary": false,
      "lastAccessed": 10,
      "lastModified": 8,
      "message": "string",
      "migrated": 10,
      "name": "string",
      "nextRun": 10,
      "numberOfColumns": 6,
      "runUnit": "string",
      "runValue": 9,
      "templateType": "string",
      "timezone": "string",
      "userId": 5,
      "userRoleId": 6
    }
  ],
  "pageNumber": 8,
  "pageSize": 7,
  "totalElements": 5,
  "totalPages": 4
}