{
  "bar": {
    "drawGraphOutline": false,
    "prettyXAxis": true,
    "prettyYAxis": true,
    "scaleToMinimumValue": true,
    "scaled": false,
    "showAggregation": false,
    "showAverage": true,
    "showFrequency": false,
    "showLast": false,
    "showLegend": true,
    "showPeak": false,
    "showTimespan": true,
    "showTitle": true,
    "showValley": true
  },
  "pie": {
    "showAggregation": true,
    "showAverage": true,
    "showFrequency": true,
    "showLast": true,
    "showLegend": true,
    "showPeak": true,
    "showTimespan": false,
    "showTitle": false,
    "showValley": true
  },
  "table": {
    "columnSetting": {
      "exclude": [
        "string",
        "string",
        "string",
        "string",
        "string",
        "string",
        "string",
        "string",
        "string"
      ],
      "include": [
        "string",
        "string",
        "string",
        "string",
        "string",
        "string"
      ]
    },
    "csvSetting": {
      "expandTimeseries": true,
      "formatTimestamp": false
    },
    "dataPresentationSetting": {
      "formatNumbers": true,
      "precision": 1
    },
    "tableSetting": {
      "blockVis": true,
      "hideHeaders": true,
      "wrapCells": false
    }
  }
}