{
  "actions": [
    {
      "name": "getDeviceComponents",
      "protocol": "REST",
      "method": "GET",
      "entitypath": "{base_path}/{version}/devices/{pathv1}/objects/{pathv2}?{query}",
      "requestSchema": "schema.json",
      "responseSchema": "schema.json",
      "timeout": 0,
      "sendEmpty": false,
      "sendGetBody": false,
      "requestDatatype": "JSON",
      "responseDatatype": "JSON",
      "headers": {},
      "responseObjects": [
        {
          "type": "withpathv2",
          "key": "",
          "mockFile": "mockdatafiles/getdevicecompsingle.json"
        },
        {
          "type": "default",
          "key": "content",
          "mockFile": "mockdatafiles/getdevicecompmultiple.json"
        }
      ]
    },
    {
      "name": "getDeviceComponentsFiltered",
      "protocol": "REST",
      "method": "POST",
      "entitypath": "{base_path}/{version}/devices/objects/filter?{query}",
      "requestSchema": "schema.json",
      "responseSchema": "schema.json",
      "timeout": 0,
      "sendEmpty": false,
      "sendGetBody": false,
      "requestDatatype": "JSON",
      "responseDatatype": "JSON",
      "headers": {},
      "responseObjects": [
        {
          "type": "default",
          "key": "",
          "mockFile": "mockdatafiles/getdevicecompfilter.json"
        }
      ]
    },
    {
      "name": "createDeviceComponent",
      "protocol": "REST",
      "method": "POST",
      "entitypath": "{base_path}/{version}/devices/{pathv1}/objects?{query}",
      "requestSchema": "schema.json",
      "responseSchema": "schema.json",
      "timeout": 0,
      "sendEmpty": false,
      "sendGetBody": false,
      "requestDatatype": "JSON",
      "responseDatatype": "JSON",
      "headers": {},
      "responseObjects": [
        {
          "type": "default",
          "key": "",
          "mockFile": "mockdatafiles/postdevicecomp.json"
        }
      ]
    },
    {
      "name": "updateDeviceComponent",
      "protocol": "REST",
      "method": "PUT",
      "entitypath": "{base_path}/{version}/devices/{pathv1}/objects/{pathv2}?{query}",
      "requestSchema": "schema.json",
      "responseSchema": "schema.json",
      "timeout": 0,
      "sendEmpty": false,
      "sendGetBody": false,
      "requestDatatype": "JSON",
      "responseDatatype": "JSON",
      "headers": {},
      "responseObjects": [
        {
          "type": "default",
          "key": "",
          "mockFile": "mockdatafiles/putdevicecomp.json"
        }
      ]
    },
    {
      "name": "deleteDeviceComponent",
      "protocol": "REST",
      "method": "DELETE",
      "entitypath": "{base_path}/{version}/devices/{pathv1}/objects/{pathv2}?{query}",
      "requestSchema": "schema.json",
      "responseSchema": "schema.json",
      "timeout": 0,
      "sendEmpty": false,
      "sendGetBody": false,
      "requestDatatype": "JSON",
      "responseDatatype": "JSON",
      "headers": {},
      "responseObjects": [
        {
          "type": "default",
          "key": "",
          "mockFile": "mockdatafiles/deletedevicecomp.json"
        }
      ]
    }
  ]
}