{
  "alertSetting": {
    "defaultView": "devices",
    "eventSummary": false,
    "inlcudeMaintenanceWindowAlerts": true
  },
  "resultLimitSetting": {
    "resultLimit": 1
  },
  "sourceFieldsSetting": {
    "fields": [
      "string",
      "string",
      "string",
      "string",
      "string",
      "string",
      "string",
      "string",
      "string",
      "string"
    ],
    "sort": [
      [
        "string",
        "string",
        "string",
        "string",
        "string",
        "string",
        "string"
      ],
      [
        "string",
        "string",
        "string",
        "string"
      ],
      [
        "string",
        "string",
        "string",
        "string",
        "string",
        "string",
        "string",
        "string",
        "string"
      ],
      [
        "string",
        "string",
        "string",
        "string",
        "string",
        "string",
        "string",
        "string",
        "string",
        "string"
      ],
      [
        "string"
      ]
    ]
  }
}