{
  "activeAppliance": "PRIMARY",
  "capacity": 9,
  "disabled": false,
  "droppedFlowsPerSecond": 1,
  "flowLimit": 9,
  "flowLoad": 8,
  "flowsPerSecond": 1,
  "interfaceLimit": 1,
  "ip": "string",
  "master": false,
  "model": "string",
  "name": "string",
  "netflowDeviceCount": 9,
  "netflowInterfaceCount": 1,
  "primaryIp": "string",
  "processedFlowsPerSecond": 3,
  "secondaryIp": "string",
  "serverId": 2,
  "serverLoad": 2,
  "telephonyActiveCallsLimit": 8,
  "telephonyPhones": 3,
  "telephonyPhonesLimit": 7,
  "totalCapacity": 2,
  "totalLoad": 1,
  "virtualIp": "string"
}