{
  "name": "string",
  "resource": {
    "ids": [
      1,
      6,
      10
    ],
    "type": "Device"
  },
  "settings": {
    "resultLimitSetting": {
      "resultLimit": 5
    },
    "sourceFieldsSetting": {
      "fields": [
        "string"
      ],
      "sort": [
        [
          "string",
          "string",
          "string",
          "string"
        ],
        [
          "string",
          "string",
          "string",
          "string",
          "string"
        ],
        [
          "string",
          "string",
          "string",
          "string",
          "string"
        ],
        [
          "string",
          "string"
        ]
      ]
    }
  },
  "visualization": {
    "table": {
      "columnSetting": {
        "exclude": [
          "string",
          "string",
          "string",
          "string",
          "string",
          "string",
          "string",
          "string",
          "string",
          "string"
        ],
        "include": [
          "string"
        ]
      },
      "csvSetting": {
        "expandTimeseries": false,
        "formatTimestamp": true
      },
      "dataPresentationSetting": {
        "formatNumbers": true,
        "precision": 9
      },
      "tableSetting": {
        "blockVis": false,
        "hideHeaders": true,
        "wrapCells": false
      }
    }
  }
}