{
  "content": [
    {
      "activeAppliance": "PRIMARY",
      "capacity": 1,
      "disabled": false,
      "droppedFlowsPerSecond": 2,
      "flowLimit": 2,
      "flowLoad": 8,
      "flowsPerSecond": 6,
      "interfaceLimit": 2,
      "ip": "string",
      "master": true,
      "model": "string",
      "name": "string",
      "netflowDeviceCount": 2,
      "netflowInterfaceCount": 7,
      "primaryIp": "string",
      "processedFlowsPerSecond": 4,
      "secondaryIp": "string",
      "serverId": 1,
      "serverLoad": 2,
      "telephonyActiveCallsLimit": 7,
      "telephonyPhones": 5,
      "telephonyPhonesLimit": 6,
      "totalCapacity": 5,
      "totalLoad": 10,
      "virtualIp": "string"
    },
    {
      "activeAppliance": "PRIMARY",
      "capacity": 1,
      "disabled": true,
      "droppedFlowsPerSecond": 5,
      "flowLimit": 7,
      "flowLoad": 9,
      "flowsPerSecond": 2,
      "interfaceLimit": 9,
      "ip": "string",
      "master": false,
      "model": "string",
      "name": "string",
      "netflowDeviceCount": 8,
      "netflowInterfaceCount": 2,
      "primaryIp": "string",
      "processedFlowsPerSecond": 2,
      "secondaryIp": "string",
      "serverId": 3,
      "serverLoad": 6,
      "telephonyActiveCallsLimit": 6,
      "telephonyPhones": 9,
      "telephonyPhonesLimit": 2,
      "totalCapacity": 10,
      "totalLoad": 6,
      "virtualIp": "string"
    },
    {
      "activeAppliance": "PRIMARY",
      "capacity": 4,
      "disabled": true,
      "droppedFlowsPerSecond": 3,
      "flowLimit": 4,
      "flowLoad": 7,
      "flowsPerSecond": 9,
      "interfaceLimit": 4,
      "ip": "string",
      "master": true,
      "model": "string",
      "name": "string",
      "netflowDeviceCount": 8,
      "netflowInterfaceCount": 6,
      "primaryIp": "string",
      "processedFlowsPerSecond": 2,
      "secondaryIp": "string",
      "serverId": 2,
      "serverLoad": 9,
      "telephonyActiveCallsLimit": 4,
      "telephonyPhones": 5,
      "telephonyPhonesLimit": 10,
      "totalCapacity": 2,
      "totalLoad": 9,
      "virtualIp": "string"
    },
    {
      "activeAppliance": "PRIMARY",
      "capacity": 6,
      "disabled": true,
      "droppedFlowsPerSecond": 7,
      "flowLimit": 8,
      "flowLoad": 2,
      "flowsPerSecond": 9,
      "interfaceLimit": 6,
      "ip": "string",
      "master": true,
      "model": "string",
      "name": "string",
      "netflowDeviceCount": 10,
      "netflowInterfaceCount": 4,
      "primaryIp": "string",
      "processedFlowsPerSecond": 10,
      "secondaryIp": "string",
      "serverId": 2,
      "serverLoad": 6,
      "telephonyActiveCallsLimit": 6,
      "telephonyPhones": 9,
      "telephonyPhonesLimit": 6,
      "totalCapacity": 6,
      "totalLoad": 5,
      "virtualIp": "string"
    },
    {
      "activeAppliance": "SECONDARY",
      "capacity": 6,
      "disabled": false,
      "droppedFlowsPerSecond": 9,
      "flowLimit": 7,
      "flowLoad": 9,
      "flowsPerSecond": 2,
      "interfaceLimit": 1,
      "ip": "string",
      "master": false,
      "model": "string",
      "name": "string",
      "netflowDeviceCount": 5,
      "netflowInterfaceCount": 1,
      "primaryIp": "string",
      "processedFlowsPerSecond": 4,
      "secondaryIp": "string",
      "serverId": 7,
      "serverLoad": 10,
      "telephonyActiveCallsLimit": 3,
      "telephonyPhones": 1,
      "telephonyPhonesLimit": 1,
      "totalCapacity": 10,
      "totalLoad": 8,
      "virtualIp": "string"
    },
    {
      "activeAppliance": "SECONDARY",
      "capacity": 7,
      "disabled": true,
      "droppedFlowsPerSecond": 7,
      "flowLimit": 9,
      "flowLoad": 1,
      "flowsPerSecond": 5,
      "interfaceLimit": 8,
      "ip": "string",
      "master": true,
      "model": "string",
      "name": "string",
      "netflowDeviceCount": 7,
      "netflowInterfaceCount": 5,
      "primaryIp": "string",
      "processedFlowsPerSecond": 7,
      "secondaryIp": "string",
      "serverId": 10,
      "serverLoad": 1,
      "telephonyActiveCallsLimit": 4,
      "telephonyPhones": 3,
      "telephonyPhonesLimit": 4,
      "totalCapacity": 4,
      "totalLoad": 9,
      "virtualIp": "string"
    },
    {
      "activeAppliance": "SECONDARY",
      "capacity": 5,
      "disabled": true,
      "droppedFlowsPerSecond": 8,
      "flowLimit": 9,
      "flowLoad": 7,
      "flowsPerSecond": 4,
      "interfaceLimit": 6,
      "ip": "string",
      "master": true,
      "model": "string",
      "name": "string",
      "netflowDeviceCount": 6,
      "netflowInterfaceCount": 8,
      "primaryIp": "string",
      "processedFlowsPerSecond": 10,
      "secondaryIp": "string",
      "serverId": 6,
      "serverLoad": 1,
      "telephonyActiveCallsLimit": 9,
      "telephonyPhones": 4,
      "telephonyPhonesLimit": 3,
      "totalCapacity": 7,
      "totalLoad": 10,
      "virtualIp": "string"
    }
  ],
  "pageNumber": 8,
  "pageSize": 7,
  "totalElements": 2,
  "totalPages": 9
}