{
  "actions": [
    {
      "name": "getMaps",
      "protocol": "REST",
      "method": "GET",
      "entitypath": "{base_path}/{version}/maps/{pathv1}?{query}",
      "requestSchema": "schema.json",
      "responseSchema": "schema.json",
      "timeout": 0,
      "sendEmpty": false,
      "sendGetBody": false,
      "requestDatatype": "JSON",
      "responseDatatype": "JSON",
      "headers": {},
      "responseObjects": [
        {
          "type": "withpathv1",
          "key": "",
          "mockFile": "mockdatafiles/getmapsingle.json"
        },
        {
          "type": "default",
          "key": "content",
          "mockFile": "mockdatafiles/getmapmultiple.json"
        }
      ]
    },
    {
      "name": "getMapConnections",
      "protocol": "REST",
      "method": "GET",
      "entitypath": "{base_path}/{version}/maps/{pathv1}/connections?{query}",
      "requestSchema": "mapconnectionschema.json",
      "responseSchema": "mapconnectionschema.json",
      "timeout": 0,
      "sendEmpty": false,
      "sendGetBody": false,
      "requestDatatype": "JSON",
      "responseDatatype": "JSON",
      "headers": {},
      "responseObjects": [
        {
          "type": "default",
          "key": "content",
          "mockFile": "mockdatafiles/getmapconnections.json"
        }
      ]
    },
    {
      "name": "getMapNodes",
      "protocol": "REST",
      "method": "GET",
      "entitypath": "{base_path}/{version}/maps/{pathv1}/nodes?{query}",
      "requestSchema": "mapnodeschema.json",
      "responseSchema": "mapnodeschema.json",
      "timeout": 0,
      "sendEmpty": false,
      "sendGetBody": false,
      "requestDatatype": "JSON",
      "responseDatatype": "JSON",
      "headers": {},
      "responseObjects": [
        {
          "type": "default",
          "key": "content",
          "mockFile": "mockdatafiles/getmapnodes.json"
        }
      ]
    },
    {
      "name": "createMap",
      "protocol": "REST",
      "method": "POST",
      "entitypath": "{base_path}/{version}/maps?{query}",
      "requestSchema": "schema.json",
      "responseSchema": "schema.json",
      "timeout": 0,
      "sendEmpty": false,
      "sendGetBody": false,
      "requestDatatype": "JSON",
      "responseDatatype": "JSON",
      "headers": {},
      "responseObjects": [
        {
          "type": "default",
          "key": "",
          "mockFile": "mockdatafiles/postmap.json"
        }
      ]
    },
    {
      "name": "createMapConnection",
      "protocol": "REST",
      "method": "POST",
      "entitypath": "{base_path}/{version}/maps/{pathv1}/connections?{query}",
      "requestSchema": "mapconnectionschema.json",
      "responseSchema": "mapconnectionschema.json",
      "timeout": 0,
      "sendEmpty": false,
      "sendGetBody": false,
      "requestDatatype": "JSON",
      "responseDatatype": "JSON",
      "headers": {},
      "responseObjects": [
        {
          "type": "default",
          "key": "",
          "mockFile": "mockdatafiles/postmapconnection.json"
        }
      ]
    },
    {
      "name": "createMapNode",
      "protocol": "REST",
      "method": "POST",
      "entitypath": "{base_path}/{version}/maps/{pathv1}/nodes?{query}",
      "requestSchema": "mapnodeschema.json",
      "responseSchema": "mapnodeschema.json",
      "timeout": 0,
      "sendEmpty": false,
      "sendGetBody": false,
      "requestDatatype": "JSON",
      "responseDatatype": "JSON",
      "headers": {},
      "responseObjects": [
        {
          "type": "default",
          "key": "",
          "mockFile": "mockdatafiles/postmapnode.json"
        }
      ]
    },
    {
      "name": "updateMap",
      "protocol": "REST",
      "method": "PUT",
      "entitypath": "{base_path}/{version}/maps/{pathv1}?{query}",
      "requestSchema": "schema.json",
      "responseSchema": "schema.json",
      "timeout": 0,
      "sendEmpty": false,
      "sendGetBody": false,
      "requestDatatype": "JSON",
      "responseDatatype": "JSON",
      "headers": {},
      "responseObjects": [
        {
          "type": "default",
          "key": "",
          "mockFile": "mockdatafiles/putmap.json"
        }
      ]
    },
    {
      "name": "updateMapConnection",
      "protocol": "REST",
      "method": "PUT",
      "entitypath": "{base_path}/{version}/maps/{pathv1}/connections/{pathv2}?{query}",
      "requestSchema": "mapconnectionschema.json",
      "responseSchema": "mapconnectionschema.json",
      "timeout": 0,
      "sendEmpty": false,
      "sendGetBody": false,
      "requestDatatype": "JSON",
      "responseDatatype": "JSON",
      "headers": {},
      "responseObjects": [
        {
          "type": "default",
          "key": "",
          "mockFile": "mockdatafiles/putmapconnection.json"
        }
      ]
    },
    {
      "name": "updateMapNode",
      "protocol": "REST",
      "method": "PUT",
      "entitypath": "{base_path}/{version}/maps/{pathv1}/nodes/{pathv2}?{query}",
      "requestSchema": "mapnodeschema.json",
      "responseSchema": "mapnodeschema.json",
      "timeout": 0,
      "sendEmpty": false,
      "sendGetBody": false,
      "requestDatatype": "JSON",
      "responseDatatype": "JSON",
      "headers": {},
      "responseObjects": [
        {
          "type": "default",
          "key": "",
          "mockFile": "mockdatafiles/putmapnode.json"
        }
      ]
    },
    {
      "name": "deleteMap",
      "protocol": "REST",
      "method": "DELETE",
      "entitypath": "{base_path}/{version}/maps/{pathv1}?{query}",
      "requestSchema": "schema.json",
      "responseSchema": "schema.json",
      "timeout": 0,
      "sendEmpty": false,
      "sendGetBody": false,
      "requestDatatype": "JSON",
      "responseDatatype": "JSON",
      "headers": {},
      "responseObjects": [
        {
          "type": "default",
          "key": "",
          "mockFile": "mockdatafiles/deletemap.json"
        }
      ]
    },
    {
      "name": "deleteMapConnection",
      "protocol": "REST",
      "method": "DELETE",
      "entitypath": "{base_path}/{version}/maps/{pathv1}/connections/{pathv2}?{query}",
      "requestSchema": "mapconnectionschema.json",
      "responseSchema": "mapconnectionschema.json",
      "timeout": 0,
      "sendEmpty": false,
      "sendGetBody": false,
      "requestDatatype": "JSON",
      "responseDatatype": "JSON",
      "headers": {},
      "responseObjects": [
        {
          "type": "default",
          "key": "",
          "mockFile": "mockdatafiles/deletemapconnection.json"
        }
      ]
    },
    {
      "name": "deleteMapNode",
      "protocol": "REST",
      "method": "DELETE",
      "entitypath": "{base_path}/{version}/maps/{pathv1}/nodes/{pathv2}?{query}",
      "requestSchema": "mapnodeschema.json",
      "responseSchema": "mapnodeschema.json",
      "timeout": 0,
      "sendEmpty": false,
      "sendGetBody": false,
      "requestDatatype": "JSON",
      "responseDatatype": "JSON",
      "headers": {},
      "responseObjects": [
        {
          "type": "default",
          "key": "",
          "mockFile": "mockdatafiles/deletemapnode.json"
        }
      ]
    },
    {
      "name": "partiallyUpdateStatusMapById",
      "protocol": "REST",
      "method": "PATCH",
      "entitypath": "{base_path}/{version}/api/v1/maps/{pathv1}?{query}",
      "requestSchema": "schema.json",
      "responseSchema": "schema.json",
      "timeout": 0,
      "sendEmpty": false,
      "requestDatatype": "JSON",
      "responseDatatype": "JSON",
      "headers": {},
      "responseObjects": [
        {
          "type": "default",
          "key": "",
          "mockFile": "mockdatafiles/partiallyUpdateStatusMapById-default.json"
        }
      ]
    }
  ]
}