[
  {
    "country": "string",
    "countryCode": "string",
    "displayName": "string",
    "offset": 10,
    "timezone": "string"
  },
  {
    "country": "string",
    "countryCode": "string",
    "displayName": "string",
    "offset": 1,
    "timezone": "string"
  },
  {
    "country": "string",
    "countryCode": "string",
    "displayName": "string",
    "offset": 6,
    "timezone": "string"
  },
  {
    "country": "string",
    "countryCode": "string",
    "displayName": "string",
    "offset": 2,
    "timezone": "string"
  }
]