{
  "name": "adapter-salt",
  "webName": "Adapter for Integration to SaltStack",
  "supportLevel": "community",
  "vendor": "SaltStack",
  "product": "SaltStack",
  "techAlliance": false,
  "osVersion": [],
  "apiVersions": [],
  "iapVersions": [
    "2021.1.x",
    "2021.2.x",
    "2022.1.x",
    "2023.1.x"
  ],
  "method": "REST",
  "type": "Adapter",
  "domains": [
    "CI/CD"
  ],
  "tags": [
    "CI/CD & Self-Service"
  ],
  "useCases": [
    "CI/CD Pipeline"
  ],
  "deprecated": {
    "isDeprecated": false
  },
  "brokerSince": "",
  "authMethods": [
    {
      "type": "Basic Auth",
      "primary": true
    }
  ],
  "documentation": {
    "storeLink": "",
    "npmLink": "https://www.npmjs.com/package/@itentialopensource/adapter-salt",
    "repoLink": "https://gitlab.com/itentialopensource/adapters/adapter-salt",
    "docLink": "https://gitlab.com/itentialopensource/adapters/adapter-salt/-/blob/master/README.md?ref_type=heads",
    "demoLinks": [],
    "trainingLinks": [
      {
        "title": "Itential Academy",
        "link": "https://www.itential.com/itential-academy/"
      }
    ],
    "faqLink": "https://docs.itential.com/opensource/docs/troubleshooting-an-adapter",
    "contributeLink": "https://gitlab.com/itentialopensource/adapters/contributing-guide",
    "issueLink": "https://itential.atlassian.net/servicedesk/customer/portals",
    "webLink": "https://www.itential.com/adapters/saltstack/",
    "vendorLink": "https://www.vmware.com/",
    "productLink": "https://docs.vmware.com/en/VMware-vRealize-Automation-SaltStack-Config/8.11/install-configure-saltstack-config/GUID-DBE6D84B-0D4B-4747-8291-B0D80851CE62.html",
    "apiLinks": [
      {
        "title": "API documents for Salt",
        "link": "https://salt-sproxy.readthedocs.io/en/latest/salt_api.html",
        "public": true
      }
    ],
    "workshopLinks": [],
    "workshopHomePage": "https://www.itential.com/get-started/"
  },
  "assets": [],
  "relatedItems": {
    "adapters": [],
    "integrations": [],
    "ecosystemApplications": [],
    "workflowProjects": [],
    "transformationProjects": [],
    "exampleProjects": []
  }
}