{
  "search_paths": [
    "string",
    "string"
  ],
  "environments": {
    "production": {
      "settings": {
        "modulepath": [
          "string",
          "string"
        ],
        "manifest": [
          "string",
          "string",
          "string",
          "string",
          "string",
          "string",
          "string",
          "string",
          "string",
          "string"
        ],
        "environment_timeout": 7,
        "config_version": "string"
      }
    }
  }
}