{
  "name": "string",
  "parameters": {
    "architecture": "string",
    "kernel": "string",
    "blockdevices": "string",
    "clientversion": "string",
    "clientnoop": "string",
    "environment": "string"
  },
  "environment": "string"
}