{
  "id": "@itentialopensource/adapter-puppet",
  "type": "Adapter",
  "export": "Puppet",
  "title": "Puppet",
  "src": "adapter.js",
  "roles": [
    "admin"
  ],
  "methods": [
    {
      "name": "iapUpdateAdapterConfiguration",
      "summary": "Updates the adapter configuration",
      "description": "Updates the adapter configuration file with the provided changes",
      "input": [
        {
          "name": "configFile",
          "type": "string",
          "info": "The name of the file to change",
          "required": true,
          "schema": {
            "title": "configFile",
            "type": "string"
          }
        },
        {
          "name": "changes",
          "type": "object",
          "info": "JSON object containing the configuration changes",
          "required": true,
          "schema": {
            "title": "changes",
            "type": "object"
          }
        },
        {
          "name": "entity",
          "type": "string",
          "info": "The entity in which the changes are being made",
          "required": false,
          "schema": {
            "title": "entity",
            "type": "string"
          }
        },
        {
          "name": "type",
          "type": "string",
          "info": "The type of file to change - action, schema, or mock",
          "required": false,
          "schema": {
            "title": "type",
            "type": "string"
          }
        },
        {
          "name": "action",
          "type": "string",
          "info": "The action to be changed",
          "required": false,
          "schema": {
            "title": "action",
            "type": "string"
          }
        },
        {
          "name" : "replace",
          "type": "boolean",
          "info": "True to replace entire mock data, false to merge/append",
          "required": false,
          "schema": {
            "title": "replace",
            "type" : "boolean"
          }
        }
      ],
      "output": {
        "name": "result",
        "type": "object",
        "description": "A JSON Object containing status, code and the result",
        "schema": {
          "title": "result",
          "type": "object"
        }
      },
      "roles": [
        "admin"
      ],
      "route": {
        "verb": "POST",
        "path": "/iapUpdateAdapterConfiguration"
      },
      "task": true
    },
    {
      "name": "iapSuspendAdapter",
      "summary": "Suspends the adapter",
      "description": "Suspends the adapter",
      "input": [
        {
          "name": "mode",
          "type": "enum",
          "enumerals": [
            "pause",
            "error"
          ],
          "info": "How incoming requests are handled. Defaults to 'pause'",
          "description": "How incoming requests are handled. Defaults to 'pause'",
          "schema": {
            "title": "mode",
            "type": "string"
          },
          "required": false
        }
      ],
      "output": {
        "name": "result",
        "type": "object",
        "description": "A JSON Object containing the adapter suspended status",
        "schema": {
          "title": "result",
          "type": "object"
        }
      },
      "roles": [
        "admin"
      ],
      "route": {
        "verb": "POST",
        "path": "/iapSuspendAdapter"
      },
      "task": true
    },
    {
      "name": "iapUnsuspendAdapter",
      "summary": "Unsuspends the adapter",
      "description": "Unsuspends the adapter",
      "input": [],
      "output": {
        "name": "result",
        "type": "object",
        "description": "A JSON Object containing the adapter suspended status",
        "schema": {
          "title": "result",
          "type": "object"
        }
      },
      "roles": [
        "admin"
      ],
      "route": {
        "verb": "POST",
        "path": "/iapUnsuspendAdapter"
      },
      "task": true
    },
    {
      "name": "iapGetAdapterQueue",
      "summary": "Return the requests that are waiting in the queue if throttling is enabled",
      "description": "Return the requests that are waiting in the queue if throttling is enabled",
      "input": [],
      "output": {
        "name": "result",
        "type": "object",
        "description": "A JSON Object containing the adapter queue",
        "schema": {
          "title": "result",
          "type": "object"
        }
      },
      "roles": [
        "admin"
      ],
      "route": {
        "verb": "POST",
        "path": "/iapGetAdapterQueue"
      },
      "task": true
    },
    {
      "name": "iapFindAdapterPath",
      "summary": "Provides the ability to see if a particular API path is supported by the adapter",
      "description": "Provides the ability to see if a particular API path is supported by the adapter",
      "input": [
        {
          "name": "apiPath",
          "type": "string",
          "info": "The API Path you want to check - make sure to not include base path and version",
          "description": "The API Path you want to check - make sure to not include base path and version",
          "schema": {
            "title": "apiPath",
            "type": "string"
          },
          "required": true
        }
      ],
      "output": {
        "name": "result",
        "type": "object",
        "description": "A JSON Object containing the result",
        "schema": {
          "title": "result",
          "type": "object"
        }
      },
      "roles": [
        "admin"
      ],
      "route": {
        "verb": "POST",
        "path": "/iapFindAdapterPath"
      },
      "task": true
    },
    {
      "name": "iapTroubleshootAdapter",
      "summary": "Runs troubleshoot script for adapter",
      "description": "Runs troubleshoot script for adapter",
      "input": [
        {
          "name": "props",
          "type": "object",
          "info": "Object containing configuration, healthcheck and auth properties {'connProps':{'host': 'api.service.com', 'base_path': '/', 'protocol': 'http', 'port': 443, 'version': 'v1'},'healthCheckEndpoint': '/healthcheck', 'auth': {'auth_method': 'no authentication', 'username': 'username', 'password': 'password'}}",
          "required": true,
          "schema": {
            "title": "props",
            "type": "object"
          }
        },
        {
          "name": "persistFlag",
          "type": "boolean",
          "info": "Whether the input properties should be saved",
          "required": true,
          "schema": {
            "title": "persistFlag",
            "type": "boolean"
          }
        }
      ],
      "output": {
        "name": "result",
        "type": "object",
        "description": "A JSON Object containing the test results",
        "schema": {
          "title": "result",
          "type": "object"
        }
      },
      "roles": [
        "admin"
      ],
      "route": {
        "verb": "POST",
        "path": "/iapTroubleshootAdapter"
      },
      "task": true
    },
    {
      "name": "iapRunAdapterHealthcheck",
      "summary": "Runs healthcheck script for adapter",
      "description": "Runs healthcheck script for adapter",
      "input": [],
      "output": {
        "name": "result",
        "type": "boolean",
        "description": "Whether healthcheck passed or failed",
        "schema": {
          "title": "result",
          "type": "boolean"
        }
      },
      "roles": [
        "admin"
      ],
      "route": {
        "verb": "POST",
        "path": "/iapRunAdapterHealthcheck"
      },
      "task": true
    },
    {
      "name": "iapRunAdapterConnectivity",
      "summary": "Runs connectivity check script for adapter",
      "description": "Runs connectivity check script for adapter",
      "input": [],
      "output": {
        "name": "result",
        "type": "object",
        "description": "A JSON Object containing the test results",
        "schema": {
          "title": "result",
          "type": "object"
        }
      },
      "roles": [
        "admin"
      ],
      "route": {
        "verb": "POST",
        "path": "/iapRunAdapterConnectivity"
      },
      "task": true
    },
    {
      "name": "iapRunAdapterBasicGet",
      "summary": "Runs basicGet script for adapter",
      "description": "Runs basicGet script for adapter",
      "input": [],
      "output": {
        "name": "result",
        "type": "object",
        "description": "A JSON Object containing the test results",
        "schema": {
          "title": "result",
          "type": "object"
        }
      },
      "roles": [
        "admin"
      ],
      "route": {
        "verb": "POST",
        "path": "/iapRunAdapterBasicGet"
      },
      "task": true
    },
    {
      "name": "iapMoveAdapterEntitiesToDB",
      "summary": "Moves entities from an adapter into the IAP database",
      "description": "Moves entities from an adapter into the IAP database",
      "input": [],
      "output": {
        "name": "res",
        "type": "object",
        "description": "A JSON Object containing status, code and the response from the mongo transaction",
        "schema": {
          "title": "res",
          "type": "object"
        }
      },
      "roles": [
        "admin"
      ],
      "route": {
        "verb": "POST",
        "path": "/iapMoveAdapterEntitiesToDB"
      },
      "task": true
    },
    {
      "name": "iapDeactivateTasks",
      "summary": "Deactivate the inputted tasks",
      "description": "Deactivate the inputted tasks",
      "input": [
        {
          "name": "tasks",
          "type": "array",
          "description": "Tasks to deactivate",
          "schema": {
            "title": "tasks",
            "type": "array"
          }
        }
      ],
      "output": {
        "name": "result",
        "type": "object",
        "description": "A JSON Object containing success status",
        "schema": {
          "title": "result",
          "type": "object"
        }
      },
      "roles": [
        "admin"
      ],
      "route": {
        "verb": "POST",
        "path": "/iapDeactivateTasks"
      },
      "task": true
    },
    {
      "name": "iapActivateTasks",
      "summary": "Activate the inputted tasks",
      "description": "activate the inputted tasks",
      "input": [
        {
          "name": "tasks",
          "type": "array",
          "description": "Tasks to activate",
          "schema": {
            "title": "tasks",
            "type": "array"
          }
        }
      ],
      "output": {
        "name": "result",
        "type": "object",
        "description": "A JSON Object containing success status",
        "schema": {
          "title": "result",
          "type": "object"
        }
      },
      "roles": [
        "admin"
      ],
      "route": {
        "verb": "POST",
        "path": "/iapActivateTasks"
      },
      "task": true
    },
    {
      "name": "iapPopulateEntityCache",
      "summary": "Populate the cache for the given entities",
      "description": "Populate the cache for the given entities",
      "input": [
        {
          "name": "entityTypes",
          "type": "array",
          "info": "the entity type(s) to populate",
          "required": true,
          "schema": {
            "title": "entityTypes",
            "type": "array"
          }
        }
      ],
      "output": {
        "name": "result",
        "type": "object",
        "description": "A JSON Object containing status, code and the result",
        "schema": {
          "title": "result",
          "type": "object"
        }
      },
      "roles": [
        "admin"
      ],
      "route": {
        "verb": "POST",
        "path": "/iapPopulateEntityCache"
      },
      "task": true
    },
    {
      "name": "iapRetrieveEntitiesCache",
      "summary": "Retrieves data from cache for specified entity type",
      "description": "Retrieves data from cache for specified entity type",
      "input": [
        {
          "name": "entityType",
          "type": "string",
          "info": "entity of which to retrieve",
          "required": true,
          "schema": {
            "title": "entityType",
            "type": "string"
          }
        },
        {
          "name": "options",
          "type": "object",
          "info": "settings of which data to return and how to return it",
          "required": false,
          "schema": {
            "title": "options",
            "type": "object"
          }
        }
      ],
      "output": {
        "name": "result",
        "type": "object",
        "description": "A JSON Object containing status, code and the result",
        "schema": {
          "title": "result",
          "type": "object"
        }
      },
      "roles": [
        "admin"
      ],
      "route": {
        "verb": "POST",
        "path": "/iapRetrieveEntitiesCache"
      },
      "task": true
    },
    {
      "name": "getDevice",
      "summary": "Get the Appliance",
      "description": "Get the Appliance",
      "input": [
        {
          "name": "deviceName",
          "type": "string",
          "info": "An Appliance Device Name",
          "required": true,
          "schema": {
            "title": "deviceName",
            "type": "string"
          }
        }
      ],
      "output": {
        "name": "result",
        "type": "object",
        "description": "A JSON Object containing status, code and the result",
        "schema": {
          "title": "result",
          "type": "object"
        }
      },
      "roles": [
        "admin"
      ],
      "route": {
        "verb": "POST",
        "path": "/getDevice"
      },
      "task": false
    },
    {
      "name": "getDevicesFiltered",
      "summary": "Get Appliances that match the filter",
      "description": "Get Appliances that match the filter",
      "input": [
        {
          "name": "options",
          "type": "object",
          "info": "options - e.g. { 'start': 1, 'limit': 20, 'filter': { 'name': 'abc123' } }",
          "required": true,
          "schema": {
            "title": "options",
            "type": "object"
          }
        }
      ],
      "output": {
        "name": "result",
        "type": "array",
        "description": "A JSON Object containing status, code and the result",
        "schema": {
          "title": "result",
          "type": "array"
        }
      },
      "roles": [
        "admin"
      ],
      "route": {
        "verb": "POST",
        "path": "/getDevicesFiltered"
      },
      "task": false
    },
    {
      "name": "isAlive",
      "summary": "Checks the status for the provided Appliance",
      "description": "Checks the status for the provided Appliance",
      "input": [
        {
          "name": "deviceName",
          "type": "string",
          "info": "An Appliance Device Name",
          "required": true,
          "schema": {
            "title": "deviceName",
            "type": "string"
          }
        }
      ],
      "output": {
        "name": "result",
        "type": "boolean",
        "description": "A JSON Object containing status, code and the result",
        "schema": {
          "title": "result",
          "type": "boolean"
        }
      },
      "roles": [
        "admin"
      ],
      "route": {
        "verb": "POST",
        "path": "/isAlive"
      },
      "task": false
    },
    {
      "name": "getConfig",
      "summary": "Gets a config for the provided Appliance",
      "description": "Gets a config for the provided Appliance",
      "input": [
        {
          "name": "deviceName",
          "type": "string",
          "info": "An Appliance Device Name",
          "required": true,
          "schema": {
            "title": "deviceName",
            "type": "string"
          }
        },
        {
          "name": "format",
          "type": "string",
          "info": "The format to be returned - this is ignored as we always return json",
          "required": false,
          "schema": {
            "title": "format",
            "type": "string"
          }
        }
      ],
      "output": {
        "name": "result",
        "type": "object",
        "description": "A JSON Object containing status, code and the result",
        "schema": {
          "title": "result",
          "type": "object"
        }
      },
      "roles": [
        "admin"
      ],
      "route": {
        "verb": "POST",
        "path": "/getConfig"
      },
      "task": false
    },
    {
      "name": "iapGetDeviceCount",
      "summary": "Gets a device count from the system",
      "description": "Gets a device count from the system",
      "input": [],
      "output": {
        "name": "result",
        "type": "object",
        "description": "A JSON Object containing status, code and the result",
        "schema": {
          "title": "result",
          "type": "object"
        }
      },
      "roles": [
        "admin"
      ],
      "route": {
        "verb": "POST",
        "path": "/iapGetDeviceCount"
      },
      "task": false
    },
    {
      "name": "iapExpandedGenericAdapterRequest",
      "summary": "Makes the requested generic call with additional options",
      "description": "Makes the requested generic call with additional options via metadata",
      "input": [
        {
          "name": "metadata",
          "type": "object",
          "info": "metadata for the call (optional)",
          "description": "metadata for the call - allows for many enhancements (optional)",
          "schema": {
            "title": "metadata",
            "type": "object"
          },
          "required": false
        },
        {
          "name": "uriPath",
          "type": "string",
          "info": "the path of the api call - do not include the host, port, base path or version",
          "description": "the path of the api call",
          "schema": {
            "title": "uriPath",
            "type": "string"
          },
          "required": false
        },
        {
          "name": "restMethod",
          "type": "string",
          "info": "the rest method (GET, POST, PUT, PATCH, DELETE)",
          "description": "the rest method (GET, POST, PUT, PATCH, DELETE)",
          "schema": {
            "title": "restMethod",
            "type": "string"
          },
          "required": false
        },
        {
          "name": "pathVars",
          "type": "object",
          "info": "the parameters to be put within the url path (optional)",
          "description": "the parameters to be put within the url path (optional)",
          "schema": {
            "title": "pathVars",
            "type": "object"
          },
          "required": false
        },
        {
          "name": "queryData",
          "type": "object",
          "info": "the query parameters to be put on the url (optional)",
          "description": "the query parameters to be put on the url (optional)",
          "schema": {
            "title": "queryData",
            "type": "object"
          },
          "required": false
        },
        {
          "name": "requestBody",
          "type": "object",
          "info": "the payload to be sent with the request (optional)",
          "description": "the payload to be sent with the request (optional)",
          "schema": {
            "title": "requestBody",
            "type": "object"
          },
          "required": false
        },
        {
          "name": "addlHeaders",
          "type": "object",
          "info": "additional headers to be put on the call (optional)",
          "description": "additional headers to be put on the call (optional)",
          "schema": {
            "title": "addlHeaders",
            "type": "object"
          },
          "required": false
        }
      ],
      "output": {
        "name": "result",
        "type": "object",
        "description": "A JSON Object containing status, code and the result",
        "schema": {
          "title": "result",
          "type": "object"
        }
      },
      "roles": [
        "admin"
      ],
      "route": {
        "verb": "POST",
        "path": "/iapExpandedGenericAdapterRequest"
      },
      "task": true
    },
    {
      "name": "genericAdapterRequest",
      "summary": "Makes the requested generic call",
      "description": "Makes the requested generic call",
      "input": [
        {
          "name": "uriPath",
          "type": "string",
          "info": "the path of the api call - do not include the host, port, base path or version",
          "description": "the path of the api call",
          "schema": {
            "title": "uriPath",
            "type": "string"
          },
          "required": true
        },
        {
          "name": "restMethod",
          "type": "string",
          "info": "the rest method (GET, POST, PUT, PATCH, DELETE)",
          "description": "the rest method (GET, POST, PUT, PATCH, DELETE)",
          "schema": {
            "title": "restMethod",
            "type": "string"
          },
          "required": true
        },
        {
          "name": "queryData",
          "type": "object",
          "info": "the query parameters to be put on the url (optional)",
          "description": "the query parameters to be put on the url (optional)",
          "schema": {
            "title": "queryData",
            "type": "object"
          },
          "required": false
        },
        {
          "name": "requestBody",
          "type": "object",
          "info": "the payload to be sent with the request (optional)",
          "description": "the payload to be sent with the request (optional)",
          "schema": {
            "title": "requestBody",
            "type": "object"
          },
          "required": false
        },
        {
          "name": "addlHeaders",
          "type": "object",
          "info": "additional headers to be put on the call (optional)",
          "description": "additional headers to be put on the call (optional)",
          "schema": {
            "title": "addlHeaders",
            "type": "object"
          },
          "required": false
        }
      ],
      "output": {
        "name": "result",
        "type": "object",
        "description": "A JSON Object containing status, code and the result",
        "schema": {
          "title": "result",
          "type": "object"
        }
      },
      "roles": [
        "admin"
      ],
      "route": {
        "verb": "POST",
        "path": "/genericAdapterRequest"
      },
      "task": true
    },
    {
      "name": "genericAdapterRequestNoBasePath",
      "summary": "Makes the requested generic call",
      "description": "Makes the requested generic call",
      "input": [
        {
          "name": "uriPath",
          "type": "string",
          "info": "the path of the api call - do not include the host, port, base path or version",
          "description": "the path of the api call",
          "schema": {
            "title": "uriPath",
            "type": "string"
          },
          "required": true
        },
        {
          "name": "restMethod",
          "type": "string",
          "info": "the rest method (GET, POST, PUT, PATCH, DELETE)",
          "description": "the rest method (GET, POST, PUT, PATCH, DELETE)",
          "schema": {
            "title": "restMethod",
            "type": "string"
          },
          "required": true
        },
        {
          "name": "queryData",
          "type": "object",
          "info": "the query parameters to be put on the url (optional)",
          "description": "the query parameters to be put on the url (optional)",
          "schema": {
            "title": "queryData",
            "type": "object"
          },
          "required": false
        },
        {
          "name": "requestBody",
          "type": "object",
          "info": "the payload to be sent with the request (optional)",
          "description": "the payload to be sent with the request (optional)",
          "schema": {
            "title": "requestBody",
            "type": "object"
          },
          "required": false
        },
        {
          "name": "addlHeaders",
          "type": "object",
          "info": "additional headers to be put on the call (optional)",
          "description": "additional headers to be put on the call (optional)",
          "schema": {
            "title": "addlHeaders",
            "type": "object"
          },
          "required": false
        }
      ],
      "output": {
        "name": "result",
        "type": "object",
        "description": "A JSON Object containing status, code and the result",
        "schema": {
          "title": "result",
          "type": "object"
        }
      },
      "roles": [
        "admin"
      ],
      "route": {
        "verb": "POST",
        "path": "/genericAdapterRequestNoBasePath"
      },
      "task": true
    },
    {
      "name": "iapRunAdapterLint",
      "summary": "Run the adapter lint script to return the results",
      "description": "Run the adapter lint script to return the results",
      "input": [],
      "output": {
        "name": "result",
        "type": "string",
        "description": "A string containing the run results",
        "schema": {
          "title": "result",
          "type": "string"
        }
      },
      "roles": [
        "admin"
      ],
      "route": {
        "verb": "GET",
        "path": "/iapRunAdapterLint"
      },
      "task": true
    },
    {
      "name": "iapRunAdapterTests",
      "summary": "Run the adapter test scripts (baseunit and unit) to return the results",
      "description": "Run the adapter test scripts (baseunit and unit) to return the results",
      "input": [],
      "output": {
        "name": "result",
        "type": "object",
        "description": "A JSON Object containing status, code and the result",
        "schema": {
          "title": "result",
          "type": "object"
        }
      },
      "roles": [
        "admin"
      ],
      "route": {
        "verb": "GET",
        "path": "/iapRunAdapterTests"
      },
      "task": true
    },
    {
      "name": "iapGetAdapterInventory",
      "summary": "Provide inventory information abbout the adapter",
      "description": "Provide inventory information abbout the adapter",
      "input": [],
      "output": {
        "name": "result",
        "type": "object",
        "description": "A JSON Object containing status, code and the result",
        "schema": {
          "title": "result",
          "type": "object"
        }
      },
      "roles": [
        "admin"
      ],
      "route": {
        "verb": "GET",
        "path": "/iapGetAdapterInventory"
      },
      "task": true
    },
    {
      "name": "getCatalogNodename",
      "summary": "Retrieve a catalog.",
      "description": "Retrieve a catalog.",
      "input": [
        {
          "name": "nodename",
          "type": "string",
          "info": "Node name",
          "required": true,
          "schema": {
            "title": "nodename",
            "type": "string"
          }
        },
        {
          "name": "environment",
          "type": "string",
          "info": "the environment name.",
          "required": true,
          "schema": {
            "title": "environment",
            "type": "string"
          }
        },
        {
          "name": "factsFormat",
          "type": "string",
          "info": "must be 'application/json' or 'pson'.",
          "required": true,
          "schema": {
            "title": "factsFormat",
            "type": "string"
          }
        },
        {
          "name": "facts",
          "type": "string",
          "info": "serialized JSON or PSON of the facts hash. Since facts can contain &, which is also the HTTP query parameter delimiter, facts are doubly-escaped.",
          "required": true,
          "schema": {
            "title": "facts",
            "type": "string"
          }
        },
        {
          "name": "transactionUuid",
          "type": "string",
          "info": "a transaction uuid identifying the entire transaction.",
          "required": true,
          "schema": {
            "title": "transactionUuid",
            "type": "string"
          }
        },
        {
          "name": "staticCatalog",
          "type": "boolean",
          "info": "a boolean requesting a static catalog if available; should always be true.",
          "required": false,
          "schema": {
            "title": "staticCatalog",
            "type": "boolean"
          }
        },
        {
          "name": "checksumType",
          "type": "string",
          "info": "a dot-separated list of checksum types supported by the agent.",
          "required": false,
          "schema": {
            "title": "checksumType",
            "type": "string"
          }
        },
        {
          "name": "configuredEnvironment",
          "type": "string",
          "info": "the environment configured on the client.",
          "required": false,
          "schema": {
            "title": "configuredEnvironment",
            "type": "string"
          }
        },
        {
          "name": "jobId",
          "type": "string",
          "info": "which orchestration job triggered this catalog request.",
          "required": false,
          "schema": {
            "title": "jobId",
            "type": "string"
          }
        }
      ],
      "output": {
        "name": "result",
        "type": "object",
        "description": "A JSON Object containing status, code and the result",
        "schema": {
          "title": "result",
          "type": "object"
        }
      },
      "roles": [
        "admin"
      ],
      "route": {
        "verb": "POST",
        "path": "/getCatalogNodename"
      },
      "task": true
    },
    {
      "name": "postCatalogNodename",
      "summary": "Retrieve a catalog.",
      "description": "Retrieve a catalog.",
      "input": [
        {
          "name": "nodename",
          "type": "string",
          "info": "Node name",
          "required": true,
          "schema": {
            "title": "nodename",
            "type": "string"
          }
        },
        {
          "name": "body",
          "type": "object",
          "info": "",
          "required": true,
          "schema": {
            "title": "body",
            "type": "object"
          }
        }
      ],
      "output": {
        "name": "result",
        "type": "object",
        "description": "A JSON Object containing status, code and the result",
        "schema": {
          "title": "result",
          "type": "object"
        }
      },
      "roles": [
        "admin"
      ],
      "route": {
        "verb": "POST",
        "path": "/postCatalogNodename"
      },
      "task": true
    },
    {
      "name": "getNodeCertname",
      "summary": "Retrieve data for a node.",
      "description": "Retrieve data for a node.",
      "input": [
        {
          "name": "certname",
          "type": "string",
          "info": "cert name",
          "required": true,
          "schema": {
            "title": "certname",
            "type": "string"
          }
        },
        {
          "name": "environment",
          "type": "string",
          "info": "the environment name.",
          "required": true,
          "schema": {
            "title": "environment",
            "type": "string"
          }
        },
        {
          "name": "transactionUuid",
          "type": "string",
          "info": "a transaction uuid identifying the entire transaction.",
          "required": true,
          "schema": {
            "title": "transactionUuid",
            "type": "string"
          }
        },
        {
          "name": "configuredEnvironment",
          "type": "string",
          "info": "the environment configured on the client.",
          "required": false,
          "schema": {
            "title": "configuredEnvironment",
            "type": "string"
          }
        }
      ],
      "output": {
        "name": "result",
        "type": "object",
        "description": "A JSON Object containing status, code and the result",
        "schema": {
          "title": "result",
          "type": "object"
        }
      },
      "roles": [
        "admin"
      ],
      "route": {
        "verb": "POST",
        "path": "/getNodeCertname"
      },
      "task": true
    },
    {
      "name": "getEnvironments",
      "summary": "Get the list of known environments.",
      "description": "Get the list of known environments.",
      "input": [],
      "output": {
        "name": "result",
        "type": "object",
        "description": "A JSON Object containing status, code and the result",
        "schema": {
          "title": "result",
          "type": "object"
        }
      },
      "roles": [
        "admin"
      ],
      "route": {
        "verb": "GET",
        "path": "/getEnvironments"
      },
      "task": true
    },
    {
      "name": "putReportNodename",
      "summary": "Allows clients to send reports to the master",
      "description": "Allows clients to send reports to the master",
      "input": [
        {
          "name": "nodename",
          "type": "number",
          "info": "Node name",
          "required": true,
          "schema": {
            "title": "nodename",
            "type": "number"
          }
        },
        {
          "name": "environment",
          "type": "string",
          "info": "environment name",
          "required": true,
          "schema": {
            "title": "environment",
            "type": "string"
          }
        },
        {
          "name": "body",
          "type": "object",
          "info": "",
          "required": true,
          "schema": {
            "title": "body",
            "type": "object"
          }
        }
      ],
      "output": {
        "name": "result",
        "type": "object",
        "description": "A JSON Object containing status, code and the result",
        "schema": {
          "title": "result",
          "type": "object"
        }
      },
      "roles": [
        "admin"
      ],
      "route": {
        "verb": "POST",
        "path": "/putReportNodename"
      },
      "task": true
    },
    {
      "name": "getStatusName",
      "summary": "Provides information about a running master.",
      "description": "Provides information about a running master.",
      "input": [
        {
          "name": "name",
          "type": "string",
          "info": "Name of a running master",
          "required": true,
          "schema": {
            "title": "name",
            "type": "string"
          }
        },
        {
          "name": "environment",
          "type": "string",
          "info": "environment name",
          "required": true,
          "schema": {
            "title": "environment",
            "type": "string"
          }
        }
      ],
      "output": {
        "name": "result",
        "type": "object",
        "description": "A JSON Object containing status, code and the result",
        "schema": {
          "title": "result",
          "type": "object"
        }
      },
      "roles": [
        "admin"
      ],
      "route": {
        "verb": "POST",
        "path": "/getStatusName"
      },
      "task": true
    },
    {
      "name": "getFilecontentMountpointName",
      "summary": "Retrieve the contents of the specified file.",
      "description": "Retrieve the contents of the specified file.",
      "input": [
        {
          "name": "mountPoint",
          "type": "string",
          "info": "mount point",
          "required": true,
          "schema": {
            "title": "mountPoint",
            "type": "string"
          }
        },
        {
          "name": "name",
          "type": "string",
          "info": "the path to the file within the mount_point that is requested.",
          "required": true,
          "schema": {
            "title": "name",
            "type": "string"
          }
        }
      ],
      "output": {
        "name": "result",
        "type": "object",
        "description": "A JSON Object containing status, code and the result",
        "schema": {
          "title": "result",
          "type": "object"
        }
      },
      "roles": [
        "admin"
      ],
      "route": {
        "verb": "POST",
        "path": "/getFilecontentMountpointName"
      },
      "task": true
    },
    {
      "name": "getFilemetadataMountPath",
      "summary": "Returns select metadata for a single file or many files.",
      "description": "Returns select metadata for a single file or many files.",
      "input": [
        {
          "name": "environment",
          "type": "string",
          "info": "environment name",
          "required": true,
          "schema": {
            "title": "environment",
            "type": "string"
          }
        },
        {
          "name": "mount",
          "type": "string",
          "info": "mount name",
          "required": true,
          "schema": {
            "title": "mount",
            "type": "string"
          }
        },
        {
          "name": "pathParam",
          "type": "string",
          "info": "path to file",
          "required": true,
          "schema": {
            "title": "pathParam",
            "type": "string"
          }
        },
        {
          "name": "links",
          "type": "string",
          "info": "either manage (default) or follow.",
          "required": false,
          "schema": {
            "title": "links",
            "type": "string"
          }
        },
        {
          "name": "checksumType",
          "type": "string",
          "info": "the checksum type to calculate the checksum value for the result metadata.",
          "required": false,
          "schema": {
            "title": "checksumType",
            "type": "string"
          }
        },
        {
          "name": "sourcePermissions",
          "type": "string",
          "info": "whether (and how) Puppet should copy owner, group, and mode permissions.",
          "required": false,
          "schema": {
            "title": "sourcePermissions",
            "type": "string"
          }
        }
      ],
      "output": {
        "name": "result",
        "type": "object",
        "description": "A JSON Object containing status, code and the result",
        "schema": {
          "title": "result",
          "type": "object"
        }
      },
      "roles": [
        "admin"
      ],
      "route": {
        "verb": "POST",
        "path": "/getFilemetadataMountPath"
      },
      "task": true
    },
    {
      "name": "getFilebucketfileMd5Checksum",
      "summary": "Retrieve the contents of a file.",
      "description": "Retrieve the contents of a file.",
      "input": [
        {
          "name": "checksum",
          "type": "string",
          "info": "checksum md5 value",
          "required": true,
          "schema": {
            "title": "checksum",
            "type": "string"
          }
        },
        {
          "name": "environment",
          "type": "string",
          "info": "environment name",
          "required": true,
          "schema": {
            "title": "environment",
            "type": "string"
          }
        }
      ],
      "output": {
        "name": "result",
        "type": "object",
        "description": "A JSON Object containing status, code and the result",
        "schema": {
          "title": "result",
          "type": "object"
        }
      },
      "roles": [
        "admin"
      ],
      "route": {
        "verb": "POST",
        "path": "/getFilebucketfileMd5Checksum"
      },
      "task": true
    },
    {
      "name": "putFilebucketfileMd5Checksum",
      "summary": "Save a file to the filebucket.",
      "description": "Save a file to the filebucket.",
      "input": [
        {
          "name": "checksum",
          "type": "string",
          "info": "Checksum md5 value",
          "required": true,
          "schema": {
            "title": "checksum",
            "type": "string"
          }
        },
        {
          "name": "environment",
          "type": "string",
          "info": "environment name",
          "required": true,
          "schema": {
            "title": "environment",
            "type": "string"
          }
        },
        {
          "name": "body",
          "type": "object",
          "info": "",
          "required": true,
          "schema": {
            "title": "body",
            "type": "object"
          }
        }
      ],
      "output": {
        "name": "result",
        "type": "object",
        "description": "A JSON Object containing status, code and the result",
        "schema": {
          "title": "result",
          "type": "object"
        }
      },
      "roles": [
        "admin"
      ],
      "route": {
        "verb": "POST",
        "path": "/putFilebucketfileMd5Checksum"
      },
      "task": true
    },
    {
      "name": "headFilebucketfileMd5Checksum",
      "summary": "Check if a file is present in the filebucket.",
      "description": "Check if a file is present in the filebucket.",
      "input": [
        {
          "name": "checksum",
          "type": "string",
          "info": "checksum md5 value",
          "required": true,
          "schema": {
            "title": "checksum",
            "type": "string"
          }
        },
        {
          "name": "environment",
          "type": "string",
          "info": "environment name",
          "required": true,
          "schema": {
            "title": "environment",
            "type": "string"
          }
        }
      ],
      "output": {
        "name": "result",
        "type": "object",
        "description": "A JSON Object containing status, code and the result",
        "schema": {
          "title": "result",
          "type": "object"
        }
      },
      "roles": [
        "admin"
      ],
      "route": {
        "verb": "POST",
        "path": "/headFilebucketfileMd5Checksum"
      },
      "task": true
    },
    {
      "name": "getFilebucketfileMd5ChecksumOriginalPath",
      "summary": "Retrieve the contents of a file.",
      "description": "Retrieve the contents of a file.",
      "input": [
        {
          "name": "checksum",
          "type": "string",
          "info": "checksum md5 value",
          "required": true,
          "schema": {
            "title": "checksum",
            "type": "string"
          }
        },
        {
          "name": "originalPath",
          "type": "string",
          "info": "the full absolute path of the file on the client system.",
          "required": true,
          "schema": {
            "title": "originalPath",
            "type": "string"
          }
        },
        {
          "name": "environment",
          "type": "string",
          "info": "environment name",
          "required": true,
          "schema": {
            "title": "environment",
            "type": "string"
          }
        }
      ],
      "output": {
        "name": "result",
        "type": "object",
        "description": "A JSON Object containing status, code and the result",
        "schema": {
          "title": "result",
          "type": "object"
        }
      },
      "roles": [
        "admin"
      ],
      "route": {
        "verb": "POST",
        "path": "/getFilebucketfileMd5ChecksumOriginalPath"
      },
      "task": true
    },
    {
      "name": "putFilebucketfileMd5ChecksumOriginalPath",
      "summary": "Save a file to the filebucket.",
      "description": "Save a file to the filebucket.",
      "input": [
        {
          "name": "checksum",
          "type": "string",
          "info": "Checksum md5 value",
          "required": true,
          "schema": {
            "title": "checksum",
            "type": "string"
          }
        },
        {
          "name": "originalPath",
          "type": "string",
          "info": "the full absolute path of the file on the client system.",
          "required": true,
          "schema": {
            "title": "originalPath",
            "type": "string"
          }
        },
        {
          "name": "environment",
          "type": "string",
          "info": "environment name",
          "required": true,
          "schema": {
            "title": "environment",
            "type": "string"
          }
        },
        {
          "name": "body",
          "type": "object",
          "info": "",
          "required": true,
          "schema": {
            "title": "body",
            "type": "object"
          }
        }
      ],
      "output": {
        "name": "result",
        "type": "object",
        "description": "A JSON Object containing status, code and the result",
        "schema": {
          "title": "result",
          "type": "object"
        }
      },
      "roles": [
        "admin"
      ],
      "route": {
        "verb": "POST",
        "path": "/putFilebucketfileMd5ChecksumOriginalPath"
      },
      "task": true
    },
    {
      "name": "headFilebucketfileMd5ChecksumOriginalPath",
      "summary": "Check if a file is present in the filebucket.",
      "description": "Check if a file is present in the filebucket.",
      "input": [
        {
          "name": "checksum",
          "type": "string",
          "info": "checksum md5 value",
          "required": true,
          "schema": {
            "title": "checksum",
            "type": "string"
          }
        },
        {
          "name": "originalPath",
          "type": "string",
          "info": "the full absolute path of the file on the client system.",
          "required": true,
          "schema": {
            "title": "originalPath",
            "type": "string"
          }
        },
        {
          "name": "environment",
          "type": "string",
          "info": "environment name",
          "required": true,
          "schema": {
            "title": "environment",
            "type": "string"
          }
        }
      ],
      "output": {
        "name": "result",
        "type": "object",
        "description": "A JSON Object containing status, code and the result",
        "schema": {
          "title": "result",
          "type": "object"
        }
      },
      "roles": [
        "admin"
      ],
      "route": {
        "verb": "POST",
        "path": "/headFilebucketfileMd5ChecksumOriginalPath"
      },
      "task": true
    }
  ]
}