{
  "$id": "schema.json",
  "type": "object",
  "schema": "http://json-schema.org/draft-07/schema#",
  "translate": true,
  "dynamicfields": true,
  "properties": {
    "ph_request_type": {
      "type": "string",
      "description": "type of request (internal to adapter)",
      "default": "getPrefixCustomerType",
      "enum": [
        "getPrefixCustomerType",
        "getPrefixCustomerTypeIpVersion",
        "getPrefixCustomerTypeAddress",
        "getPrefixCustomerTypeAddressIpVersion",
        "getPrefixCustomerTypeIpVersionMask",
        "postPrefixCustomerTypeIpVersionMask",
        "getPrefixCustomerTypeIpVersionAddress",
        "postPrefixCustomerTypeIpVersionAddress"
      ],
      "external_name": "ph_request_type"
    },
    "customerType": {
      "type": "string",
      "description": "customer_type",
      "parse": false,
      "encode": false,
      "encrypt": {
        "type": "AES",
        "key": ""
      },
      "external_name": "customer_type"
    },
    "ipVersion": {
      "type": "string",
      "description": "ip_version",
      "parse": false,
      "encode": false,
      "encrypt": {
        "type": "AES",
        "key": ""
      },
      "external_name": "ip_version"
    }
  },
  "definitions": {}
}