{
  "_links": {},
  "audiences": [
    "string",
    "string",
    "string",
    "string",
    "string",
    "string",
    "string"
  ],
  "created": "string",
  "credentials": {
    "signing": {
      "kid": "string",
      "lastRotated": "string",
      "nextRotation": "string",
      "rotationMode": "AUTO",
      "use": "sig"
    }
  },
  "description": "string",
  "id": "string",
  "issuer": "string",
  "issuerMode": "CUSTOM_URL",
  "lastUpdated": "string",
  "name": "string",
  "status": "ACTIVE"
}