{
  "actions": [
    {
      "name": "listOrigins",
      "protocol": "REST",
      "method": "GET",
      "entitypath": "{base_path}/{version}/api/v1/trustedOrigins?{query}",
      "requestSchema": "schema.json",
      "responseSchema": "schema.json",
      "timeout": 0,
      "sendEmpty": false,
      "sendGetBody": false,
      "requestDatatype": "JSON",
      "responseDatatype": "JSON",
      "headers": {},
      "responseObjects": [
        {
          "type": "default",
          "key": "",
          "mockFile": "mockdatafiles/listOrigins-default.json"
        }
      ]
    },
    {
      "name": "createOrigin",
      "protocol": "REST",
      "method": "POST",
      "entitypath": "{base_path}/{version}/api/v1/trustedOrigins?{query}",
      "requestSchema": "schema.json",
      "responseSchema": "schema.json",
      "timeout": 0,
      "sendEmpty": false,
      "requestDatatype": "JSON",
      "responseDatatype": "JSON",
      "headers": {},
      "responseObjects": [
        {
          "type": "default",
          "key": "",
          "mockFile": "mockdatafiles/createOrigin-default.json"
        }
      ]
    },
    {
      "name": "deleteOrigin",
      "protocol": "REST",
      "method": "DELETE",
      "entitypath": "{base_path}/{version}/api/v1/trustedOrigins/{pathv1}?{query}",
      "requestSchema": "schema.json",
      "responseSchema": "schema.json",
      "timeout": 0,
      "sendEmpty": false,
      "requestDatatype": "JSON",
      "responseDatatype": "JSON",
      "headers": {},
      "responseObjects": [
        {
          "type": "default",
          "key": "",
          "mockFile": ""
        }
      ]
    },
    {
      "name": "getOrigin",
      "protocol": "REST",
      "method": "GET",
      "entitypath": "{base_path}/{version}/api/v1/trustedOrigins/{pathv1}?{query}",
      "requestSchema": "schema.json",
      "responseSchema": "schema.json",
      "timeout": 0,
      "sendEmpty": false,
      "sendGetBody": false,
      "requestDatatype": "JSON",
      "responseDatatype": "JSON",
      "headers": {},
      "responseObjects": [
        {
          "type": "default",
          "key": "",
          "mockFile": "mockdatafiles/getOrigin-default.json"
        }
      ]
    },
    {
      "name": "updateOrigin",
      "protocol": "REST",
      "method": "PUT",
      "entitypath": "{base_path}/{version}/api/v1/trustedOrigins/{pathv1}?{query}",
      "requestSchema": "schema.json",
      "responseSchema": "schema.json",
      "timeout": 0,
      "sendEmpty": false,
      "requestDatatype": "JSON",
      "responseDatatype": "JSON",
      "headers": {},
      "responseObjects": [
        {
          "type": "default",
          "key": "",
          "mockFile": "mockdatafiles/updateOrigin-default.json"
        }
      ]
    },
    {
      "name": "activateOrigin",
      "protocol": "REST",
      "method": "POST",
      "entitypath": "{base_path}/{version}/api/v1/trustedOrigins/{pathv1}/lifecycle/activate?{query}",
      "requestSchema": "schema.json",
      "responseSchema": "schema.json",
      "timeout": 0,
      "sendEmpty": false,
      "requestDatatype": "JSON",
      "responseDatatype": "JSON",
      "headers": {},
      "responseObjects": [
        {
          "type": "default",
          "key": "",
          "mockFile": "mockdatafiles/activateOrigin-default.json"
        }
      ]
    },
    {
      "name": "deactivateOrigin",
      "protocol": "REST",
      "method": "POST",
      "entitypath": "{base_path}/{version}/api/v1/trustedOrigins/{pathv1}/lifecycle/deactivate?{query}",
      "requestSchema": "schema.json",
      "responseSchema": "schema.json",
      "timeout": 0,
      "sendEmpty": false,
      "requestDatatype": "JSON",
      "responseDatatype": "JSON",
      "headers": {},
      "responseObjects": [
        {
          "type": "default",
          "key": "",
          "mockFile": "mockdatafiles/deactivateOrigin-default.json"
        }
      ]
    }
  ]
}