[
  {
    "_links": {},
    "created": "string",
    "id": "string",
    "issuerMode": "ORG_URL",
    "lastUpdated": "string",
    "name": "string",
    "policy": {
      "accountLink": {
        "action": "AUTO",
        "filter": {
          "groups": {}
        }
      },
      "maxClockSkew": 8,
      "provisioning": {
        "action": "AUTO",
        "conditions": {
          "deprovisioned": {},
          "suspended": {}
        },
        "groups": {
          "action": "SYNC",
          "assignments": [
            "string"
          ],
          "filter": [
            "string",
            "string",
            "string",
            "string"
          ],
          "sourceAttributeName": "string"
        },
        "profileMaster": true
      },
      "subject": {
        "filter": "string",
        "format": [
          "string",
          "string",
          "string",
          "string",
          "string"
        ],
        "matchAttribute": "string",
        "matchType": "CUSTOM_ATTRIBUTE",
        "userNameTemplate": {
          "template": "string"
        }
      }
    },
    "protocol": {
      "algorithms": {
        "request": {
          "signature": {}
        },
        "response": {
          "signature": {}
        }
      },
      "credentials": {
        "client": {
          "client_id": "string",
          "client_secret": "string"
        },
        "signing": {
          "kid": "string"
        },
        "trust": {
          "audience": "string",
          "issuer": "string",
          "kid": "string",
          "revocation": "DELTA_CRL",
          "revocationCacheLifetime": 7
        }
      },
      "endpoints": {
        "acs": {
          "binding": "HTTP-POST",
          "destination": "string",
          "type": "INSTANCE",
          "url": "string"
        },
        "authorization": {
          "binding": "HTTP-REDIRECT",
          "destination": "string",
          "type": "INSTANCE",
          "url": "string"
        },
        "jwks": {
          "binding": "HTTP-POST",
          "destination": "string",
          "type": "ORG",
          "url": "string"
        },
        "metadata": {
          "binding": "HTTP-POST",
          "destination": "string",
          "type": "INSTANCE",
          "url": "string"
        },
        "slo": {
          "binding": "HTTP-POST",
          "destination": "string",
          "type": "ORG",
          "url": "string"
        },
        "sso": {
          "binding": "HTTP-POST",
          "destination": "string",
          "type": "ORG",
          "url": "string"
        },
        "token": {
          "binding": "HTTP-REDIRECT",
          "destination": "string",
          "type": "ORG",
          "url": "string"
        },
        "userInfo": {
          "binding": "HTTP-REDIRECT",
          "destination": "string",
          "type": "ORG",
          "url": "string"
        }
      },
      "issuer": {
        "binding": "HTTP-POST",
        "destination": "string",
        "type": "ORG",
        "url": "string"
      },
      "relayState": {
        "format": "OPAQUE"
      },
      "scopes": [
        "string",
        "string",
        "string"
      ],
      "settings": {
        "nameFormat": "string"
      },
      "type": "OAUTH2"
    },
    "status": "ACTIVE",
    "type": "IWA"
  },
  {
    "_links": {},
    "created": "string",
    "id": "string",
    "issuerMode": "CUSTOM_URL_DOMAIN",
    "lastUpdated": "string",
    "name": "string",
    "policy": {
      "accountLink": {
        "action": "DISABLED",
        "filter": {
          "groups": {}
        }
      },
      "maxClockSkew": 1,
      "provisioning": {
        "action": "DISABLED",
        "conditions": {
          "deprovisioned": {},
          "suspended": {}
        },
        "groups": {
          "action": "ASSIGN",
          "assignments": [
            "string",
            "string",
            "string",
            "string"
          ],
          "filter": [
            "string",
            "string"
          ],
          "sourceAttributeName": "string"
        },
        "profileMaster": false
      },
      "subject": {
        "filter": "string",
        "format": [
          "string",
          "string",
          "string",
          "string",
          "string",
          "string",
          "string",
          "string",
          "string",
          "string"
        ],
        "matchAttribute": "string",
        "matchType": "USERNAME",
        "userNameTemplate": {
          "template": "string"
        }
      }
    },
    "protocol": {
      "algorithms": {
        "request": {
          "signature": {}
        },
        "response": {
          "signature": {}
        }
      },
      "credentials": {
        "client": {
          "client_id": "string",
          "client_secret": "string"
        },
        "signing": {
          "kid": "string"
        },
        "trust": {
          "audience": "string",
          "issuer": "string",
          "kid": "string",
          "revocation": "DELTA_CRL",
          "revocationCacheLifetime": 2
        }
      },
      "endpoints": {
        "acs": {
          "binding": "HTTP-REDIRECT",
          "destination": "string",
          "type": "INSTANCE",
          "url": "string"
        },
        "authorization": {
          "binding": "HTTP-REDIRECT",
          "destination": "string",
          "type": "ORG",
          "url": "string"
        },
        "jwks": {
          "binding": "HTTP-POST",
          "destination": "string",
          "type": "INSTANCE",
          "url": "string"
        },
        "metadata": {
          "binding": "HTTP-POST",
          "destination": "string",
          "type": "ORG",
          "url": "string"
        },
        "slo": {
          "binding": "HTTP-REDIRECT",
          "destination": "string",
          "type": "INSTANCE",
          "url": "string"
        },
        "sso": {
          "binding": "HTTP-POST",
          "destination": "string",
          "type": "INSTANCE",
          "url": "string"
        },
        "token": {
          "binding": "HTTP-REDIRECT",
          "destination": "string",
          "type": "INSTANCE",
          "url": "string"
        },
        "userInfo": {
          "binding": "HTTP-POST",
          "destination": "string",
          "type": "ORG",
          "url": "string"
        }
      },
      "issuer": {
        "binding": "HTTP-REDIRECT",
        "destination": "string",
        "type": "INSTANCE",
        "url": "string"
      },
      "relayState": {
        "format": "OPAQUE"
      },
      "scopes": [
        "string",
        "string",
        "string"
      ],
      "settings": {
        "nameFormat": "string"
      },
      "type": "OIDC"
    },
    "status": "ACTIVE",
    "type": "AgentlessDSSO"
  },
  {
    "_links": {},
    "created": "string",
    "id": "string",
    "issuerMode": "ORG_URL",
    "lastUpdated": "string",
    "name": "string",
    "policy": {
      "accountLink": {
        "action": "DISABLED",
        "filter": {
          "groups": {}
        }
      },
      "maxClockSkew": 8,
      "provisioning": {
        "action": "AUTO",
        "conditions": {
          "deprovisioned": {},
          "suspended": {}
        },
        "groups": {
          "action": "SYNC",
          "assignments": [
            "string",
            "string",
            "string",
            "string",
            "string"
          ],
          "filter": [
            "string",
            "string",
            "string",
            "string"
          ],
          "sourceAttributeName": "string"
        },
        "profileMaster": false
      },
      "subject": {
        "filter": "string",
        "format": [
          "string",
          "string",
          "string",
          "string",
          "string",
          "string",
          "string"
        ],
        "matchAttribute": "string",
        "matchType": "USERNAME_OR_EMAIL",
        "userNameTemplate": {
          "template": "string"
        }
      }
    },
    "protocol": {
      "algorithms": {
        "request": {
          "signature": {}
        },
        "response": {
          "signature": {}
        }
      },
      "credentials": {
        "client": {
          "client_id": "string",
          "client_secret": "string"
        },
        "signing": {
          "kid": "string"
        },
        "trust": {
          "audience": "string",
          "issuer": "string",
          "kid": "string",
          "revocation": "OCSP",
          "revocationCacheLifetime": 5
        }
      },
      "endpoints": {
        "acs": {
          "binding": "HTTP-REDIRECT",
          "destination": "string",
          "type": "ORG",
          "url": "string"
        },
        "authorization": {
          "binding": "HTTP-POST",
          "destination": "string",
          "type": "INSTANCE",
          "url": "string"
        },
        "jwks": {
          "binding": "HTTP-REDIRECT",
          "destination": "string",
          "type": "INSTANCE",
          "url": "string"
        },
        "metadata": {
          "binding": "HTTP-POST",
          "destination": "string",
          "type": "ORG",
          "url": "string"
        },
        "slo": {
          "binding": "HTTP-POST",
          "destination": "string",
          "type": "ORG",
          "url": "string"
        },
        "sso": {
          "binding": "HTTP-REDIRECT",
          "destination": "string",
          "type": "ORG",
          "url": "string"
        },
        "token": {
          "binding": "HTTP-POST",
          "destination": "string",
          "type": "INSTANCE",
          "url": "string"
        },
        "userInfo": {
          "binding": "HTTP-REDIRECT",
          "destination": "string",
          "type": "INSTANCE",
          "url": "string"
        }
      },
      "issuer": {
        "binding": "HTTP-POST",
        "destination": "string",
        "type": "INSTANCE",
        "url": "string"
      },
      "relayState": {
        "format": "OPAQUE"
      },
      "scopes": [
        "string",
        "string",
        "string",
        "string"
      ],
      "settings": {
        "nameFormat": "string"
      },
      "type": "OIDC"
    },
    "status": "ACTIVE",
    "type": "X509"
  }
]