{
  "actions": {
    "assignUserToGroups": {
      "groupIds": [
        "string",
        "string"
      ]
    }
  },
  "conditions": {
    "expression": {
      "type": "string",
      "value": "string"
    },
    "people": {
      "groups": {
        "exclude": [
          "string",
          "string",
          "string",
          "string",
          "string",
          "string",
          "string"
        ],
        "include": [
          "string",
          "string",
          "string"
        ]
      },
      "users": {
        "exclude": [
          "string",
          "string",
          "string"
        ],
        "include": [
          "string",
          "string",
          "string",
          "string"
        ]
      }
    }
  },
  "created": "string",
  "id": "string",
  "lastUpdated": "string",
  "name": "string",
  "status": "INVALID",
  "type": "string"
}