[
  {
    "actor": {
      "alternateId": "string",
      "detail": {},
      "displayName": "string",
      "id": "string",
      "type": "string"
    },
    "authenticationContext": {
      "authenticationProvider": "FACTOR_PROVIDER",
      "authenticationStep": 4,
      "credentialProvider": "DUO",
      "credentialType": "IWA",
      "externalSessionId": "string",
      "interface": "string",
      "issuer": {
        "id": "string",
        "type": "string"
      }
    },
    "client": {
      "device": "string",
      "geographicalContext": {
        "city": "string",
        "country": "string",
        "geolocation": {
          "lat": 6,
          "lon": 8
        },
        "postalCode": "string",
        "state": "string"
      },
      "id": "string",
      "ipAddress": "string",
      "userAgent": {
        "browser": "string",
        "os": "string",
        "rawUserAgent": "string"
      },
      "zone": "string"
    },
    "debugContext": {
      "debugData": {}
    },
    "displayMessage": "string",
    "eventType": "string",
    "legacyEventType": "string",
    "outcome": {
      "reason": "string",
      "result": "string"
    },
    "published": "string",
    "request": {
      "ipChain": [
        {
          "geographicalContext": {
            "city": "string",
            "country": "string",
            "geolocation": {
              "lat": 3,
              "lon": 5
            },
            "postalCode": "string",
            "state": "string"
          },
          "ip": "string",
          "source": "string",
          "version": "string"
        },
        {
          "geographicalContext": {
            "city": "string",
            "country": "string",
            "geolocation": {
              "lat": 7,
              "lon": 6
            },
            "postalCode": "string",
            "state": "string"
          },
          "ip": "string",
          "source": "string",
          "version": "string"
        },
        {
          "geographicalContext": {
            "city": "string",
            "country": "string",
            "geolocation": {
              "lat": 7,
              "lon": 10
            },
            "postalCode": "string",
            "state": "string"
          },
          "ip": "string",
          "source": "string",
          "version": "string"
        },
        {
          "geographicalContext": {
            "city": "string",
            "country": "string",
            "geolocation": {
              "lat": 4,
              "lon": 4
            },
            "postalCode": "string",
            "state": "string"
          },
          "ip": "string",
          "source": "string",
          "version": "string"
        },
        {
          "geographicalContext": {
            "city": "string",
            "country": "string",
            "geolocation": {
              "lat": 8,
              "lon": 2
            },
            "postalCode": "string",
            "state": "string"
          },
          "ip": "string",
          "source": "string",
          "version": "string"
        },
        {
          "geographicalContext": {
            "city": "string",
            "country": "string",
            "geolocation": {
              "lat": 4,
              "lon": 8
            },
            "postalCode": "string",
            "state": "string"
          },
          "ip": "string",
          "source": "string",
          "version": "string"
        },
        {
          "geographicalContext": {
            "city": "string",
            "country": "string",
            "geolocation": {
              "lat": 6,
              "lon": 2
            },
            "postalCode": "string",
            "state": "string"
          },
          "ip": "string",
          "source": "string",
          "version": "string"
        },
        {
          "geographicalContext": {
            "city": "string",
            "country": "string",
            "geolocation": {
              "lat": 3,
              "lon": 1
            },
            "postalCode": "string",
            "state": "string"
          },
          "ip": "string",
          "source": "string",
          "version": "string"
        }
      ]
    },
    "securityContext": {
      "asNumber": 9,
      "asOrg": "string",
      "domain": "string",
      "isProxy": true,
      "isp": "string"
    },
    "severity": "WARN",
    "target": [
      {
        "alternateId": "string",
        "detailEntry": {},
        "displayName": "string",
        "id": "string",
        "type": "string"
      },
      {
        "alternateId": "string",
        "detailEntry": {},
        "displayName": "string",
        "id": "string",
        "type": "string"
      },
      {
        "alternateId": "string",
        "detailEntry": {},
        "displayName": "string",
        "id": "string",
        "type": "string"
      }
    ],
    "transaction": {
      "detail": {},
      "id": "string",
      "type": "string"
    },
    "uuid": "string",
    "version": "string"
  },
  {
    "actor": {
      "alternateId": "string",
      "detail": {},
      "displayName": "string",
      "id": "string",
      "type": "string"
    },
    "authenticationContext": {
      "authenticationProvider": "ACTIVE_DIRECTORY",
      "authenticationStep": 6,
      "credentialProvider": "OKTA_CREDENTIAL_PROVIDER",
      "credentialType": "OAUTH2",
      "externalSessionId": "string",
      "interface": "string",
      "issuer": {
        "id": "string",
        "type": "string"
      }
    },
    "client": {
      "device": "string",
      "geographicalContext": {
        "city": "string",
        "country": "string",
        "geolocation": {
          "lat": 1,
          "lon": 2
        },
        "postalCode": "string",
        "state": "string"
      },
      "id": "string",
      "ipAddress": "string",
      "userAgent": {
        "browser": "string",
        "os": "string",
        "rawUserAgent": "string"
      },
      "zone": "string"
    },
    "debugContext": {
      "debugData": {}
    },
    "displayMessage": "string",
    "eventType": "string",
    "legacyEventType": "string",
    "outcome": {
      "reason": "string",
      "result": "string"
    },
    "published": "string",
    "request": {
      "ipChain": [
        {
          "geographicalContext": {
            "city": "string",
            "country": "string",
            "geolocation": {
              "lat": 4,
              "lon": 7
            },
            "postalCode": "string",
            "state": "string"
          },
          "ip": "string",
          "source": "string",
          "version": "string"
        },
        {
          "geographicalContext": {
            "city": "string",
            "country": "string",
            "geolocation": {
              "lat": 3,
              "lon": 6
            },
            "postalCode": "string",
            "state": "string"
          },
          "ip": "string",
          "source": "string",
          "version": "string"
        },
        {
          "geographicalContext": {
            "city": "string",
            "country": "string",
            "geolocation": {
              "lat": 2,
              "lon": 8
            },
            "postalCode": "string",
            "state": "string"
          },
          "ip": "string",
          "source": "string",
          "version": "string"
        },
        {
          "geographicalContext": {
            "city": "string",
            "country": "string",
            "geolocation": {
              "lat": 7,
              "lon": 5
            },
            "postalCode": "string",
            "state": "string"
          },
          "ip": "string",
          "source": "string",
          "version": "string"
        },
        {
          "geographicalContext": {
            "city": "string",
            "country": "string",
            "geolocation": {
              "lat": 8,
              "lon": 6
            },
            "postalCode": "string",
            "state": "string"
          },
          "ip": "string",
          "source": "string",
          "version": "string"
        },
        {
          "geographicalContext": {
            "city": "string",
            "country": "string",
            "geolocation": {
              "lat": 7,
              "lon": 10
            },
            "postalCode": "string",
            "state": "string"
          },
          "ip": "string",
          "source": "string",
          "version": "string"
        },
        {
          "geographicalContext": {
            "city": "string",
            "country": "string",
            "geolocation": {
              "lat": 9,
              "lon": 4
            },
            "postalCode": "string",
            "state": "string"
          },
          "ip": "string",
          "source": "string",
          "version": "string"
        },
        {
          "geographicalContext": {
            "city": "string",
            "country": "string",
            "geolocation": {
              "lat": 8,
              "lon": 4
            },
            "postalCode": "string",
            "state": "string"
          },
          "ip": "string",
          "source": "string",
          "version": "string"
        },
        {
          "geographicalContext": {
            "city": "string",
            "country": "string",
            "geolocation": {
              "lat": 4,
              "lon": 5
            },
            "postalCode": "string",
            "state": "string"
          },
          "ip": "string",
          "source": "string",
          "version": "string"
        },
        {
          "geographicalContext": {
            "city": "string",
            "country": "string",
            "geolocation": {
              "lat": 2,
              "lon": 2
            },
            "postalCode": "string",
            "state": "string"
          },
          "ip": "string",
          "source": "string",
          "version": "string"
        }
      ]
    },
    "securityContext": {
      "asNumber": 8,
      "asOrg": "string",
      "domain": "string",
      "isProxy": true,
      "isp": "string"
    },
    "severity": "WARN",
    "target": [
      {
        "alternateId": "string",
        "detailEntry": {},
        "displayName": "string",
        "id": "string",
        "type": "string"
      },
      {
        "alternateId": "string",
        "detailEntry": {},
        "displayName": "string",
        "id": "string",
        "type": "string"
      },
      {
        "alternateId": "string",
        "detailEntry": {},
        "displayName": "string",
        "id": "string",
        "type": "string"
      },
      {
        "alternateId": "string",
        "detailEntry": {},
        "displayName": "string",
        "id": "string",
        "type": "string"
      },
      {
        "alternateId": "string",
        "detailEntry": {},
        "displayName": "string",
        "id": "string",
        "type": "string"
      },
      {
        "alternateId": "string",
        "detailEntry": {},
        "displayName": "string",
        "id": "string",
        "type": "string"
      },
      {
        "alternateId": "string",
        "detailEntry": {},
        "displayName": "string",
        "id": "string",
        "type": "string"
      },
      {
        "alternateId": "string",
        "detailEntry": {},
        "displayName": "string",
        "id": "string",
        "type": "string"
      },
      {
        "alternateId": "string",
        "detailEntry": {},
        "displayName": "string",
        "id": "string",
        "type": "string"
      },
      {
        "alternateId": "string",
        "detailEntry": {},
        "displayName": "string",
        "id": "string",
        "type": "string"
      }
    ],
    "transaction": {
      "detail": {},
      "id": "string",
      "type": "string"
    },
    "uuid": "string",
    "version": "string"
  },
  {
    "actor": {
      "alternateId": "string",
      "detail": {},
      "displayName": "string",
      "id": "string",
      "type": "string"
    },
    "authenticationContext": {
      "authenticationProvider": "LDAP",
      "authenticationStep": 2,
      "credentialProvider": "DUO",
      "credentialType": "JWT",
      "externalSessionId": "string",
      "interface": "string",
      "issuer": {
        "id": "string",
        "type": "string"
      }
    },
    "client": {
      "device": "string",
      "geographicalContext": {
        "city": "string",
        "country": "string",
        "geolocation": {
          "lat": 2,
          "lon": 2
        },
        "postalCode": "string",
        "state": "string"
      },
      "id": "string",
      "ipAddress": "string",
      "userAgent": {
        "browser": "string",
        "os": "string",
        "rawUserAgent": "string"
      },
      "zone": "string"
    },
    "debugContext": {
      "debugData": {}
    },
    "displayMessage": "string",
    "eventType": "string",
    "legacyEventType": "string",
    "outcome": {
      "reason": "string",
      "result": "string"
    },
    "published": "string",
    "request": {
      "ipChain": [
        {
          "geographicalContext": {
            "city": "string",
            "country": "string",
            "geolocation": {
              "lat": 9,
              "lon": 2
            },
            "postalCode": "string",
            "state": "string"
          },
          "ip": "string",
          "source": "string",
          "version": "string"
        },
        {
          "geographicalContext": {
            "city": "string",
            "country": "string",
            "geolocation": {
              "lat": 5,
              "lon": 2
            },
            "postalCode": "string",
            "state": "string"
          },
          "ip": "string",
          "source": "string",
          "version": "string"
        },
        {
          "geographicalContext": {
            "city": "string",
            "country": "string",
            "geolocation": {
              "lat": 6,
              "lon": 7
            },
            "postalCode": "string",
            "state": "string"
          },
          "ip": "string",
          "source": "string",
          "version": "string"
        },
        {
          "geographicalContext": {
            "city": "string",
            "country": "string",
            "geolocation": {
              "lat": 6,
              "lon": 10
            },
            "postalCode": "string",
            "state": "string"
          },
          "ip": "string",
          "source": "string",
          "version": "string"
        }
      ]
    },
    "securityContext": {
      "asNumber": 1,
      "asOrg": "string",
      "domain": "string",
      "isProxy": false,
      "isp": "string"
    },
    "severity": "DEBUG",
    "target": [
      {
        "alternateId": "string",
        "detailEntry": {},
        "displayName": "string",
        "id": "string",
        "type": "string"
      },
      {
        "alternateId": "string",
        "detailEntry": {},
        "displayName": "string",
        "id": "string",
        "type": "string"
      },
      {
        "alternateId": "string",
        "detailEntry": {},
        "displayName": "string",
        "id": "string",
        "type": "string"
      },
      {
        "alternateId": "string",
        "detailEntry": {},
        "displayName": "string",
        "id": "string",
        "type": "string"
      },
      {
        "alternateId": "string",
        "detailEntry": {},
        "displayName": "string",
        "id": "string",
        "type": "string"
      }
    ],
    "transaction": {
      "detail": {},
      "id": "string",
      "type": "string"
    },
    "uuid": "string",
    "version": "string"
  }
]