[
  {
    "appAssignmentId": "string",
    "appInstanceId": "string",
    "appName": "string",
    "credentialsSetup": false,
    "hidden": false,
    "id": "string",
    "label": "string",
    "linkUrl": "string",
    "logoUrl": "string",
    "sortOrder": 9
  },
  {
    "appAssignmentId": "string",
    "appInstanceId": "string",
    "appName": "string",
    "credentialsSetup": false,
    "hidden": false,
    "id": "string",
    "label": "string",
    "linkUrl": "string",
    "logoUrl": "string",
    "sortOrder": 6
  }
]