[
  {
    "_links": {},
    "client_id": "string",
    "client_name": "string",
    "client_uri": "string",
    "logo_uri": "string"
  },
  {
    "_links": {},
    "client_id": "string",
    "client_name": "string",
    "client_uri": "string",
    "logo_uri": "string"
  },
  {
    "_links": {},
    "client_id": "string",
    "client_name": "string",
    "client_uri": "string",
    "logo_uri": "string"
  },
  {
    "_links": {},
    "client_id": "string",
    "client_name": "string",
    "client_uri": "string",
    "logo_uri": "string"
  }
]