[
  {
    "_embedded": {},
    "_links": {},
    "clientId": "string",
    "created": "string",
    "expiresAt": "string",
    "id": "string",
    "issuer": "string",
    "lastUpdated": "string",
    "scopes": [
      "string",
      "string",
      "string",
      "string",
      "string",
      "string"
    ],
    "status": "ACTIVE",
    "userId": "string"
  },
  {
    "_embedded": {},
    "_links": {},
    "clientId": "string",
    "created": "string",
    "expiresAt": "string",
    "id": "string",
    "issuer": "string",
    "lastUpdated": "string",
    "scopes": [
      "string",
      "string",
      "string",
      "string",
      "string",
      "string",
      "string",
      "string",
      "string",
      "string"
    ],
    "status": "ACTIVE",
    "userId": "string"
  }
]