[
  {
    "config_tree_id": 4,
    "properties": {},
    "nameservers": [
      "string",
      "string",
      "string",
      "string",
      "string"
    ],
    "type": "string",
    "id": 4,
    "name": "string"
  },
  {
    "config_tree_id": 6,
    "properties": {},
    "nameservers": [
      "string",
      "string",
      "string",
      "string",
      "string",
      "string",
      "string",
      "string",
      "string",
      "string"
    ],
    "type": "string",
    "id": 2,
    "name": "string"
  },
  {
    "config_tree_id": 5,
    "properties": {},
    "nameservers": [
      "string",
      "string",
      "string",
      "string",
      "string"
    ],
    "type": "string",
    "id": 9,
    "name": "string"
  }
]