{
  "$id": "schema.json",
  "type": "object",
  "schema": "http://json-schema.org/draft-07/schema#",
  "translate": true,
  "dynamicfields": true,
  "properties": {
    "ph_request_type": {
      "type": "string",
      "description": "type of request (internal to adapter)",
      "default": "postOpsBootstrap",
      "enum": [
        "postOpsBootstrap",
        "getOpsOperators",
        "putOpsOperators",
        "getOpsOperatorsOperatorId",
        "postOpsOperatorsOperatorId",
        "deleteOpsOperatorsOperatorId",
        "getOpsOrgs",
        "putOpsOrgs",
        "getOpsOrgsOrgid",
        "postOpsOrgsOrgid",
        "deleteOpsOrgsOrgid",
        "getOpsOrgsOrgidServiceGroups"
      ],
      "external_name": "ph_request_type"
    },
    "operatorId": {
      "type": "string",
      "description": "Operator ID",
      "parse": false,
      "encode": false,
      "encrypt": {
        "type": "AES",
        "key": ""
      },
      "external_name": "operator-id"
    }
  },
  "definitions": {}
}