{
  "config_tree_id": 7,
  "properties": {},
  "nameservers": [
    "string",
    "string",
    "string",
    "string",
    "string",
    "string",
    "string",
    "string"
  ],
  "type": "string",
  "id": 3,
  "name": "string"
}