[
  {
    "prefix": "string",
    "network_id": 6,
    "kvps": {},
    "tags": [
      "string",
      "string",
      "string",
      "string",
      "string"
    ],
    "desc": "string",
    "status": "string",
    "name": "string",
    "inherited_tags": [
      "string",
      "string",
      "string",
      "string",
      "string",
      "string",
      "string"
    ],
    "total_addresses": "string",
    "children": 10,
    "free_addresses": "string",
    "id": 6,
    "indent": 7,
    "used_addresses": "string",
    "parent": {}
  }
]