{
  "actions": [
    {
      "name": "getOpsServiceDefs",
      "protocol": "REST",
      "method": "GET",
      "entitypath": "{base_path}/{version}/ops/service/defs?{query}",
      "requestSchema": "schema.json",
      "responseSchema": "schema.json",
      "timeout": 0,
      "sendEmpty": false,
      "sendGetBody": false,
      "requestDatatype": "JSON",
      "responseDatatype": "JSON",
      "headers": {},
      "responseObjects": [
        {
          "type": "default",
          "key": "",
          "mockFile": "mockdatafiles/getOpsServiceDefs-default.json"
        }
      ]
    },
    {
      "name": "putOpsServiceDefs",
      "protocol": "REST",
      "method": "PUT",
      "entitypath": "{base_path}/{version}/ops/service/defs?{query}",
      "requestSchema": "schema.json",
      "responseSchema": "schema.json",
      "timeout": 0,
      "sendEmpty": false,
      "sendGetBody": false,
      "requestDatatype": "JSON",
      "responseDatatype": "JSON",
      "headers": {},
      "responseObjects": [
        {
          "type": "default",
          "key": "",
          "mockFile": "mockdatafiles/putOpsServiceDefs-default.json"
        }
      ]
    },
    {
      "name": "getOpsServiceDefsDefinitionid",
      "protocol": "REST",
      "method": "GET",
      "entitypath": "{base_path}/{version}/ops/service/defs/{pathv1}?{query}",
      "requestSchema": "schema.json",
      "responseSchema": "schema.json",
      "timeout": 0,
      "sendEmpty": false,
      "sendGetBody": false,
      "requestDatatype": "JSON",
      "responseDatatype": "JSON",
      "headers": {},
      "responseObjects": [
        {
          "type": "default",
          "key": "",
          "mockFile": "mockdatafiles/getOpsServiceDefsDefinitionid-default.json"
        }
      ]
    },
    {
      "name": "postOpsServiceDefsDefinitionid",
      "protocol": "REST",
      "method": "POST",
      "entitypath": "{base_path}/{version}/ops/service/defs/{pathv1}?{query}",
      "requestSchema": "schema.json",
      "responseSchema": "schema.json",
      "timeout": 0,
      "sendEmpty": false,
      "sendGetBody": false,
      "requestDatatype": "JSON",
      "responseDatatype": "JSON",
      "headers": {},
      "responseObjects": [
        {
          "type": "default",
          "key": "",
          "mockFile": "mockdatafiles/postOpsServiceDefsDefinitionid-default.json"
        }
      ]
    },
    {
      "name": "deleteOpsServiceDefsDefinitionid",
      "protocol": "REST",
      "method": "DELETE",
      "entitypath": "{base_path}/{version}/ops/service/defs/{pathv1}?{query}",
      "requestSchema": "schema.json",
      "responseSchema": "schema.json",
      "timeout": 0,
      "sendEmpty": false,
      "sendGetBody": false,
      "requestDatatype": "JSON",
      "responseDatatype": "JSON",
      "headers": {},
      "responseObjects": [
        {
          "type": "default",
          "key": "",
          "mockFile": ""
        }
      ]
    }
  ]
}