{
  "actions": [
    {
      "name": "getRealms",
      "protocol": "REST",
      "method": "GET",
      "entitypath": "{base_path}/{version}/beta/security/realms/available?{query}",
      "requestSchema": "schema.json",
      "responseSchema": "schema.json",
      "timeout": 0,
      "sendEmpty": false,
      "sendGetBody": false,
      "requestDatatype": "JSON",
      "responseDatatype": "JSON",
      "headers": {},
      "responseObjects": [
        {
          "type": "default",
          "key": "",
          "mockFile": "mockdatafiles/getRealms-default.json"
        }
      ]
    },
    {
      "name": "getActiveRealms",
      "protocol": "REST",
      "method": "GET",
      "entitypath": "{base_path}/{version}/beta/security/realms/active?{query}",
      "requestSchema": "schema.json",
      "responseSchema": "schema.json",
      "timeout": 0,
      "sendEmpty": false,
      "sendGetBody": false,
      "requestDatatype": "JSON",
      "responseDatatype": "JSON",
      "headers": {},
      "responseObjects": [
        {
          "type": "default",
          "key": "",
          "mockFile": "mockdatafiles/getActiveRealms-default.json"
        }
      ]
    },
    {
      "name": "setActiveRealms",
      "protocol": "REST",
      "method": "PUT",
      "entitypath": "{base_path}/{version}/beta/security/realms/active?{query}",
      "requestSchema": "schema.json",
      "responseSchema": "schema.json",
      "timeout": 0,
      "sendEmpty": false,
      "requestDatatype": "JSON",
      "responseDatatype": "JSON",
      "headers": {},
      "responseObjects": [
        {
          "type": "default",
          "key": "",
          "mockFile": ""
        }
      ]
    }
  ]
}