[
  {
    "id": "string",
    "source": "string",
    "name": "string",
    "description": "string",
    "privileges": [
      "string",
      "string",
      "string",
      "string",
      "string",
      "string"
    ],
    "roles": [
      "string"
    ]
  }
]