{
  "id": 5,
  "url": "string",
  "rack": {
    "id": 7,
    "url": "string",
    "name": "string",
    "display_name": "string",
    "device_count": 6
  },
  "units": [
    4,
    4,
    4,
    2
  ],
  "created": "string",
  "user": {
    "id": 7,
    "url": "string",
    "username": "string"
  },
  "tenant": {
    "id": 1,
    "url": "string",
    "name": "string",
    "slug": "string"
  },
  "description": "string",
  "tags": [
    {
      "id": 6,
      "url": "string",
      "name": "string",
      "slug": "string",
      "color": "string"
    },
    {
      "id": 3,
      "url": "string",
      "name": "string",
      "slug": "string",
      "color": "string"
    },
    {
      "id": 8,
      "url": "string",
      "name": "string",
      "slug": "string",
      "color": "string"
    },
    {
      "id": 5,
      "url": "string",
      "name": "string",
      "slug": "string",
      "color": "string"
    },
    {
      "id": 7,
      "url": "string",
      "name": "string",
      "slug": "string",
      "color": "string"
    },
    {
      "id": 8,
      "url": "string",
      "name": "string",
      "slug": "string",
      "color": "string"
    },
    {
      "id": 2,
      "url": "string",
      "name": "string",
      "slug": "string",
      "color": "string"
    },
    {
      "id": 9,
      "url": "string",
      "name": "string",
      "slug": "string",
      "color": "string"
    },
    {
      "id": 9,
      "url": "string",
      "name": "string",
      "slug": "string",
      "color": "string"
    }
  ],
  "custom_fields": {}
}