{
  "id": 3,
  "url": "string",
  "device_type": {
    "id": 1,
    "url": "string",
    "manufacturer": {
      "id": 6,
      "url": "string",
      "name": "string",
      "slug": "string",
      "devicetype_count": 6
    },
    "model": "string",
    "slug": "string",
    "display_name": "string",
    "device_count": 4
  },
  "name": "string",
  "label": "string",
  "description": "string"
}