{
  "id": 6,
  "url": "string",
  "device": {
    "id": 3,
    "url": "string",
    "name": "string",
    "display_name": "string"
  },
  "name": "string",
  "label": "string",
  "type": {
    "label": "Other",
    "value": "db-25"
  },
  "description": "string",
  "cable": {
    "id": 7,
    "url": "string",
    "label": "string"
  },
  "cable_peer": {},
  "cable_peer_type": "string",
  "connected_endpoint": {},
  "connected_endpoint_type": "string",
  "connected_endpoint_reachable": true,
  "tags": [
    {
      "id": 7,
      "url": "string",
      "name": "string",
      "slug": "string",
      "color": "string"
    },
    {
      "id": 5,
      "url": "string",
      "name": "string",
      "slug": "string",
      "color": "string"
    },
    {
      "id": 5,
      "url": "string",
      "name": "string",
      "slug": "string",
      "color": "string"
    },
    {
      "id": 7,
      "url": "string",
      "name": "string",
      "slug": "string",
      "color": "string"
    }
  ]
}