{
  "id": 2,
  "url": "string",
  "name": "string",
  "slug": "string",
  "parent": {
    "id": 1,
    "url": "string",
    "name": "string",
    "slug": "string",
    "site_count": 6,
    "_depth": 7
  },
  "description": "string",
  "site_count": 9,
  "_depth": 3
}