{
  "count": 5,
  "next": "string",
  "previous": "string",
  "results": [
    {
      "id": 6,
      "url": "string",
      "cid": "string",
      "provider": {
        "id": 5,
        "url": "string",
        "name": "string",
        "slug": "string",
        "circuit_count": 8
      },
      "type": {
        "id": 6,
        "url": "string",
        "name": "string",
        "slug": "string",
        "circuit_count": 7
      },
      "status": {
        "label": "Planned",
        "value": "provisioning"
      },
      "tenant": {
        "id": 7,
        "url": "string",
        "name": "string",
        "slug": "string"
      },
      "install_date": "string",
      "commit_rate": 5,
      "description": "string",
      "termination_a": {
        "id": 8,
        "url": "string",
        "site": {
          "id": 2,
          "url": "string",
          "name": "string",
          "slug": "string"
        },
        "connected_endpoint": {
          "id": 8,
          "url": "string",
          "device": {
            "id": 9,
            "url": "string",
            "name": "string",
            "display_name": "string"
          },
          "name": "string",
          "cable": 5
        },
        "port_speed": 3,
        "upstream_speed": 6,
        "xconnect_id": "string"
      },
      "termination_z": {
        "id": 5,
        "url": "string",
        "site": {
          "id": 2,
          "url": "string",
          "name": "string",
          "slug": "string"
        },
        "connected_endpoint": {
          "id": 6,
          "url": "string",
          "device": {
            "id": 5,
            "url": "string",
            "name": "string",
            "display_name": "string"
          },
          "name": "string",
          "cable": 3
        },
        "port_speed": 6,
        "upstream_speed": 7,
        "xconnect_id": "string"
      },
      "comments": "string",
      "tags": [
        {
          "id": 8,
          "url": "string",
          "name": "string",
          "slug": "string",
          "color": "string"
        },
        {
          "id": 2,
          "url": "string",
          "name": "string",
          "slug": "string",
          "color": "string"
        },
        {
          "id": 1,
          "url": "string",
          "name": "string",
          "slug": "string",
          "color": "string"
        },
        {
          "id": 9,
          "url": "string",
          "name": "string",
          "slug": "string",
          "color": "string"
        }
      ],
      "custom_fields": {},
      "created": "string",
      "last_updated": "string"
    },
    {
      "id": 5,
      "url": "string",
      "cid": "string",
      "provider": {
        "id": 7,
        "url": "string",
        "name": "string",
        "slug": "string",
        "circuit_count": 6
      },
      "type": {
        "id": 9,
        "url": "string",
        "name": "string",
        "slug": "string",
        "circuit_count": 5
      },
      "status": {
        "label": "Provisioning",
        "value": "active"
      },
      "tenant": {
        "id": 6,
        "url": "string",
        "name": "string",
        "slug": "string"
      },
      "install_date": "string",
      "commit_rate": 6,
      "description": "string",
      "termination_a": {
        "id": 9,
        "url": "string",
        "site": {
          "id": 6,
          "url": "string",
          "name": "string",
          "slug": "string"
        },
        "connected_endpoint": {
          "id": 5,
          "url": "string",
          "device": {
            "id": 7,
            "url": "string",
            "name": "string",
            "display_name": "string"
          },
          "name": "string",
          "cable": 4
        },
        "port_speed": 6,
        "upstream_speed": 10,
        "xconnect_id": "string"
      },
      "termination_z": {
        "id": 5,
        "url": "string",
        "site": {
          "id": 10,
          "url": "string",
          "name": "string",
          "slug": "string"
        },
        "connected_endpoint": {
          "id": 6,
          "url": "string",
          "device": {
            "id": 4,
            "url": "string",
            "name": "string",
            "display_name": "string"
          },
          "name": "string",
          "cable": 3
        },
        "port_speed": 4,
        "upstream_speed": 5,
        "xconnect_id": "string"
      },
      "comments": "string",
      "tags": [
        {
          "id": 2,
          "url": "string",
          "name": "string",
          "slug": "string",
          "color": "string"
        }
      ],
      "custom_fields": {},
      "created": "string",
      "last_updated": "string"
    },
    {
      "id": 3,
      "url": "string",
      "cid": "string",
      "provider": {
        "id": 6,
        "url": "string",
        "name": "string",
        "slug": "string",
        "circuit_count": 7
      },
      "type": {
        "id": 1,
        "url": "string",
        "name": "string",
        "slug": "string",
        "circuit_count": 8
      },
      "status": {
        "label": "Planned",
        "value": "offline"
      },
      "tenant": {
        "id": 5,
        "url": "string",
        "name": "string",
        "slug": "string"
      },
      "install_date": "string",
      "commit_rate": 6,
      "description": "string",
      "termination_a": {
        "id": 3,
        "url": "string",
        "site": {
          "id": 7,
          "url": "string",
          "name": "string",
          "slug": "string"
        },
        "connected_endpoint": {
          "id": 6,
          "url": "string",
          "device": {
            "id": 9,
            "url": "string",
            "name": "string",
            "display_name": "string"
          },
          "name": "string",
          "cable": 4
        },
        "port_speed": 5,
        "upstream_speed": 5,
        "xconnect_id": "string"
      },
      "termination_z": {
        "id": 2,
        "url": "string",
        "site": {
          "id": 5,
          "url": "string",
          "name": "string",
          "slug": "string"
        },
        "connected_endpoint": {
          "id": 2,
          "url": "string",
          "device": {
            "id": 4,
            "url": "string",
            "name": "string",
            "display_name": "string"
          },
          "name": "string",
          "cable": 7
        },
        "port_speed": 3,
        "upstream_speed": 7,
        "xconnect_id": "string"
      },
      "comments": "string",
      "tags": [
        {
          "id": 8,
          "url": "string",
          "name": "string",
          "slug": "string",
          "color": "string"
        },
        {
          "id": 4,
          "url": "string",
          "name": "string",
          "slug": "string",
          "color": "string"
        },
        {
          "id": 7,
          "url": "string",
          "name": "string",
          "slug": "string",
          "color": "string"
        },
        {
          "id": 4,
          "url": "string",
          "name": "string",
          "slug": "string",
          "color": "string"
        },
        {
          "id": 4,
          "url": "string",
          "name": "string",
          "slug": "string",
          "color": "string"
        },
        {
          "id": 3,
          "url": "string",
          "name": "string",
          "slug": "string",
          "color": "string"
        },
        {
          "id": 3,
          "url": "string",
          "name": "string",
          "slug": "string",
          "color": "string"
        }
      ],
      "custom_fields": {},
      "created": "string",
      "last_updated": "string"
    },
    {
      "id": 8,
      "url": "string",
      "cid": "string",
      "provider": {
        "id": 8,
        "url": "string",
        "name": "string",
        "slug": "string",
        "circuit_count": 7
      },
      "type": {
        "id": 7,
        "url": "string",
        "name": "string",
        "slug": "string",
        "circuit_count": 1
      },
      "status": {
        "label": "Decommissioned",
        "value": "planned"
      },
      "tenant": {
        "id": 1,
        "url": "string",
        "name": "string",
        "slug": "string"
      },
      "install_date": "string",
      "commit_rate": 9,
      "description": "string",
      "termination_a": {
        "id": 5,
        "url": "string",
        "site": {
          "id": 4,
          "url": "string",
          "name": "string",
          "slug": "string"
        },
        "connected_endpoint": {
          "id": 1,
          "url": "string",
          "device": {
            "id": 5,
            "url": "string",
            "name": "string",
            "display_name": "string"
          },
          "name": "string",
          "cable": 3
        },
        "port_speed": 8,
        "upstream_speed": 5,
        "xconnect_id": "string"
      },
      "termination_z": {
        "id": 5,
        "url": "string",
        "site": {
          "id": 7,
          "url": "string",
          "name": "string",
          "slug": "string"
        },
        "connected_endpoint": {
          "id": 1,
          "url": "string",
          "device": {
            "id": 5,
            "url": "string",
            "name": "string",
            "display_name": "string"
          },
          "name": "string",
          "cable": 2
        },
        "port_speed": 6,
        "upstream_speed": 6,
        "xconnect_id": "string"
      },
      "comments": "string",
      "tags": [
        {
          "id": 8,
          "url": "string",
          "name": "string",
          "slug": "string",
          "color": "string"
        },
        {
          "id": 5,
          "url": "string",
          "name": "string",
          "slug": "string",
          "color": "string"
        },
        {
          "id": 5,
          "url": "string",
          "name": "string",
          "slug": "string",
          "color": "string"
        },
        {
          "id": 5,
          "url": "string",
          "name": "string",
          "slug": "string",
          "color": "string"
        },
        {
          "id": 6,
          "url": "string",
          "name": "string",
          "slug": "string",
          "color": "string"
        },
        {
          "id": 7,
          "url": "string",
          "name": "string",
          "slug": "string",
          "color": "string"
        }
      ],
      "custom_fields": {},
      "created": "string",
      "last_updated": "string"
    }
  ]
}