{
  "id": 8,
  "url": "string",
  "device_type": {
    "id": 6,
    "url": "string",
    "manufacturer": {
      "id": 9,
      "url": "string",
      "name": "string",
      "slug": "string",
      "devicetype_count": 1
    },
    "model": "string",
    "slug": "string",
    "display_name": "string",
    "device_count": 3
  },
  "name": "string",
  "label": "string",
  "type": {
    "label": "RJ-12",
    "value": "usb-mini-b"
  },
  "description": "string"
}