{
  "count": 3,
  "next": "string",
  "previous": "string",
  "results": [
    {
      "id": 2,
      "url": "string",
      "created": "string",
      "completed": "string",
      "name": "string",
      "obj_type": "string",
      "status": {
        "label": "Completed",
        "value": "completed"
      },
      "user": {
        "id": 1,
        "url": "string",
        "username": "string"
      },
      "data": "string",
      "job_id": "string"
    },
    {
      "id": 8,
      "url": "string",
      "created": "string",
      "completed": "string",
      "name": "string",
      "obj_type": "string",
      "status": {
        "label": "Pending",
        "value": "running"
      },
      "user": {
        "id": 9,
        "url": "string",
        "username": "string"
      },
      "data": "string",
      "job_id": "string"
    }
  ]
}