{
  "id": 6,
  "url": "string",
  "termination_a_type": "string",
  "termination_a_id": 1,
  "termination_a": {},
  "termination_b_type": "string",
  "termination_b_id": 5,
  "termination_b": {},
  "type": "cat7a",
  "status": {
    "label": "Decommissioning",
    "value": "connected"
  },
  "label": "string",
  "color": "string",
  "length": 3,
  "length_unit": {
    "label": "Inches",
    "value": "cm"
  },
  "tags": [
    {
      "id": 5,
      "url": "string",
      "name": "string",
      "slug": "string",
      "color": "string"
    },
    {
      "id": 2,
      "url": "string",
      "name": "string",
      "slug": "string",
      "color": "string"
    }
  ],
  "custom_fields": {}
}