{
  "id": 1,
  "url": "string",
  "name": "string",
  "slug": "string",
  "asn": 5,
  "account": "string",
  "portal_url": "string",
  "noc_contact": "string",
  "admin_contact": "string",
  "comments": "string",
  "tags": [
    {
      "id": 3,
      "url": "string",
      "name": "string",
      "slug": "string",
      "color": "string"
    },
    {
      "id": 3,
      "url": "string",
      "name": "string",
      "slug": "string",
      "color": "string"
    },
    {
      "id": 8,
      "url": "string",
      "name": "string",
      "slug": "string",
      "color": "string"
    },
    {
      "id": 3,
      "url": "string",
      "name": "string",
      "slug": "string",
      "color": "string"
    }
  ],
  "custom_fields": {},
  "created": "string",
  "last_updated": "string",
  "circuit_count": 7
}