{
  "id": 8,
  "url": "string",
  "device": {
    "id": 9,
    "url": "string",
    "name": "string",
    "display_name": "string"
  },
  "name": "string",
  "label": "string",
  "type": {
    "label": "IEEE 802.11a",
    "value": "infiniband-hdr"
  },
  "enabled": true,
  "lag": {
    "id": 6,
    "url": "string",
    "device": {
      "id": 6,
      "url": "string",
      "name": "string",
      "display_name": "string"
    },
    "name": "string",
    "cable": 8
  },
  "mtu": 2,
  "mac_address": "string",
  "mgmt_only": true,
  "description": "string",
  "mode": {
    "label": "Access",
    "value": "access"
  },
  "untagged_vlan": {
    "id": 5,
    "url": "string",
    "vid": 10,
    "name": "string",
    "display_name": "string"
  },
  "tagged_vlans": [
    {
      "id": 2,
      "url": "string",
      "vid": 6,
      "name": "string",
      "display_name": "string"
    },
    {
      "id": 1,
      "url": "string",
      "vid": 6,
      "name": "string",
      "display_name": "string"
    }
  ],
  "cable": {
    "id": 5,
    "url": "string",
    "label": "string"
  },
  "cable_peer": {},
  "cable_peer_type": "string",
  "connected_endpoint": {},
  "connected_endpoint_type": "string",
  "connected_endpoint_reachable": true,
  "tags": [
    {
      "id": 7,
      "url": "string",
      "name": "string",
      "slug": "string",
      "color": "string"
    },
    {
      "id": 3,
      "url": "string",
      "name": "string",
      "slug": "string",
      "color": "string"
    },
    {
      "id": 7,
      "url": "string",
      "name": "string",
      "slug": "string",
      "color": "string"
    },
    {
      "id": 8,
      "url": "string",
      "name": "string",
      "slug": "string",
      "color": "string"
    },
    {
      "id": 3,
      "url": "string",
      "name": "string",
      "slug": "string",
      "color": "string"
    },
    {
      "id": 10,
      "url": "string",
      "name": "string",
      "slug": "string",
      "color": "string"
    }
  ],
  "count_ipaddresses": 8
}