{
  "id": 4,
  "url": "string",
  "device": {
    "id": 5,
    "url": "string",
    "name": "string",
    "display_name": "string"
  },
  "virtual_machine": {
    "id": 6,
    "url": "string",
    "name": "string"
  },
  "name": "string",
  "ports": [
    8,
    5,
    3,
    10,
    8,
    2,
    3,
    5,
    1,
    5
  ],
  "protocol": {
    "label": "TCP",
    "value": "udp"
  },
  "ipaddresses": [
    {
      "id": 10,
      "url": "string",
      "family": 1,
      "address": "string"
    },
    {
      "id": 9,
      "url": "string",
      "family": 3,
      "address": "string"
    },
    {
      "id": 4,
      "url": "string",
      "family": 5,
      "address": "string"
    },
    {
      "id": 6,
      "url": "string",
      "family": 5,
      "address": "string"
    }
  ],
  "description": "string",
  "tags": [
    {
      "id": 6,
      "url": "string",
      "name": "string",
      "slug": "string",
      "color": "string"
    },
    {
      "id": 6,
      "url": "string",
      "name": "string",
      "slug": "string",
      "color": "string"
    },
    {
      "id": 6,
      "url": "string",
      "name": "string",
      "slug": "string",
      "color": "string"
    },
    {
      "id": 2,
      "url": "string",
      "name": "string",
      "slug": "string",
      "color": "string"
    }
  ],
  "custom_fields": {},
  "created": "string",
  "last_updated": "string"
}