{
  "id": 7,
  "url": "string",
  "manufacturer": {
    "id": 1,
    "url": "string",
    "name": "string",
    "slug": "string",
    "devicetype_count": 9
  },
  "model": "string",
  "slug": "string",
  "display_name": "string",
  "part_number": "string",
  "u_height": 1,
  "is_full_depth": false,
  "subdevice_role": {
    "label": "Child",
    "value": "child"
  },
  "front_image": "string",
  "rear_image": "string",
  "comments": "string",
  "tags": [
    {
      "id": 1,
      "url": "string",
      "name": "string",
      "slug": "string",
      "color": "string"
    },
    {
      "id": 2,
      "url": "string",
      "name": "string",
      "slug": "string",
      "color": "string"
    }
  ],
  "custom_fields": {},
  "created": "string",
  "last_updated": "string",
  "device_count": 9
}