{
  "id": 10,
  "url": "string",
  "name": "string",
  "rd": "string",
  "tenant": {
    "id": 3,
    "url": "string",
    "name": "string",
    "slug": "string"
  },
  "enforce_unique": true,
  "description": "string",
  "import_targets": [
    {
      "id": 3,
      "url": "string",
      "name": "string"
    },
    {
      "id": 6,
      "url": "string",
      "name": "string"
    },
    {
      "id": 7,
      "url": "string",
      "name": "string"
    },
    {
      "id": 6,
      "url": "string",
      "name": "string"
    },
    {
      "id": 6,
      "url": "string",
      "name": "string"
    },
    {
      "id": 2,
      "url": "string",
      "name": "string"
    }
  ],
  "export_targets": [
    {
      "id": 1,
      "url": "string",
      "name": "string"
    },
    {
      "id": 3,
      "url": "string",
      "name": "string"
    },
    {
      "id": 9,
      "url": "string",
      "name": "string"
    },
    {
      "id": 6,
      "url": "string",
      "name": "string"
    },
    {
      "id": 7,
      "url": "string",
      "name": "string"
    },
    {
      "id": 1,
      "url": "string",
      "name": "string"
    },
    {
      "id": 6,
      "url": "string",
      "name": "string"
    },
    {
      "id": 1,
      "url": "string",
      "name": "string"
    },
    {
      "id": 6,
      "url": "string",
      "name": "string"
    },
    {
      "id": 6,
      "url": "string",
      "name": "string"
    }
  ],
  "tags": [
    {
      "id": 9,
      "url": "string",
      "name": "string",
      "slug": "string",
      "color": "string"
    }
  ],
  "display_name": "string",
  "custom_fields": {},
  "created": "string",
  "last_updated": "string",
  "ipaddress_count": 5,
  "prefix_count": 4
}