{
  "id": 9,
  "url": "string",
  "rack": {
    "id": 4,
    "url": "string",
    "name": "string",
    "display_name": "string",
    "device_count": 5
  },
  "units": [
    5,
    1
  ],
  "created": "string",
  "user": {
    "id": 7,
    "url": "string",
    "username": "string"
  },
  "tenant": {
    "id": 9,
    "url": "string",
    "name": "string",
    "slug": "string"
  },
  "description": "string",
  "tags": [
    {
      "id": 3,
      "url": "string",
      "name": "string",
      "slug": "string",
      "color": "string"
    }
  ],
  "custom_fields": {}
}