{
  "id": 3,
  "url": "string",
  "site": {
    "id": 5,
    "url": "string",
    "name": "string",
    "slug": "string"
  },
  "group": {
    "id": 4,
    "url": "string",
    "name": "string",
    "slug": "string",
    "vlan_count": 5
  },
  "vid": 3,
  "name": "string",
  "tenant": {
    "id": 4,
    "url": "string",
    "name": "string",
    "slug": "string"
  },
  "status": {
    "label": "Deprecated",
    "value": "reserved"
  },
  "role": {
    "id": 10,
    "url": "string",
    "name": "string",
    "slug": "string",
    "prefix_count": 7,
    "vlan_count": 2
  },
  "description": "string",
  "tags": [
    {
      "id": 6,
      "url": "string",
      "name": "string",
      "slug": "string",
      "color": "string"
    },
    {
      "id": 4,
      "url": "string",
      "name": "string",
      "slug": "string",
      "color": "string"
    },
    {
      "id": 6,
      "url": "string",
      "name": "string",
      "slug": "string",
      "color": "string"
    },
    {
      "id": 7,
      "url": "string",
      "name": "string",
      "slug": "string",
      "color": "string"
    }
  ],
  "display_name": "string",
  "custom_fields": {},
  "created": "string",
  "last_updated": "string",
  "prefix_count": 3
}