{
  "id": 7,
  "url": "string",
  "name": "string",
  "slug": "string",
  "status": {
    "label": "Retired",
    "value": "planned"
  },
  "region": {
    "id": 10,
    "url": "string",
    "name": "string",
    "slug": "string",
    "site_count": 7,
    "_depth": 9
  },
  "tenant": {
    "id": 5,
    "url": "string",
    "name": "string",
    "slug": "string"
  },
  "facility": "string",
  "asn": 6,
  "time_zone": "string",
  "description": "string",
  "physical_address": "string",
  "shipping_address": "string",
  "latitude": "string",
  "longitude": "string",
  "contact_name": "string",
  "contact_phone": "string",
  "contact_email": "string",
  "comments": "string",
  "tags": [
    {
      "id": 10,
      "url": "string",
      "name": "string",
      "slug": "string",
      "color": "string"
    }
  ],
  "custom_fields": {},
  "created": "string",
  "last_updated": "string",
  "circuit_count": 4,
  "device_count": 10,
  "prefix_count": 3,
  "rack_count": 9,
  "virtualmachine_count": 6,
  "vlan_count": 7
}