[
  {
    "family": 4,
    "address": "string",
    "vrf": {
      "id": 4,
      "url": "string",
      "name": "string",
      "rd": "string",
      "display_name": "string",
      "prefix_count": 10
    }
  },
  {
    "family": 3,
    "address": "string",
    "vrf": {
      "id": 1,
      "url": "string",
      "name": "string",
      "rd": "string",
      "display_name": "string",
      "prefix_count": 1
    }
  }
]