{
  "id": 10,
  "url": "string",
  "name": "string",
  "slug": "string",
  "site": {
    "id": 8,
    "url": "string",
    "name": "string",
    "slug": "string"
  },
  "description": "string",
  "vlan_count": 5
}