{
  "id": 6,
  "url": "string",
  "name": "string",
  "status": {
    "label": "Staged",
    "value": "planned"
  },
  "site": {
    "id": 5,
    "url": "string",
    "name": "string",
    "slug": "string"
  },
  "cluster": {
    "id": 2,
    "url": "string",
    "name": "string",
    "virtualmachine_count": 9
  },
  "role": {
    "id": 6,
    "url": "string",
    "name": "string",
    "slug": "string",
    "device_count": 7,
    "virtualmachine_count": 10
  },
  "tenant": {
    "id": 7,
    "url": "string",
    "name": "string",
    "slug": "string"
  },
  "platform": {
    "id": 7,
    "url": "string",
    "name": "string",
    "slug": "string",
    "device_count": 7,
    "virtualmachine_count": 9
  },
  "primary_ip": {
    "id": 3,
    "url": "string",
    "family": 2,
    "address": "string"
  },
  "primary_ip4": {
    "id": 5,
    "url": "string",
    "family": 4,
    "address": "string"
  },
  "primary_ip6": {
    "id": 6,
    "url": "string",
    "family": 3,
    "address": "string"
  },
  "vcpus": 7,
  "memory": 7,
  "disk": 5,
  "comments": "string",
  "local_context_data": "string",
  "tags": [
    {
      "id": 5,
      "url": "string",
      "name": "string",
      "slug": "string",
      "color": "string"
    },
    {
      "id": 3,
      "url": "string",
      "name": "string",
      "slug": "string",
      "color": "string"
    },
    {
      "id": 7,
      "url": "string",
      "name": "string",
      "slug": "string",
      "color": "string"
    }
  ],
  "custom_fields": {},
  "config_context": {},
  "created": "string",
  "last_updated": "string"
}