{
  "count": 1,
  "next": "string",
  "previous": "string",
  "results": [
    {
      "id": 3,
      "url": "string",
      "site": {
        "id": 1,
        "url": "string",
        "name": "string",
        "slug": "string"
      },
      "group": {
        "id": 2,
        "url": "string",
        "name": "string",
        "slug": "string",
        "vlan_count": 8
      },
      "vid": 3,
      "name": "string",
      "tenant": {
        "id": 4,
        "url": "string",
        "name": "string",
        "slug": "string"
      },
      "status": {
        "label": "Reserved",
        "value": "deprecated"
      },
      "role": {
        "id": 3,
        "url": "string",
        "name": "string",
        "slug": "string",
        "prefix_count": 9,
        "vlan_count": 4
      },
      "description": "string",
      "tags": [
        {
          "id": 4,
          "url": "string",
          "name": "string",
          "slug": "string",
          "color": "string"
        },
        {
          "id": 10,
          "url": "string",
          "name": "string",
          "slug": "string",
          "color": "string"
        },
        {
          "id": 4,
          "url": "string",
          "name": "string",
          "slug": "string",
          "color": "string"
        },
        {
          "id": 8,
          "url": "string",
          "name": "string",
          "slug": "string",
          "color": "string"
        },
        {
          "id": 8,
          "url": "string",
          "name": "string",
          "slug": "string",
          "color": "string"
        },
        {
          "id": 6,
          "url": "string",
          "name": "string",
          "slug": "string",
          "color": "string"
        },
        {
          "id": 3,
          "url": "string",
          "name": "string",
          "slug": "string",
          "color": "string"
        },
        {
          "id": 8,
          "url": "string",
          "name": "string",
          "slug": "string",
          "color": "string"
        },
        {
          "id": 7,
          "url": "string",
          "name": "string",
          "slug": "string",
          "color": "string"
        }
      ],
      "display_name": "string",
      "custom_fields": {},
      "created": "string",
      "last_updated": "string",
      "prefix_count": 1
    },
    {
      "id": 5,
      "url": "string",
      "site": {
        "id": 6,
        "url": "string",
        "name": "string",
        "slug": "string"
      },
      "group": {
        "id": 7,
        "url": "string",
        "name": "string",
        "slug": "string",
        "vlan_count": 7
      },
      "vid": 6,
      "name": "string",
      "tenant": {
        "id": 3,
        "url": "string",
        "name": "string",
        "slug": "string"
      },
      "status": {
        "label": "Reserved",
        "value": "reserved"
      },
      "role": {
        "id": 3,
        "url": "string",
        "name": "string",
        "slug": "string",
        "prefix_count": 5,
        "vlan_count": 2
      },
      "description": "string",
      "tags": [
        {
          "id": 2,
          "url": "string",
          "name": "string",
          "slug": "string",
          "color": "string"
        }
      ],
      "display_name": "string",
      "custom_fields": {},
      "created": "string",
      "last_updated": "string",
      "prefix_count": 6
    },
    {
      "id": 10,
      "url": "string",
      "site": {
        "id": 3,
        "url": "string",
        "name": "string",
        "slug": "string"
      },
      "group": {
        "id": 8,
        "url": "string",
        "name": "string",
        "slug": "string",
        "vlan_count": 6
      },
      "vid": 1,
      "name": "string",
      "tenant": {
        "id": 6,
        "url": "string",
        "name": "string",
        "slug": "string"
      },
      "status": {
        "label": "Active",
        "value": "deprecated"
      },
      "role": {
        "id": 8,
        "url": "string",
        "name": "string",
        "slug": "string",
        "prefix_count": 9,
        "vlan_count": 10
      },
      "description": "string",
      "tags": [
        {
          "id": 2,
          "url": "string",
          "name": "string",
          "slug": "string",
          "color": "string"
        }
      ],
      "display_name": "string",
      "custom_fields": {},
      "created": "string",
      "last_updated": "string",
      "prefix_count": 7
    },
    {
      "id": 1,
      "url": "string",
      "site": {
        "id": 2,
        "url": "string",
        "name": "string",
        "slug": "string"
      },
      "group": {
        "id": 6,
        "url": "string",
        "name": "string",
        "slug": "string",
        "vlan_count": 9
      },
      "vid": 2,
      "name": "string",
      "tenant": {
        "id": 4,
        "url": "string",
        "name": "string",
        "slug": "string"
      },
      "status": {
        "label": "Active",
        "value": "deprecated"
      },
      "role": {
        "id": 4,
        "url": "string",
        "name": "string",
        "slug": "string",
        "prefix_count": 7,
        "vlan_count": 1
      },
      "description": "string",
      "tags": [
        {
          "id": 2,
          "url": "string",
          "name": "string",
          "slug": "string",
          "color": "string"
        }
      ],
      "display_name": "string",
      "custom_fields": {},
      "created": "string",
      "last_updated": "string",
      "prefix_count": 6
    }
  ]
}