{
  "count": 8,
  "next": "string",
  "previous": "string",
  "results": [
    {
      "id": 3,
      "url": "string",
      "name": "string",
      "slug": "string",
      "description": "string",
      "devicetype_count": 6,
      "inventoryitem_count": 9,
      "platform_count": 5
    },
    {
      "id": 5,
      "url": "string",
      "name": "string",
      "slug": "string",
      "description": "string",
      "devicetype_count": 3,
      "inventoryitem_count": 4,
      "platform_count": 10
    },
    {
      "id": 6,
      "url": "string",
      "name": "string",
      "slug": "string",
      "description": "string",
      "devicetype_count": 8,
      "inventoryitem_count": 8,
      "platform_count": 3
    }
  ]
}