{
  "id": 4,
  "url": "string",
  "name": "string",
  "weight": 1,
  "description": "string",
  "is_active": false,
  "regions": [
    {
      "id": 6,
      "url": "string",
      "name": "string",
      "slug": "string",
      "site_count": 7,
      "_depth": 2
    }
  ],
  "sites": [
    {
      "id": 8,
      "url": "string",
      "name": "string",
      "slug": "string"
    },
    {
      "id": 9,
      "url": "string",
      "name": "string",
      "slug": "string"
    },
    {
      "id": 1,
      "url": "string",
      "name": "string",
      "slug": "string"
    },
    {
      "id": 6,
      "url": "string",
      "name": "string",
      "slug": "string"
    },
    {
      "id": 7,
      "url": "string",
      "name": "string",
      "slug": "string"
    },
    {
      "id": 3,
      "url": "string",
      "name": "string",
      "slug": "string"
    }
  ],
  "roles": [
    {
      "id": 1,
      "url": "string",
      "name": "string",
      "slug": "string",
      "device_count": 9,
      "virtualmachine_count": 10
    },
    {
      "id": 9,
      "url": "string",
      "name": "string",
      "slug": "string",
      "device_count": 6,
      "virtualmachine_count": 4
    },
    {
      "id": 3,
      "url": "string",
      "name": "string",
      "slug": "string",
      "device_count": 5,
      "virtualmachine_count": 9
    },
    {
      "id": 1,
      "url": "string",
      "name": "string",
      "slug": "string",
      "device_count": 7,
      "virtualmachine_count": 6
    }
  ],
  "platforms": [
    {
      "id": 9,
      "url": "string",
      "name": "string",
      "slug": "string",
      "device_count": 4,
      "virtualmachine_count": 6
    },
    {
      "id": 1,
      "url": "string",
      "name": "string",
      "slug": "string",
      "device_count": 6,
      "virtualmachine_count": 3
    },
    {
      "id": 6,
      "url": "string",
      "name": "string",
      "slug": "string",
      "device_count": 5,
      "virtualmachine_count": 9
    }
  ],
  "cluster_groups": [
    {
      "id": 1,
      "url": "string",
      "name": "string",
      "slug": "string",
      "cluster_count": 3
    },
    {
      "id": 3,
      "url": "string",
      "name": "string",
      "slug": "string",
      "cluster_count": 8
    },
    {
      "id": 8,
      "url": "string",
      "name": "string",
      "slug": "string",
      "cluster_count": 9
    }
  ],
  "clusters": [
    {
      "id": 6,
      "url": "string",
      "name": "string",
      "virtualmachine_count": 1
    },
    {
      "id": 10,
      "url": "string",
      "name": "string",
      "virtualmachine_count": 8
    },
    {
      "id": 5,
      "url": "string",
      "name": "string",
      "virtualmachine_count": 8
    },
    {
      "id": 1,
      "url": "string",
      "name": "string",
      "virtualmachine_count": 4
    },
    {
      "id": 4,
      "url": "string",
      "name": "string",
      "virtualmachine_count": 5
    },
    {
      "id": 4,
      "url": "string",
      "name": "string",
      "virtualmachine_count": 6
    }
  ],
  "tenant_groups": [
    {
      "id": 3,
      "url": "string",
      "name": "string",
      "slug": "string",
      "tenant_count": 2,
      "_depth": 9
    },
    {
      "id": 10,
      "url": "string",
      "name": "string",
      "slug": "string",
      "tenant_count": 10,
      "_depth": 3
    },
    {
      "id": 5,
      "url": "string",
      "name": "string",
      "slug": "string",
      "tenant_count": 6,
      "_depth": 5
    },
    {
      "id": 8,
      "url": "string",
      "name": "string",
      "slug": "string",
      "tenant_count": 8,
      "_depth": 3
    },
    {
      "id": 2,
      "url": "string",
      "name": "string",
      "slug": "string",
      "tenant_count": 7,
      "_depth": 1
    }
  ],
  "tenants": [
    {
      "id": 2,
      "url": "string",
      "name": "string",
      "slug": "string"
    }
  ],
  "tags": [
    "string",
    "string",
    "string",
    "string",
    "string",
    "string",
    "string",
    "string"
  ],
  "data": "string",
  "created": "string",
  "last_updated": "string"
}