{
  "id": 4,
  "url": "string",
  "circuit": {
    "id": 8,
    "url": "string",
    "cid": "string"
  },
  "term_side": "Z",
  "site": {
    "id": 2,
    "url": "string",
    "name": "string",
    "slug": "string"
  },
  "port_speed": 2,
  "upstream_speed": 2,
  "xconnect_id": "string",
  "pp_info": "string",
  "description": "string",
  "cable": {
    "id": 7,
    "url": "string",
    "label": "string"
  },
  "cable_peer": {},
  "cable_peer_type": "string",
  "connected_endpoint": {},
  "connected_endpoint_type": "string",
  "connected_endpoint_reachable": false
}