{
  "id": 6,
  "url": "string",
  "device": {
    "id": 3,
    "url": "string",
    "name": "string",
    "display_name": "string"
  },
  "parent": 4,
  "name": "string",
  "label": "string",
  "manufacturer": {
    "id": 8,
    "url": "string",
    "name": "string",
    "slug": "string",
    "devicetype_count": 9
  },
  "part_id": "string",
  "serial": "string",
  "asset_tag": "string",
  "discovered": true,
  "description": "string",
  "tags": [
    {
      "id": 9,
      "url": "string",
      "name": "string",
      "slug": "string",
      "color": "string"
    },
    {
      "id": 1,
      "url": "string",
      "name": "string",
      "slug": "string",
      "color": "string"
    },
    {
      "id": 5,
      "url": "string",
      "name": "string",
      "slug": "string",
      "color": "string"
    },
    {
      "id": 8,
      "url": "string",
      "name": "string",
      "slug": "string",
      "color": "string"
    },
    {
      "id": 5,
      "url": "string",
      "name": "string",
      "slug": "string",
      "color": "string"
    },
    {
      "id": 8,
      "url": "string",
      "name": "string",
      "slug": "string",
      "color": "string"
    },
    {
      "id": 1,
      "url": "string",
      "name": "string",
      "slug": "string",
      "color": "string"
    },
    {
      "id": 8,
      "url": "string",
      "name": "string",
      "slug": "string",
      "color": "string"
    }
  ],
  "_depth": 3
}